You are viewing a plain text version of this content. The canonical link for it is here.
Posted to dev@thrift.apache.org by Apache Jenkins Server <je...@builds.apache.org> on 2014/07/08 23:54:18 UTC
Build failed in Jenkins: Thrift #1207
See <https://builds.apache.org/job/Thrift/1207/changes>
Changes:
[roger] THRIFT-2614 - C++ Library - TNonblockingServer.cpp MSVC warning removed
------------------------------------------
[...truncated 1592 lines...]
[WARNING:<https://builds.apache.org/job/Thrift/ws/test/DebugProtoTest.thrift>:358] No field key specified for field4, resulting protocol may have conflicts or not be backwards compatible!
[WARNING:<https://builds.apache.org/job/Thrift/ws/test/DebugProtoTest.thrift>:359] No field key specified for field5, resulting protocol may have conflicts or not be backwards compatible!
[WARNING:<https://builds.apache.org/job/Thrift/ws/test/DebugProtoTest.thrift>:360] No field key specified for field6, resulting protocol may have conflicts or not be backwards compatible!
[WARNING:<https://builds.apache.org/job/Thrift/ws/test/DebugProtoTest.thrift>:361] No field key specified for field7, resulting protocol may have conflicts or not be backwards compatible!
[WARNING:<https://builds.apache.org/job/Thrift/ws/test/DebugProtoTest.thrift>:362] No field key specified for field8, resulting protocol may have conflicts or not be backwards compatible!
[WARNING:<https://builds.apache.org/job/Thrift/ws/test/DebugProtoTest.thrift>:363] No field key specified for field9, resulting protocol may have conflicts or not be backwards compatible!
[WARNING:<https://builds.apache.org/job/Thrift/ws/test/DebugProtoTest.thrift>:364] No field key specified for field10, resulting protocol may have conflicts or not be backwards compatible!
[WARNING:<https://builds.apache.org/job/Thrift/ws/test/DebugProtoTest.thrift>:365] No field key specified for field11, resulting protocol may have conflicts or not be backwards compatible!
[WARNING:<https://builds.apache.org/job/Thrift/ws/test/DebugProtoTest.thrift>:366] No field key specified for field12, resulting protocol may have conflicts or not be backwards compatible!
[WARNING:<https://builds.apache.org/job/Thrift/ws/test/DebugProtoTest.thrift>:41] 64-bit constant "10000000000" may not work in all languages.
[WARNING:<https://builds.apache.org/job/Thrift/ws/test/DebugProtoTest.thrift>:47] Consider using the more efficient "binary" type instead of "list<byte>".
[WARNING:<https://builds.apache.org/job/Thrift/ws/test/DebugProtoTest.thrift>:115] Consider using the more efficient "binary" type instead of "list<byte>".
[WARNING:<https://builds.apache.org/job/Thrift/ws/test/DebugProtoTest.thrift>:155] Consider using the more efficient "binary" type instead of "list<byte>".
[WARNING:<https://builds.apache.org/job/Thrift/ws/test/DebugProtoTest.thrift>:161] Consider using the more efficient "binary" type instead of "list<byte>".
[WARNING:<https://builds.apache.org/job/Thrift/ws/test/DebugProtoTest.thrift>:173] 64-bit constant "1099511627775" may not work in all languages.
[WARNING:<https://builds.apache.org/job/Thrift/ws/test/DebugProtoTest.thrift>:183] 64-bit constant "4294967295" may not work in all languages.
[WARNING:<https://builds.apache.org/job/Thrift/ws/test/DebugProtoTest.thrift>:183] 64-bit constant "1099511627775" may not work in all languages.
[WARNING:<https://builds.apache.org/job/Thrift/ws/test/DebugProtoTest.thrift>:183] 64-bit constant "281474976710655" may not work in all languages.
[WARNING:<https://builds.apache.org/job/Thrift/ws/test/DebugProtoTest.thrift>:183] 64-bit constant "72057594037927935" may not work in all languages.
[WARNING:<https://builds.apache.org/job/Thrift/ws/test/DebugProtoTest.thrift>:183] 64-bit constant "9223372036854775807" may not work in all languages.
[WARNING:<https://builds.apache.org/job/Thrift/ws/test/DebugProtoTest.thrift>:192] 64-bit constant "4294967295" may not work in all languages.
[WARNING:<https://builds.apache.org/job/Thrift/ws/test/DebugProtoTest.thrift>:192] 64-bit constant "1099511627775" may not work in all languages.
[WARNING:<https://builds.apache.org/job/Thrift/ws/test/DebugProtoTest.thrift>:192] 64-bit constant "281474976710655" may not work in all languages.
[WARNING:<https://builds.apache.org/job/Thrift/ws/test/DebugProtoTest.thrift>:192] 64-bit constant "72057594037927935" may not work in all languages.
[WARNING:<https://builds.apache.org/job/Thrift/ws/test/DebugProtoTest.thrift>:192] 64-bit constant "9223372036854775807" may not work in all languages.
[WARNING:<https://builds.apache.org/job/Thrift/ws/test/DebugProtoTest.thrift>:201] 64-bit constant "9223372036854775807" may not work in all languages.
[WARNING:<https://builds.apache.org/job/Thrift/ws/test/DebugProtoTest.thrift>:208] 64-bit constant "9223372036854775807" may not work in all languages.
[WARNING:<https://builds.apache.org/job/Thrift/ws/test/DebugProtoTest.thrift>:355] No field key specified for field1, resulting protocol may have conflicts or not be backwards compatible!
[WARNING:<https://builds.apache.org/job/Thrift/ws/test/DebugProtoTest.thrift>:356] No field key specified for field2, resulting protocol may have conflicts or not be backwards compatible!
[WARNING:<https://builds.apache.org/job/Thrift/ws/test/DebugProtoTest.thrift>:357] No field key specified for field3, resulting protocol may have conflicts or not be backwards compatible!
[WARNING:<https://builds.apache.org/job/Thrift/ws/test/DebugProtoTest.thrift>:358] No field key specified for field4, resulting protocol may have conflicts or not be backwards compatible!
[WARNING:<https://builds.apache.org/job/Thrift/ws/test/DebugProtoTest.thrift>:359] No field key specified for field5, resulting protocol may have conflicts or not be backwards compatible!
[WARNING:<https://builds.apache.org/job/Thrift/ws/test/DebugProtoTest.thrift>:360] No field key specified for field6, resulting protocol may have conflicts or not be backwards compatible!
[WARNING:<https://builds.apache.org/job/Thrift/ws/test/DebugProtoTest.thrift>:361] No field key specified for field7, resulting protocol may have conflicts or not be backwards compatible!
[WARNING:<https://builds.apache.org/job/Thrift/ws/test/DebugProtoTest.thrift>:362] No field key specified for field8, resulting protocol may have conflicts or not be backwards compatible!
[WARNING:<https://builds.apache.org/job/Thrift/ws/test/DebugProtoTest.thrift>:363] No field key specified for field9, resulting protocol may have conflicts or not be backwards compatible!
[WARNING:<https://builds.apache.org/job/Thrift/ws/test/DebugProtoTest.thrift>:364] No field key specified for field10, resulting protocol may have conflicts or not be backwards compatible!
[WARNING:<https://builds.apache.org/job/Thrift/ws/test/DebugProtoTest.thrift>:365] No field key specified for field11, resulting protocol may have conflicts or not be backwards compatible!
[WARNING:<https://builds.apache.org/job/Thrift/ws/test/DebugProtoTest.thrift>:366] No field key specified for field12, resulting protocol may have conflicts or not be backwards compatible!
/bin/bash ../../../libtool --tag=CC --mode=compile gcc -DHAVE_CONFIG_H -I. -I../../.. -I../../../lib/cpp/src/thrift -g -Wall -I../src -I/usr/include/glib-2.0 -I/usr/lib/x86_64-linux-gnu/glib-2.0/include -MT t_test_debug_proto_test_types.lo -MD -MP -MF .deps/t_test_debug_proto_test_types.Tpo -c -o t_test_debug_proto_test_types.lo `test -f 'gen-c_glib/t_test_debug_proto_test_types.c' || echo './'`gen-c_glib/t_test_debug_proto_test_types.c
libtool: compile: gcc -DHAVE_CONFIG_H -I. -I../../.. -I../../../lib/cpp/src/thrift -g -Wall -I../src -I/usr/include/glib-2.0 -I/usr/lib/x86_64-linux-gnu/glib-2.0/include -MT t_test_debug_proto_test_types.lo -MD -MP -MF .deps/t_test_debug_proto_test_types.Tpo -c gen-c_glib/t_test_debug_proto_test_types.c -fPIC -DPIC -o .libs/t_test_debug_proto_test_types.o
gen-c_glib/t_test_debug_proto_test_types.c:12159:1: warning: 't_test_compact_test_constant' defined but not used [-Wunused-function]
gen-c_glib/t_test_debug_proto_test_types.c:12259:1: warning: 't_test_my_enum_map_constant' defined but not used [-Wunused-function]
gen-c_glib/t_test_debug_proto_test_types.c:12271:1: warning: 't_test_extra_crazy_map_constant' defined but not used [-Wunused-function]
libtool: compile: gcc -DHAVE_CONFIG_H -I. -I../../.. -I../../../lib/cpp/src/thrift -g -Wall -I../src -I/usr/include/glib-2.0 -I/usr/lib/x86_64-linux-gnu/glib-2.0/include -MT t_test_debug_proto_test_types.lo -MD -MP -MF .deps/t_test_debug_proto_test_types.Tpo -c gen-c_glib/t_test_debug_proto_test_types.c -o t_test_debug_proto_test_types.o >/dev/null 2>&1
mv -f .deps/t_test_debug_proto_test_types.Tpo .deps/t_test_debug_proto_test_types.Plo
/bin/bash ../../../libtool --tag=CC --mode=compile gcc -DHAVE_CONFIG_H -I. -I../../.. -I../../../lib/cpp/src/thrift -g -Wall -I../src -I/usr/include/glib-2.0 -I/usr/lib/x86_64-linux-gnu/glib-2.0/include -MT t_test_empty_service.lo -MD -MP -MF .deps/t_test_empty_service.Tpo -c -o t_test_empty_service.lo `test -f 'gen-c_glib/t_test_empty_service.c' || echo './'`gen-c_glib/t_test_empty_service.c
libtool: compile: gcc -DHAVE_CONFIG_H -I. -I../../.. -I../../../lib/cpp/src/thrift -g -Wall -I../src -I/usr/include/glib-2.0 -I/usr/lib/x86_64-linux-gnu/glib-2.0/include -MT t_test_empty_service.lo -MD -MP -MF .deps/t_test_empty_service.Tpo -c gen-c_glib/t_test_empty_service.c -fPIC -DPIC -o .libs/t_test_empty_service.o
libtool: compile: gcc -DHAVE_CONFIG_H -I. -I../../.. -I../../../lib/cpp/src/thrift -g -Wall -I../src -I/usr/include/glib-2.0 -I/usr/lib/x86_64-linux-gnu/glib-2.0/include -MT t_test_empty_service.lo -MD -MP -MF .deps/t_test_empty_service.Tpo -c gen-c_glib/t_test_empty_service.c -o t_test_empty_service.o >/dev/null 2>&1
mv -f .deps/t_test_empty_service.Tpo .deps/t_test_empty_service.Plo
/bin/bash ../../../libtool --tag=CC --mode=compile gcc -DHAVE_CONFIG_H -I. -I../../.. -I../../../lib/cpp/src/thrift -g -Wall -I../src -I/usr/include/glib-2.0 -I/usr/lib/x86_64-linux-gnu/glib-2.0/include -MT t_test_inherited.lo -MD -MP -MF .deps/t_test_inherited.Tpo -c -o t_test_inherited.lo `test -f 'gen-c_glib/t_test_inherited.c' || echo './'`gen-c_glib/t_test_inherited.c
libtool: compile: gcc -DHAVE_CONFIG_H -I. -I../../.. -I../../../lib/cpp/src/thrift -g -Wall -I../src -I/usr/include/glib-2.0 -I/usr/lib/x86_64-linux-gnu/glib-2.0/include -MT t_test_inherited.lo -MD -MP -MF .deps/t_test_inherited.Tpo -c gen-c_glib/t_test_inherited.c -fPIC -DPIC -o .libs/t_test_inherited.o
libtool: compile: gcc -DHAVE_CONFIG_H -I. -I../../.. -I../../../lib/cpp/src/thrift -g -Wall -I../src -I/usr/include/glib-2.0 -I/usr/lib/x86_64-linux-gnu/glib-2.0/include -MT t_test_inherited.lo -MD -MP -MF .deps/t_test_inherited.Tpo -c gen-c_glib/t_test_inherited.c -o t_test_inherited.o >/dev/null 2>&1
mv -f .deps/t_test_inherited.Tpo .deps/t_test_inherited.Plo
../../../compiler/cpp/thrift --gen c_glib ../../../test/OptionalRequiredTest.thrift
/bin/bash ../../../libtool --tag=CC --mode=compile gcc -DHAVE_CONFIG_H -I. -I../../.. -I../../../lib/cpp/src/thrift -g -Wall -I../src -I/usr/include/glib-2.0 -I/usr/lib/x86_64-linux-gnu/glib-2.0/include -MT t_test_optional_required_test_types.lo -MD -MP -MF .deps/t_test_optional_required_test_types.Tpo -c -o t_test_optional_required_test_types.lo `test -f 'gen-c_glib/t_test_optional_required_test_types.c' || echo './'`gen-c_glib/t_test_optional_required_test_types.c
libtool: compile: gcc -DHAVE_CONFIG_H -I. -I../../.. -I../../../lib/cpp/src/thrift -g -Wall -I../src -I/usr/include/glib-2.0 -I/usr/lib/x86_64-linux-gnu/glib-2.0/include -MT t_test_optional_required_test_types.lo -MD -MP -MF .deps/t_test_optional_required_test_types.Tpo -c gen-c_glib/t_test_optional_required_test_types.c -fPIC -DPIC -o .libs/t_test_optional_required_test_types.o
libtool: compile: gcc -DHAVE_CONFIG_H -I. -I../../.. -I../../../lib/cpp/src/thrift -g -Wall -I../src -I/usr/include/glib-2.0 -I/usr/lib/x86_64-linux-gnu/glib-2.0/include -MT t_test_optional_required_test_types.lo -MD -MP -MF .deps/t_test_optional_required_test_types.Tpo -c gen-c_glib/t_test_optional_required_test_types.c -o t_test_optional_required_test_types.o >/dev/null 2>&1
mv -f .deps/t_test_optional_required_test_types.Tpo .deps/t_test_optional_required_test_types.Plo
/bin/bash ../../../libtool --tag=CC --mode=compile gcc -DHAVE_CONFIG_H -I. -I../../.. -I../../../lib/cpp/src/thrift -g -Wall -I../src -I/usr/include/glib-2.0 -I/usr/lib/x86_64-linux-gnu/glib-2.0/include -MT t_test_reverse_order_service.lo -MD -MP -MF .deps/t_test_reverse_order_service.Tpo -c -o t_test_reverse_order_service.lo `test -f 'gen-c_glib/t_test_reverse_order_service.c' || echo './'`gen-c_glib/t_test_reverse_order_service.c
libtool: compile: gcc -DHAVE_CONFIG_H -I. -I../../.. -I../../../lib/cpp/src/thrift -g -Wall -I../src -I/usr/include/glib-2.0 -I/usr/lib/x86_64-linux-gnu/glib-2.0/include -MT t_test_reverse_order_service.lo -MD -MP -MF .deps/t_test_reverse_order_service.Tpo -c gen-c_glib/t_test_reverse_order_service.c -fPIC -DPIC -o .libs/t_test_reverse_order_service.o
libtool: compile: gcc -DHAVE_CONFIG_H -I. -I../../.. -I../../../lib/cpp/src/thrift -g -Wall -I../src -I/usr/include/glib-2.0 -I/usr/lib/x86_64-linux-gnu/glib-2.0/include -MT t_test_reverse_order_service.lo -MD -MP -MF .deps/t_test_reverse_order_service.Tpo -c gen-c_glib/t_test_reverse_order_service.c -o t_test_reverse_order_service.o >/dev/null 2>&1
mv -f .deps/t_test_reverse_order_service.Tpo .deps/t_test_reverse_order_service.Plo
../../../compiler/cpp/thrift --gen c_glib ../../../test/ThriftTest.thrift
[WARNING:<https://builds.apache.org/job/Thrift/ws/test/ThriftTest.thrift>:42] No generator named 'noexist' could be found!
[WARNING:<https://builds.apache.org/job/Thrift/ws/test/ThriftTest.thrift>:43] cpp generator does not accept 'noexist' as sub-namespace!
/bin/bash ../../../libtool --tag=CC --mode=compile gcc -DHAVE_CONFIG_H -I. -I../../.. -I../../../lib/cpp/src/thrift -g -Wall -I../src -I/usr/include/glib-2.0 -I/usr/lib/x86_64-linux-gnu/glib-2.0/include -MT t_test_second_service.lo -MD -MP -MF .deps/t_test_second_service.Tpo -c -o t_test_second_service.lo `test -f 'gen-c_glib/t_test_second_service.c' || echo './'`gen-c_glib/t_test_second_service.c
libtool: compile: gcc -DHAVE_CONFIG_H -I. -I../../.. -I../../../lib/cpp/src/thrift -g -Wall -I../src -I/usr/include/glib-2.0 -I/usr/lib/x86_64-linux-gnu/glib-2.0/include -MT t_test_second_service.lo -MD -MP -MF .deps/t_test_second_service.Tpo -c gen-c_glib/t_test_second_service.c -fPIC -DPIC -o .libs/t_test_second_service.o
libtool: compile: gcc -DHAVE_CONFIG_H -I. -I../../.. -I../../../lib/cpp/src/thrift -g -Wall -I../src -I/usr/include/glib-2.0 -I/usr/lib/x86_64-linux-gnu/glib-2.0/include -MT t_test_second_service.lo -MD -MP -MF .deps/t_test_second_service.Tpo -c gen-c_glib/t_test_second_service.c -o t_test_second_service.o >/dev/null 2>&1
mv -f .deps/t_test_second_service.Tpo .deps/t_test_second_service.Plo
/bin/bash ../../../libtool --tag=CC --mode=compile gcc -DHAVE_CONFIG_H -I. -I../../.. -I../../../lib/cpp/src/thrift -g -Wall -I../src -I/usr/include/glib-2.0 -I/usr/lib/x86_64-linux-gnu/glib-2.0/include -MT t_test_service_for_exception_with_a_map.lo -MD -MP -MF .deps/t_test_service_for_exception_with_a_map.Tpo -c -o t_test_service_for_exception_with_a_map.lo `test -f 'gen-c_glib/t_test_service_for_exception_with_a_map.c' || echo './'`gen-c_glib/t_test_service_for_exception_with_a_map.c
libtool: compile: gcc -DHAVE_CONFIG_H -I. -I../../.. -I../../../lib/cpp/src/thrift -g -Wall -I../src -I/usr/include/glib-2.0 -I/usr/lib/x86_64-linux-gnu/glib-2.0/include -MT t_test_service_for_exception_with_a_map.lo -MD -MP -MF .deps/t_test_service_for_exception_with_a_map.Tpo -c gen-c_glib/t_test_service_for_exception_with_a_map.c -fPIC -DPIC -o .libs/t_test_service_for_exception_with_a_map.o
libtool: compile: gcc -DHAVE_CONFIG_H -I. -I../../.. -I../../../lib/cpp/src/thrift -g -Wall -I../src -I/usr/include/glib-2.0 -I/usr/lib/x86_64-linux-gnu/glib-2.0/include -MT t_test_service_for_exception_with_a_map.lo -MD -MP -MF .deps/t_test_service_for_exception_with_a_map.Tpo -c gen-c_glib/t_test_service_for_exception_with_a_map.c -o t_test_service_for_exception_with_a_map.o >/dev/null 2>&1
mv -f .deps/t_test_service_for_exception_with_a_map.Tpo .deps/t_test_service_for_exception_with_a_map.Plo
/bin/bash ../../../libtool --tag=CC --mode=compile gcc -DHAVE_CONFIG_H -I. -I../../.. -I../../../lib/cpp/src/thrift -g -Wall -I../src -I/usr/include/glib-2.0 -I/usr/lib/x86_64-linux-gnu/glib-2.0/include -MT t_test_srv.lo -MD -MP -MF .deps/t_test_srv.Tpo -c -o t_test_srv.lo `test -f 'gen-c_glib/t_test_srv.c' || echo './'`gen-c_glib/t_test_srv.c
libtool: compile: gcc -DHAVE_CONFIG_H -I. -I../../.. -I../../../lib/cpp/src/thrift -g -Wall -I../src -I/usr/include/glib-2.0 -I/usr/lib/x86_64-linux-gnu/glib-2.0/include -MT t_test_srv.lo -MD -MP -MF .deps/t_test_srv.Tpo -c gen-c_glib/t_test_srv.c -fPIC -DPIC -o .libs/t_test_srv.o
libtool: compile: gcc -DHAVE_CONFIG_H -I. -I../../.. -I../../../lib/cpp/src/thrift -g -Wall -I../src -I/usr/include/glib-2.0 -I/usr/lib/x86_64-linux-gnu/glib-2.0/include -MT t_test_srv.lo -MD -MP -MF .deps/t_test_srv.Tpo -c gen-c_glib/t_test_srv.c -o t_test_srv.o >/dev/null 2>&1
mv -f .deps/t_test_srv.Tpo .deps/t_test_srv.Plo
/bin/bash ../../../libtool --tag=CC --mode=compile gcc -DHAVE_CONFIG_H -I. -I../../.. -I../../../lib/cpp/src/thrift -g -Wall -I../src -I/usr/include/glib-2.0 -I/usr/lib/x86_64-linux-gnu/glib-2.0/include -MT t_test_thrift_test.lo -MD -MP -MF .deps/t_test_thrift_test.Tpo -c -o t_test_thrift_test.lo `test -f 'gen-c_glib/t_test_thrift_test.c' || echo './'`gen-c_glib/t_test_thrift_test.c
libtool: compile: gcc -DHAVE_CONFIG_H -I. -I../../.. -I../../../lib/cpp/src/thrift -g -Wall -I../src -I/usr/include/glib-2.0 -I/usr/lib/x86_64-linux-gnu/glib-2.0/include -MT t_test_thrift_test.lo -MD -MP -MF .deps/t_test_thrift_test.Tpo -c gen-c_glib/t_test_thrift_test.c -fPIC -DPIC -o .libs/t_test_thrift_test.o
gen-c_glib/t_test_thrift_test.c: In function 't_test_thrift_test_client_recv_test_insanity':
gen-c_glib/t_test_thrift_test.c:3233:37: warning: initialization makes integer from pointer without a cast [enabled by default]
libtool: compile: gcc -DHAVE_CONFIG_H -I. -I../../.. -I../../../lib/cpp/src/thrift -g -Wall -I../src -I/usr/include/glib-2.0 -I/usr/lib/x86_64-linux-gnu/glib-2.0/include -MT t_test_thrift_test.lo -MD -MP -MF .deps/t_test_thrift_test.Tpo -c gen-c_glib/t_test_thrift_test.c -o t_test_thrift_test.o >/dev/null 2>&1
mv -f .deps/t_test_thrift_test.Tpo .deps/t_test_thrift_test.Plo
/bin/bash ../../../libtool --tag=CC --mode=compile gcc -DHAVE_CONFIG_H -I. -I../../.. -I../../../lib/cpp/src/thrift -g -Wall -I../src -I/usr/include/glib-2.0 -I/usr/lib/x86_64-linux-gnu/glib-2.0/include -MT t_test_thrift_test_types.lo -MD -MP -MF .deps/t_test_thrift_test_types.Tpo -c -o t_test_thrift_test_types.lo `test -f 'gen-c_glib/t_test_thrift_test_types.c' || echo './'`gen-c_glib/t_test_thrift_test_types.c
libtool: compile: gcc -DHAVE_CONFIG_H -I. -I../../.. -I../../../lib/cpp/src/thrift -g -Wall -I../src -I/usr/include/glib-2.0 -I/usr/lib/x86_64-linux-gnu/glib-2.0/include -MT t_test_thrift_test_types.lo -MD -MP -MF .deps/t_test_thrift_test_types.Tpo -c gen-c_glib/t_test_thrift_test_types.c -fPIC -DPIC -o .libs/t_test_thrift_test_types.o
gen-c_glib/t_test_thrift_test_types.c: In function 't_test_insanity_read':
gen-c_glib/t_test_thrift_test_types.c:1196:34: warning: initialization makes integer from pointer without a cast [enabled by default]
libtool: compile: gcc -DHAVE_CONFIG_H -I. -I../../.. -I../../../lib/cpp/src/thrift -g -Wall -I../src -I/usr/include/glib-2.0 -I/usr/lib/x86_64-linux-gnu/glib-2.0/include -MT t_test_thrift_test_types.lo -MD -MP -MF .deps/t_test_thrift_test_types.Tpo -c gen-c_glib/t_test_thrift_test_types.c -o t_test_thrift_test_types.o >/dev/null 2>&1
mv -f .deps/t_test_thrift_test_types.Tpo .deps/t_test_thrift_test_types.Plo
/bin/bash ../../../libtool --tag=CC --mode=link gcc -lglib-2.0 -lgobject-2.0 -lglib-2.0 -o libtestgenc.la t_test_debug_proto_test_types.lo t_test_empty_service.lo t_test_inherited.lo t_test_optional_required_test_types.lo t_test_reverse_order_service.lo t_test_second_service.lo t_test_service_for_exception_with_a_map.lo t_test_srv.lo t_test_thrift_test.lo t_test_thrift_test_types.lo ../../../lib/c_glib/libthrift_c_glib.la -lrt -lpthread
libtool: link: ar cru .libs/libtestgenc.a .libs/t_test_debug_proto_test_types.o .libs/t_test_empty_service.o .libs/t_test_inherited.o .libs/t_test_optional_required_test_types.o .libs/t_test_reverse_order_service.o .libs/t_test_second_service.o .libs/t_test_service_for_exception_with_a_map.o .libs/t_test_srv.o .libs/t_test_thrift_test.o .libs/t_test_thrift_test_types.o
libtool: link: ranlib .libs/libtestgenc.a
libtool: link: ( cd ".libs" && rm -f "libtestgenc.la" && ln -s "../libtestgenc.la" "libtestgenc.la" )
gcc -DHAVE_CONFIG_H -I. -I../../.. -I../../../lib/cpp/src/thrift -g -Wall -I../src -I/usr/include/glib-2.0 -I/usr/lib/x86_64-linux-gnu/glib-2.0/include -MT testtransportsocket.o -MD -MP -MF .deps/testtransportsocket.Tpo -c -o testtransportsocket.o testtransportsocket.c
testtransportsocket.c: In function 'test_read_and_write':
testtransportsocket.c:171:5: warning: implicit declaration of function 'wait' [-Wimplicit-function-declaration]
mv -f .deps/testtransportsocket.Tpo .deps/testtransportsocket.Po
/bin/bash ../../../libtool --tag=CC --mode=link gcc -lglib-2.0 -lgobject-2.0 -lglib-2.0 -o testtransportsocket testtransportsocket.o ../libthrift_c_glib_la-thrift_transport.o ../libthrift_c_glib_la-thrift_server_transport.o ../libthrift_c_glib_la-thrift_server_socket.o -lrt -lpthread
libtool: link: gcc -o testtransportsocket testtransportsocket.o ../libthrift_c_glib_la-thrift_transport.o ../libthrift_c_glib_la-thrift_server_transport.o ../libthrift_c_glib_la-thrift_server_socket.o -lgobject-2.0 -lglib-2.0 -lrt -lpthread
gcc -DHAVE_CONFIG_H -I. -I../../.. -I../../../lib/cpp/src/thrift -g -Wall -I../src -I/usr/include/glib-2.0 -I/usr/lib/x86_64-linux-gnu/glib-2.0/include -MT testbinaryprotocol.o -MD -MP -MF .deps/testbinaryprotocol.Tpo -c -o testbinaryprotocol.o testbinaryprotocol.c
testbinaryprotocol.c: In function 'test_read_and_write_primitives':
testbinaryprotocol.c:195:5: warning: implicit declaration of function 'wait' [-Wimplicit-function-declaration]
mv -f .deps/testbinaryprotocol.Tpo .deps/testbinaryprotocol.Po
/bin/bash ../../../libtool --tag=CC --mode=link gcc -lglib-2.0 -lgobject-2.0 -lglib-2.0 -o testbinaryprotocol testbinaryprotocol.o ../libthrift_c_glib_la-thrift_protocol.o ../libthrift_c_glib_la-thrift_transport.o ../libthrift_c_glib_la-thrift_socket.o ../libthrift_c_glib_la-thrift_server_transport.o ../libthrift_c_glib_la-thrift_server_socket.o -lrt -lpthread
libtool: link: gcc -o testbinaryprotocol testbinaryprotocol.o ../libthrift_c_glib_la-thrift_protocol.o ../libthrift_c_glib_la-thrift_transport.o ../libthrift_c_glib_la-thrift_socket.o ../libthrift_c_glib_la-thrift_server_transport.o ../libthrift_c_glib_la-thrift_server_socket.o -lgobject-2.0 -lglib-2.0 -lrt -lpthread
gcc -DHAVE_CONFIG_H -I. -I../../.. -I../../../lib/cpp/src/thrift -g -Wall -I../src -I/usr/include/glib-2.0 -I/usr/lib/x86_64-linux-gnu/glib-2.0/include -MT testbufferedtransport.o -MD -MP -MF .deps/testbufferedtransport.Tpo -c -o testbufferedtransport.o testbufferedtransport.c
testbufferedtransport.c: In function 'test_read_and_write':
testbufferedtransport.c:154:5: warning: implicit declaration of function 'wait' [-Wimplicit-function-declaration]
mv -f .deps/testbufferedtransport.Tpo .deps/testbufferedtransport.Po
/bin/bash ../../../libtool --tag=CC --mode=link gcc -lglib-2.0 -lgobject-2.0 -lglib-2.0 -o testbufferedtransport testbufferedtransport.o ../libthrift_c_glib_la-thrift_transport.o ../libthrift_c_glib_la-thrift_socket.o ../libthrift_c_glib_la-thrift_server_transport.o ../libthrift_c_glib_la-thrift_server_socket.o -lrt -lpthread
libtool: link: gcc -o testbufferedtransport testbufferedtransport.o ../libthrift_c_glib_la-thrift_transport.o ../libthrift_c_glib_la-thrift_socket.o ../libthrift_c_glib_la-thrift_server_transport.o ../libthrift_c_glib_la-thrift_server_socket.o -lgobject-2.0 -lglib-2.0 -lrt -lpthread
gcc -DHAVE_CONFIG_H -I. -I../../.. -I../../../lib/cpp/src/thrift -g -Wall -I../src -I/usr/include/glib-2.0 -I/usr/lib/x86_64-linux-gnu/glib-2.0/include -MT testframedtransport.o -MD -MP -MF .deps/testframedtransport.Tpo -c -o testframedtransport.o testframedtransport.c
testframedtransport.c: In function 'test_read_and_write':
testframedtransport.c:142:5: warning: implicit declaration of function 'wait' [-Wimplicit-function-declaration]
mv -f .deps/testframedtransport.Tpo .deps/testframedtransport.Po
/bin/bash ../../../libtool --tag=CC --mode=link gcc -lglib-2.0 -lgobject-2.0 -lglib-2.0 -o testframedtransport testframedtransport.o ../libthrift_c_glib_la-thrift_transport.o ../libthrift_c_glib_la-thrift_socket.o ../libthrift_c_glib_la-thrift_server_transport.o ../libthrift_c_glib_la-thrift_server_socket.o -lrt -lpthread
libtool: link: gcc -o testframedtransport testframedtransport.o ../libthrift_c_glib_la-thrift_transport.o ../libthrift_c_glib_la-thrift_socket.o ../libthrift_c_glib_la-thrift_server_transport.o ../libthrift_c_glib_la-thrift_server_socket.o -lgobject-2.0 -lglib-2.0 -lrt -lpthread
gcc -DHAVE_CONFIG_H -I. -I../../.. -I../../../lib/cpp/src/thrift -g -Wall -I../src -I/usr/include/glib-2.0 -I/usr/lib/x86_64-linux-gnu/glib-2.0/include -MT testmemorybuffer.o -MD -MP -MF .deps/testmemorybuffer.Tpo -c -o testmemorybuffer.o testmemorybuffer.c
mv -f .deps/testmemorybuffer.Tpo .deps/testmemorybuffer.Po
/bin/bash ../../../libtool --tag=CC --mode=link gcc -lglib-2.0 -lgobject-2.0 -lglib-2.0 -o testmemorybuffer testmemorybuffer.o ../libthrift_c_glib_la-thrift_transport.o -lrt -lpthread
libtool: link: gcc -o testmemorybuffer testmemorybuffer.o ../libthrift_c_glib_la-thrift_transport.o -lgobject-2.0 -lglib-2.0 -lrt -lpthread
gcc -DHAVE_CONFIG_H -I. -I../../.. -I../../../lib/cpp/src/thrift -g -Wall -I../src -I/usr/include/glib-2.0 -I/usr/lib/x86_64-linux-gnu/glib-2.0/include -MT teststruct.o -MD -MP -MF .deps/teststruct.Tpo -c -o teststruct.o teststruct.c
mv -f .deps/teststruct.Tpo .deps/teststruct.Po
/bin/bash ../../../libtool --tag=CC --mode=link gcc -lglib-2.0 -lgobject-2.0 -lglib-2.0 -o teststruct teststruct.o ../libthrift_c_glib_la-thrift_protocol.o ../libthrift_c_glib_la-thrift_transport.o -lrt -lpthread
libtool: link: gcc -o teststruct teststruct.o ../libthrift_c_glib_la-thrift_protocol.o ../libthrift_c_glib_la-thrift_transport.o -lgobject-2.0 -lglib-2.0 -lrt -lpthread
gcc -DHAVE_CONFIG_H -I. -I../../.. -I../../../lib/cpp/src/thrift -g -Wall -I../src -I/usr/include/glib-2.0 -I/usr/lib/x86_64-linux-gnu/glib-2.0/include -MT testsimpleserver.o -MD -MP -MF .deps/testsimpleserver.Tpo -c -o testsimpleserver.o testsimpleserver.c
mv -f .deps/testsimpleserver.Tpo .deps/testsimpleserver.Po
/bin/bash ../../../libtool --tag=CC --mode=link gcc -lglib-2.0 -lgobject-2.0 -lglib-2.0 -o testsimpleserver testsimpleserver.o ../libthrift_c_glib_la-thrift_protocol.o ../libthrift_c_glib_la-thrift_transport.o ../libthrift_c_glib_la-thrift_transport_factory.o ../libthrift_c_glib_la-thrift_processor.o ../libthrift_c_glib_la-thrift_protocol_factory.o ../libthrift_c_glib_la-thrift_binary_protocol.o ../libthrift_c_glib_la-thrift_binary_protocol_factory.o ../libthrift_c_glib_la-thrift_socket.o ../libthrift_c_glib_la-thrift_server_transport.o ../libthrift_c_glib_la-thrift_server_socket.o ../libthrift_c_glib_la-thrift_server.o -lrt -lpthread
libtool: link: gcc -o testsimpleserver testsimpleserver.o ../libthrift_c_glib_la-thrift_protocol.o ../libthrift_c_glib_la-thrift_transport.o ../libthrift_c_glib_la-thrift_transport_factory.o ../libthrift_c_glib_la-thrift_processor.o ../libthrift_c_glib_la-thrift_protocol_factory.o ../libthrift_c_glib_la-thrift_binary_protocol.o ../libthrift_c_glib_la-thrift_binary_protocol_factory.o ../libthrift_c_glib_la-thrift_socket.o ../libthrift_c_glib_la-thrift_server_transport.o ../libthrift_c_glib_la-thrift_server_socket.o ../libthrift_c_glib_la-thrift_server.o -lgobject-2.0 -lglib-2.0 -lrt -lpthread
gcc -DHAVE_CONFIG_H -I. -I../../.. -I../../../lib/cpp/src/thrift -g -Wall -I../src -I/usr/include/glib-2.0 -I/usr/lib/x86_64-linux-gnu/glib-2.0/include -MT testdebugproto.o -MD -MP -MF .deps/testdebugproto.Tpo -c -o testdebugproto.o testdebugproto.c
testdebugproto.c: In function 'test_debug_proto':
testdebugproto.c:79:3: warning: 'return' with a value, in function returning void [enabled by default]
mv -f .deps/testdebugproto.Tpo .deps/testdebugproto.Po
/bin/bash ../../../libtool --tag=CC --mode=link gcc -lglib-2.0 -lgobject-2.0 -lglib-2.0 -o testdebugproto testdebugproto.o libtestgenc.la -lrt -lpthread
libtool: link: gcc -o .libs/testdebugproto testdebugproto.o ./.libs/libtestgenc.a -lgobject-2.0 -lglib-2.0 <https://builds.apache.org/job/Thrift/ws/lib/c_glib/.libs/libthrift_c_glib.so> -lrt -lpthread
gcc -DHAVE_CONFIG_H -I. -I../../.. -I../../../lib/cpp/src/thrift -g -Wall -I../src -I/usr/include/glib-2.0 -I/usr/lib/x86_64-linux-gnu/glib-2.0/include -MT testoptionalrequired.o -MD -MP -MF .deps/testoptionalrequired.Tpo -c -o testoptionalrequired.o testoptionalrequired.c
mv -f .deps/testoptionalrequired.Tpo .deps/testoptionalrequired.Po
/bin/bash ../../../libtool --tag=CC --mode=link gcc -lglib-2.0 -lgobject-2.0 -lglib-2.0 -o testoptionalrequired testoptionalrequired.o ../libthrift_c_glib_la-thrift_protocol.o ../libthrift_c_glib_la-thrift_transport.o libtestgenc.la -lrt -lpthread
libtool: link: gcc -o .libs/testoptionalrequired testoptionalrequired.o ../libthrift_c_glib_la-thrift_protocol.o ../libthrift_c_glib_la-thrift_transport.o ./.libs/libtestgenc.a -lgobject-2.0 -lglib-2.0 <https://builds.apache.org/job/Thrift/ws/lib/c_glib/.libs/libthrift_c_glib.so> -lrt -lpthread
gcc -DHAVE_CONFIG_H -I. -I../../.. -I../../../lib/cpp/src/thrift -g -Wall -I../src -I/usr/include/glib-2.0 -I/usr/lib/x86_64-linux-gnu/glib-2.0/include -MT testthrifttest.o -MD -MP -MF .deps/testthrifttest.Tpo -c -o testthrifttest.o testthrifttest.c
testthrifttest.c: In function 'main':
testthrifttest.c:25:3: warning: passing argument 2 of 'g_test_add_func' from incompatible pointer type [enabled by default]
/usr/include/glib-2.0/glib/gtestutils.h:105:9: note: expected 'GTestFunc' but argument is of type 'void (*)(const int)'
mv -f .deps/testthrifttest.Tpo .deps/testthrifttest.Po
/bin/bash ../../../libtool --tag=CC --mode=link gcc -lglib-2.0 -lgobject-2.0 -lglib-2.0 -o testthrifttest testthrifttest.o libtestgenc.la -lrt -lpthread
libtool: link: gcc -o .libs/testthrifttest testthrifttest.o ./.libs/libtestgenc.a -lgobject-2.0 -lglib-2.0 <https://builds.apache.org/job/Thrift/ws/lib/c_glib/.libs/libthrift_c_glib.so> -lrt -lpthread
make[5]: Leaving directory `<https://builds.apache.org/job/Thrift/ws/lib/c_glib/test'>
make check-TESTS
make[5]: Entering directory `<https://builds.apache.org/job/Thrift/ws/lib/c_glib/test'>
/testtransportsocket/CreateAndDestroy: OK
/testtransportsocket/OpenAndClose: OK
/testtransportsocket/ReadAndWrite: OK
PASS: testtransportsocket
/testbinaryprotocol/CreateAndDestroy: OK
/testbinaryprotocol/Initialize: OK
/testbinaryprotocol/ReadAndWritePrimitives: OK
/testbinaryprotocol/ReadAndWriteComplexTypes: OK
PASS: testbinaryprotocol
/testbufferedtransport/CreateAndDestroy: OK
/testbufferedtransport/OpenAndClose: OK
/testbufferedtransport/ReadAndWrite: OK
/testbufferedtransport/WriteFail: testbufferedtransport: testbufferedtransport.c:248: test_write_fail: Assertion `thrift_buffered_transport_open (transport, ((void *)0)) == (!(0))' failed.
/bin/bash: line 5: 3297 Aborted ${dir}$tst
FAIL: testbufferedtransport
/testframedtransport/CreateAndDestroy: OK
/testframedtransport/OpenAndClose: OK
/testframedtransport/ReadAndWrite: OK
PASS: testframedtransport
/testmemorybuffer/CreateAndDestroy: OK
/testmemorybuffer/OpenAndClose: OK
/testmemorybuffer/ReadAndWrite: OK
PASS: testmemorybuffer
/teststruct/InitializeObject: OK
PASS: teststruct
/testsimpleserver/SimpleServer: OK
PASS: testsimpleserver
/testdebugproto/DebugProto: OK
PASS: testdebugproto
/testoptionalrequired/OldSchool: OK
/testoptionalrequired/Simple: OK
/testoptionalrequired/Tricky1: OK
/testoptionalrequired/Tricky2: OK
/testoptionalrequired/Tricky3: OK
/testoptionalrequired/Tricky4: OK
PASS: testoptionalrequired
/testthrift/Server: OK
PASS: testthrifttest
====================
1 of 10 tests failed
====================
make[5]: *** [check-TESTS] Error 1
make[5]: Leaving directory `<https://builds.apache.org/job/Thrift/ws/lib/c_glib/test'>
make[4]: *** [check-am] Error 2
make[4]: Leaving directory `<https://builds.apache.org/job/Thrift/ws/lib/c_glib/test'>
make[3]: *** [check-recursive] Error 1
make[3]: Leaving directory `<https://builds.apache.org/job/Thrift/ws/lib/c_glib/test'>
make[2]: *** [check-recursive] Error 1
make[2]: Leaving directory `<https://builds.apache.org/job/Thrift/ws/lib/c_glib'>
make[1]: *** [check-recursive] Error 1
make[1]: Leaving directory `<https://builds.apache.org/job/Thrift/ws/lib'>
make: *** [check-recursive] Error 1
Build step 'Execute shell' marked build as failure
[WARNINGS] Skipping publisher since build result is FAILURE
[TASKS] Skipping publisher since build result is FAILURE
Archiving artifacts
Sending artifact delta relative to Thrift #1206
Archived 3 artifacts
Archive block size is 32768
Received 350 blocks and 21705314 bytes
Compression is 34.6%
Took 15 sec
Publishing Javadoc
Updating THRIFT-2614
Jenkins build is back to normal : Thrift #1209
Posted by Apache Jenkins Server <je...@builds.apache.org>.
See <https://builds.apache.org/job/Thrift/1209/changes>
Build failed in Jenkins: Thrift #1208
Posted by Apache Jenkins Server <je...@builds.apache.org>.
See <https://builds.apache.org/job/Thrift/1208/changes>
Changes:
[roger] THRIFT-2578 Moving 'make cross' from test.sh to test.py
------------------------------------------
[...truncated 8612 lines...]
.localhost - - [09/Jul/2014 11:50:15] "POST / HTTP/1.0" 200 -
localhost - - [09/Jul/2014 11:50:15] "POST / HTTP/1.0" 200 -
.localhost - - [09/Jul/2014 11:50:15] "POST / HTTP/1.0" 200 -
.localhost - - [09/Jul/2014 11:50:15] "POST / HTTP/1.0" 200 -
..localhost - - [09/Jul/2014 11:50:15] "POST / HTTP/1.0" 200 -
.localhost - - [09/Jul/2014 11:50:15] "POST / HTTP/1.0" 200 -
.localhost - - [09/Jul/2014 11:50:15] "POST / HTTP/1.0" 200 -
.localhost - - [09/Jul/2014 11:50:15] "POST / HTTP/1.0" 200 -
localhost - - [09/Jul/2014 11:50:15] "POST / HTTP/1.0" 200 -
.localhost - - [09/Jul/2014 11:50:15] "POST / HTTP/1.0" 200 -
.localhost - - [09/Jul/2014 11:50:15] "POST / HTTP/1.0" 200 -
localhost - - [09/Jul/2014 11:50:15] "POST / HTTP/1.0" 200 -
.localhost - - [09/Jul/2014 11:50:15] "POST / HTTP/1.0" 200 -
.localhost - - [09/Jul/2014 11:50:15] "POST / HTTP/1.0" 200 -
.localhost - - [09/Jul/2014 11:50:15] "POST / HTTP/1.0" 200 -
..
----------------------------------------------------------------------
Ran 19 tests in 0.695s
OK
shed (includes gen-py-dynamicslots) THttpServer / binary proto / zlib=False / SSL=False. 395 combinations tested.
Test run #396: (includes gen-py-dynamicslots) Server=THttpServer, Proto=compact, zlib=False, SSL=False
Testing server THttpServer: /usr/bin/python ./TestServer.py --genpydir=gen-py-dynamicslots --protocol=compact --port=9090 THttpServer
Testing client: /usr/bin/python ./TestClient.py --genpydir=gen-py-dynamicslots --protocol=compact --port=9090 --transport=buffered --http=/
OK: Finished (includes gen-py-dynamicslots) THttpServer / compact proto / zlib=False / SSL=False. 396 combinations tested.
PASS: RunClientServer.py
=============
1 test passed
=============
make[3]: Leaving directory `<https://builds.apache.org/job/Thrift/ws/test/py'>
make[2]: Leaving directory `<https://builds.apache.org/job/Thrift/ws/test/py'>
Making check in py.twisted
make[2]: Entering directory `<https://builds.apache.org/job/Thrift/ws/test/py.twisted'>
../../compiler/cpp/thrift --gen py:twisted ../ThriftTest.thrift
[WARNING:<https://builds.apache.org/job/Thrift/ws/test/ThriftTest.thrift>:42] No generator named 'noexist' could be found!
[WARNING:<https://builds.apache.org/job/Thrift/ws/test/ThriftTest.thrift>:43] cpp generator does not accept 'noexist' as sub-namespace!
../../compiler/cpp/thrift --gen py:twisted ../SmallTest.thrift
[WARNING:<https://builds.apache.org/job/Thrift/ws/test/SmallTest.thrift>:27] "senum" is deprecated and will be removed in a future compiler version. This type should be replaced with "string".
[WARNING:<https://builds.apache.org/job/Thrift/ws/test/SmallTest.thrift>:27] "senum" is deprecated and will be removed in a future compiler version. This type should be replaced with "string".
/usr/bin/trial test_suite.py
test_suite
ThriftTestCase
testByte ... [OK]
testDouble ... [OK]
testException ... [OK]
testI32 ... [OK]
testI64 ... [OK]
testOneway ... [OK]
testString ... [OK]
testStruct ... [OK]
testVoid ... [OK]
-------------------------------------------------------------------------------
Ran 9 tests in 2.032s
PASSED (successes=9)
make[2]: Leaving directory `<https://builds.apache.org/job/Thrift/ws/test/py.twisted'>
Making check in py.tornado
make[2]: Entering directory `<https://builds.apache.org/job/Thrift/ws/test/py.tornado'>
../../compiler/cpp/thrift --gen py:tornado ../ThriftTest.thrift
[WARNING:<https://builds.apache.org/job/Thrift/ws/test/ThriftTest.thrift>:42] No generator named 'noexist' could be found!
[WARNING:<https://builds.apache.org/job/Thrift/ws/test/ThriftTest.thrift>:43] cpp generator does not accept 'noexist' as sub-namespace!
../../compiler/cpp/thrift --gen py:tornado ../SmallTest.thrift
[WARNING:<https://builds.apache.org/job/Thrift/ws/test/SmallTest.thrift>:27] "senum" is deprecated and will be removed in a future compiler version. This type should be replaced with "string".
[WARNING:<https://builds.apache.org/job/Thrift/ws/test/SmallTest.thrift>:27] "senum" is deprecated and will be removed in a future compiler version. This type should be replaced with "string".
./test_suite.py
module `tornado` not found, skipping test
make[2]: Leaving directory `<https://builds.apache.org/job/Thrift/ws/test/py.tornado'>
make[2]: Entering directory `<https://builds.apache.org/job/Thrift/ws/test'>
make check-local
make[3]: Entering directory `<https://builds.apache.org/job/Thrift/ws/test'>
../compiler/cpp/thrift --gen html -r ../test/ThriftTest.thrift
[WARNING:<https://builds.apache.org/job/Thrift/ws/test/ThriftTest.thrift>:42] No generator named 'noexist' could be found!
[WARNING:<https://builds.apache.org/job/Thrift/ws/test/ThriftTest.thrift>:43] cpp generator does not accept 'noexist' as sub-namespace!
make[3]: Leaving directory `<https://builds.apache.org/job/Thrift/ws/test'>
make[2]: Leaving directory `<https://builds.apache.org/job/Thrift/ws/test'>
make[1]: Leaving directory `<https://builds.apache.org/job/Thrift/ws/test'>
Making check in tutorial
make[1]: Entering directory `<https://builds.apache.org/job/Thrift/ws/tutorial'>
Making check in java
make[2]: Entering directory `<https://builds.apache.org/job/Thrift/ws/tutorial/java'>
/usr/bin/ant compile
Buildfile: <https://builds.apache.org/job/Thrift/ws/tutorial/java/build.xml>
init:
generate:
compile:
[javac] <https://builds.apache.org/job/Thrift/ws/tutorial/java/build.xml>:53: warning: 'includeantruntime' was not set, defaulting to build.sysclasspath=last; set to false for repeatable builds
[javac] Compiling 7 source files to <https://builds.apache.org/job/Thrift/ws/tutorial/java/build>
[javac] <https://builds.apache.org/job/Thrift/ws/tutorial/java/build.xml>:54: warning: 'includeantruntime' was not set, defaulting to build.sysclasspath=last; set to false for repeatable builds
BUILD SUCCESSFUL
Total time: 2 seconds
make check-local
make[3]: Entering directory `<https://builds.apache.org/job/Thrift/ws/tutorial/java'>
/usr/bin/ant compile
Buildfile: <https://builds.apache.org/job/Thrift/ws/tutorial/java/build.xml>
init:
generate:
compile:
[javac] <https://builds.apache.org/job/Thrift/ws/tutorial/java/build.xml>:53: warning: 'includeantruntime' was not set, defaulting to build.sysclasspath=last; set to false for repeatable builds
[javac] <https://builds.apache.org/job/Thrift/ws/tutorial/java/build.xml>:54: warning: 'includeantruntime' was not set, defaulting to build.sysclasspath=last; set to false for repeatable builds
BUILD SUCCESSFUL
Total time: 0 seconds
/usr/bin/ant test
Buildfile: <https://builds.apache.org/job/Thrift/ws/tutorial/java/build.xml>
init:
generate:
compile:
[javac] <https://builds.apache.org/job/Thrift/ws/tutorial/java/build.xml>:53: warning: 'includeantruntime' was not set, defaulting to build.sysclasspath=last; set to false for repeatable builds
[javac] Compiling 4 source files to <https://builds.apache.org/job/Thrift/ws/tutorial/java/build>
[javac] <https://builds.apache.org/job/Thrift/ws/tutorial/java/build.xml>:54: warning: 'includeantruntime' was not set, defaulting to build.sysclasspath=last; set to false for repeatable builds
tutorial:
[jar] Building jar: <https://builds.apache.org/job/Thrift/ws/tutorial/java/tutorial.jar>
[echo] tutorial client simple:
[java] ping()
[java] 1+1=2
[java] Invalid operation: Cannot divide by 0
[java] 15-10=5
[java] Check log: 5
[echo] tutorial client secure:
[java] ping()
[java] 1+1=2
[java] Invalid operation: Cannot divide by 0
[java] 15-10=5
[java] Check log: 5
[java] Timeout: killed the sub-process
[java] Java Result: -1
test:
BUILD SUCCESSFUL
Total time: 13 seconds
make[3]: Leaving directory `<https://builds.apache.org/job/Thrift/ws/tutorial/java'>
make[2]: Leaving directory `<https://builds.apache.org/job/Thrift/ws/tutorial/java'>
Making check in js
make[2]: Entering directory `<https://builds.apache.org/job/Thrift/ws/tutorial/js'>
/usr/bin/ant compile
Buildfile: <https://builds.apache.org/job/Thrift/ws/tutorial/js/build.xml>
init:
compile:
[javac] <https://builds.apache.org/job/Thrift/ws/tutorial/js/build.xml>:54: warning: 'includeantruntime' was not set, defaulting to build.sysclasspath=last; set to false for repeatable builds
[javac] Compiling 7 source files to <https://builds.apache.org/job/Thrift/ws/tutorial/js/build>
[javac] <https://builds.apache.org/job/Thrift/ws/tutorial/js/build.xml>:55: warning: 'includeantruntime' was not set, defaulting to build.sysclasspath=last; set to false for repeatable builds
[javac] <https://builds.apache.org/job/Thrift/ws/tutorial/js/build.xml>:60: warning: 'includeantruntime' was not set, defaulting to build.sysclasspath=last; set to false for repeatable builds
BUILD SUCCESSFUL
Total time: 2 seconds
make check-local
make[3]: Entering directory `<https://builds.apache.org/job/Thrift/ws/tutorial/js'>
/usr/bin/ant compile
Buildfile: <https://builds.apache.org/job/Thrift/ws/tutorial/js/build.xml>
init:
compile:
[javac] <https://builds.apache.org/job/Thrift/ws/tutorial/js/build.xml>:54: warning: 'includeantruntime' was not set, defaulting to build.sysclasspath=last; set to false for repeatable builds
[javac] <https://builds.apache.org/job/Thrift/ws/tutorial/js/build.xml>:55: warning: 'includeantruntime' was not set, defaulting to build.sysclasspath=last; set to false for repeatable builds
[javac] <https://builds.apache.org/job/Thrift/ws/tutorial/js/build.xml>:60: warning: 'includeantruntime' was not set, defaulting to build.sysclasspath=last; set to false for repeatable builds
BUILD SUCCESSFUL
Total time: 0 seconds
/usr/bin/ant test
Buildfile: <https://builds.apache.org/job/Thrift/ws/tutorial/js/build.xml>
init:
compile:
[javac] <https://builds.apache.org/job/Thrift/ws/tutorial/js/build.xml>:54: warning: 'includeantruntime' was not set, defaulting to build.sysclasspath=last; set to false for repeatable builds
[javac] <https://builds.apache.org/job/Thrift/ws/tutorial/js/build.xml>:55: warning: 'includeantruntime' was not set, defaulting to build.sysclasspath=last; set to false for repeatable builds
[javac] <https://builds.apache.org/job/Thrift/ws/tutorial/js/build.xml>:60: warning: 'includeantruntime' was not set, defaulting to build.sysclasspath=last; set to false for repeatable builds
tutorial:
[jar] Building jar: <https://builds.apache.org/job/Thrift/ws/tutorial/js/tutorial-js.jar>
test:
BUILD SUCCESSFUL
Total time: 0 seconds
make[3]: Leaving directory `<https://builds.apache.org/job/Thrift/ws/tutorial/js'>
make[2]: Leaving directory `<https://builds.apache.org/job/Thrift/ws/tutorial/js'>
Making check in py
make[2]: Entering directory `<https://builds.apache.org/job/Thrift/ws/tutorial/py'>
make[2]: Nothing to be done for `check'.
make[2]: Leaving directory `<https://builds.apache.org/job/Thrift/ws/tutorial/py'>
Making check in py.twisted
make[2]: Entering directory `<https://builds.apache.org/job/Thrift/ws/tutorial/py.twisted'>
../../compiler/cpp/thrift --gen py:twisted -r ../../tutorial/tutorial.thrift
make[2]: Leaving directory `<https://builds.apache.org/job/Thrift/ws/tutorial/py.twisted'>
Making check in py.tornado
make[2]: Entering directory `<https://builds.apache.org/job/Thrift/ws/tutorial/py.tornado'>
make[2]: Nothing to be done for `check'.
make[2]: Leaving directory `<https://builds.apache.org/job/Thrift/ws/tutorial/py.tornado'>
make[2]: Entering directory `<https://builds.apache.org/job/Thrift/ws/tutorial'>
../compiler/cpp/thrift --gen html -r ../tutorial/tutorial.thrift
make[2]: Leaving directory `<https://builds.apache.org/job/Thrift/ws/tutorial'>
make[1]: Leaving directory `<https://builds.apache.org/job/Thrift/ws/tutorial'>
make[1]: Entering directory `<https://builds.apache.org/job/Thrift/ws/'>
make[1]: Nothing to be done for `check-am'.
make[1]: Leaving directory `<https://builds.apache.org/job/Thrift/ws/'>
+ make dist
if test -d "thrift-1.0.0-dev"; then find "thrift-1.0.0-dev" -type d ! -perm -200 -exec chmod u+w {} ';' && rm -rf "thrift-1.0.0-dev" || { sleep 5 && rm -rf "thrift-1.0.0-dev"; }; else :; fi
test -d "thrift-1.0.0-dev" || mkdir "thrift-1.0.0-dev"
(cd compiler/cpp && make top_distdir=../../thrift-1.0.0-dev distdir=../../thrift-1.0.0-dev/compiler/cpp \
am__remove_distdir=: am__skip_length_check=: am__skip_mode_fix=: distdir)
make[1]: Entering directory `<https://builds.apache.org/job/Thrift/ws/compiler/cpp'>
make[1]: Leaving directory `<https://builds.apache.org/job/Thrift/ws/compiler/cpp'>
(cd lib && make top_distdir=../thrift-1.0.0-dev distdir=../thrift-1.0.0-dev/lib \
am__remove_distdir=: am__skip_length_check=: am__skip_mode_fix=: distdir)
make[1]: Entering directory `<https://builds.apache.org/job/Thrift/ws/lib'>
(cd cpp && make top_distdir=../../thrift-1.0.0-dev distdir=../../thrift-1.0.0-dev/lib/cpp \
am__remove_distdir=: am__skip_length_check=: am__skip_mode_fix=: distdir)
make[2]: Entering directory `<https://builds.apache.org/job/Thrift/ws/lib/cpp'>
src/thrift/qt/TQTcpServer.h -o src/thrift/qt/moc_TQTcpServer.cpp
/bin/bash: src/thrift/qt/TQTcpServer.h: Permission denied
make[2]: *** [src/thrift/qt/moc_TQTcpServer.cpp] Error 126
make[2]: Leaving directory `<https://builds.apache.org/job/Thrift/ws/lib/cpp'>
make[1]: *** [distdir] Error 1
make[1]: Leaving directory `<https://builds.apache.org/job/Thrift/ws/lib'>
make: *** [distdir] Error 1
Build step 'Execute shell' marked build as failure
[WARNINGS] Skipping publisher since build result is FAILURE
[TASKS] Skipping publisher since build result is FAILURE
Archiving artifacts
Sending artifact delta relative to Thrift #1206
Archived 6 artifacts
Archive block size is 32768
Received 350 blocks and 9712381 bytes
Compression is 54.1%
Took 4.1 sec
Publishing Javadoc
Updating THRIFT-2578