You are viewing a plain text version of this content. The canonical link for it is here.
Posted to builds@cassandra.apache.org by Apache Jenkins Server <je...@builds.apache.org> on 2022/04/13 02:12:26 UTC

Build complete: Cassandra-trunk #1078 [FAILURE] 2fe1c304835ef39093b70cbb89107383be3c3ee9

-------------------------------------------------------------------------------
Build Cassandra-trunk #1078 Still Failing
URL: https://ci-cassandra.apache.org/job/Cassandra-trunk/1078/
-------------------------------------------------------------------------------
Changes:
[Yifan Cai] Fix flaky test LocalReadSizeWarningTest#failThresholdSinglePartition


-------------------------------------------------------------------------------
Failed Tests:
16 tests failed.
FAILED:  dtest-upgrade.upgrade_tests.cql_tests.TestCQLNodes2RF1_Upgrade_indev_4_0_x_To_indev_trunk.test_static_cf
FAILED:  dtest-upgrade.upgrade_tests.cql_tests.TestCQLNodes2RF1_Upgrade_current_4_0_x_To_indev_trunk.test_noncomposite_static_cf
FAILED:  dtest-upgrade.upgrade_tests.cql_tests.cls.test_static_cf
FAILED:  dtest-upgrade.upgrade_tests.cql_tests.TestCQLNodes2RF1_Upgrade_indev_3_0_x_To_indev_trunk.test_static_cf
FAILED:  dtest-upgrade.upgrade_tests.cql_tests.TestCQLNodes2RF1_Upgrade_current_3_11_x_To_indev_trunk.test_noncomposite_static_cf
FAILED:  org.apache.cassandra.distributed.test.CASTest.testConflictingWritesWithStaleRingInformation
FAILED:  org.apache.cassandra.utils.memory.LongBufferPoolTest.testPoolAllocateWithRecyclePartially
FAILED:  org.apache.cassandra.cql3.KeywordTest.test[keyword DECIMAL isReserved false]
FAILED:  org.apache.cassandra.db.RangeTombstoneTest.overlappingRangeTest-compression
FAILED:  org.apache.cassandra.db.commitlog.CommitLogSegmentManagerCDCTest.testCDCIndexFileWriteOnSync
FAILED:  org.apache.cassandra.db.commitlog.BatchCommitLogTest.testOutOfOrderLogDiscard[3]
FAILED:  dtest-upgrade.upgrade_tests.cql_tests.TestCQLNodes2RF1_Upgrade_current_4_0_x_To_indev_trunk.test_static_cf
FAILED:  org.apache.cassandra.distributed.test.CasCriticalSectionTest.criticalSectionTest
FAILED:  dtest-novnode.write_failures_test.TestMultiDCWriteFailures.test_oversized_mutation
FAILED:  dtest-offheap.write_failures_test.TestMultiDCWriteFailures.test_oversized_mutation
FAILED:  dtest.write_failures_test.TestMultiDCWriteFailures.test_oversized_mutation

-------------------------------------------------------------------------------
For complete test report and logs see https://nightlies.apache.org/cassandra/Cassandra-trunk/1078/