You are viewing a plain text version of this content. The canonical link for it is here.
Posted to dev@poi.apache.org by Apache Jenkins Server <je...@builds.apache.org> on 2022/02/22 04:10:22 UTC
Build failed in Jenkins: POI » POI-DSL-Windows-1.17 #168
See <https://ci-builds.apache.org/job/POI/job/POI-DSL-Windows-1.17/168/display/redirect?page=changes>
Changes:
[PJ Fanning] java 17 build issue
[PJ Fanning] java 17 build issue
[PJ Fanning] java 17 build issue
[PJ Fanning] revert java 17 change - even more build trouble
[PJ Fanning] java 17 build issue
[PJ Fanning] sonar issues
[PJ Fanning] re-enable test but make it less stressful - now goes OOM very easily
[PJ Fanning] add test
[PJ Fanning] disable test again
[PJ Fanning] refactor IOUtils.toByteArray
[PJ Fanning] refactor IOUtils.toByteArray
[PJ Fanning] refactor IOUtils.toByteArray
[Andreas Beeker] quote typo
[Andreas Beeker] Use gradle toolchain to specify the jdk version and vendor, e.g.
> gradle -no-build-cache -PjdkVersion=16 -PjdkVendor=oracle clean check
[Andreas Beeker] #65908 - XAdES-XL modifications due to specification check errors
[PJ Fanning] formatting
[PJ Fanning] add tests
[PJ Fanning] update changes
[PJ Fanning] update changes
[PJ Fanning] add tests
[PJ Fanning] add tests
[PJ Fanning] fix issue
[PJ Fanning] add tests
[PJ Fanning] case insensitive r1c1 refs
[PJ Fanning] remove test (added accidentally)
[PJ Fanning] add tests
------------------------------------------
[...truncated 83.15 KB...]
class file has wrong version 61.0, should be 55.0
Please remove or make sure it appears in the correct subdirectory of the classpath.
F:\jenkins\jenkins-home\712657a4\workspace\POI\POI-DSL-Windows-1.17\poi-excelant\src\main\java\org\apache\poi\ss\excelant\util\ExcelAntWorkbookUtil.java:41: error: cannot access WorkbookFactory
import org.apache.poi.ss.usermodel.WorkbookFactory;
^
bad class file: F:\jenkins\jenkins-home\712657a4\workspace\POI\POI-DSL-Windows-1.17\poi\build\classes\java\main\org\apache\poi\ss\usermodel\WorkbookFactory.class
class file has wrong version 61.0, should be 55.0
Please remove or make sure it appears in the correct subdirectory of the classpath.
F:\jenkins\jenkins-home\712657a4\workspace\POI\POI-DSL-Windows-1.17\poi-excelant\src\main\java\org\apache\poi\ss\excelant\util\ExcelAntWorkbookUtil.java:42: error: cannot access CellReference
import org.apache.poi.ss.util.CellReference;
^
bad class file: F:\jenkins\jenkins-home\712657a4\workspace\POI\POI-DSL-Windows-1.17\poi\build\classes\java\main\org\apache\poi\ss\util\CellReference.class
class file has wrong version 61.0, should be 55.0
Please remove or make sure it appears in the correct subdirectory of the classpath.
F:\jenkins\jenkins-home\712657a4\workspace\POI\POI-DSL-Windows-1.17\poi-excelant\src\main\java\org\apache\poi\ss\excelant\util\ExcelAntWorkbookUtil.java:43: error: cannot access XSSFFormulaEvaluator
import org.apache.poi.xssf.usermodel.XSSFFormulaEvaluator;
^
bad class file: F:\jenkins\jenkins-home\712657a4\workspace\POI\POI-DSL-Windows-1.17\poi-ooxml\build\classes\java\main\org\apache\poi\xssf\usermodel\XSSFFormulaEvaluator.class
class file has wrong version 61.0, should be 55.0
Please remove or make sure it appears in the correct subdirectory of the classpath.
F:\jenkins\jenkins-home\712657a4\workspace\POI\POI-DSL-Windows-1.17\poi-excelant\src\main\java\org\apache\poi\ss\excelant\util\ExcelAntWorkbookUtil.java:44: error: cannot access XSSFWorkbook
import org.apache.poi.xssf.usermodel.XSSFWorkbook;
^
bad class file: F:\jenkins\jenkins-home\712657a4\workspace\POI\POI-DSL-Windows-1.17\poi-ooxml\build\classes\java\main\org\apache\poi\xssf\usermodel\XSSFWorkbook.class
class file has wrong version 61.0, should be 55.0
Please remove or make sure it appears in the correct subdirectory of the classpath.
F:\jenkins\jenkins-home\712657a4\workspace\POI\POI-DSL-Windows-1.17\poi-excelant\src\main\java\org\apache\poi\ss\excelant\util\ExcelAntWorkbookUtil.java:57: error: cannot find symbol
private Workbook workbook;
^
symbol: class Workbook
location: class ExcelAntWorkbookUtil
F:\jenkins\jenkins-home\712657a4\workspace\POI\POI-DSL-Windows-1.17\poi-excelant\src\main\java\org\apache\poi\ss\excelant\util\ExcelAntWorkbookUtil.java:59: error: cannot find symbol
private final Map<String, FreeRefFunction> xlsMacroList = new HashMap<>();
^
symbol: class FreeRefFunction
location: class ExcelAntWorkbookUtil
F:\jenkins\jenkins-home\712657a4\workspace\POI\POI-DSL-Windows-1.17\poi-excelant\src\main\java\org\apache\poi\ss\excelant\util\ExcelAntWorkbookUtil.java:80: error: cannot find symbol
protected ExcelAntWorkbookUtil(Workbook wb) {
^
symbol: class Workbook
location: class ExcelAntWorkbookUtil
F:\jenkins\jenkins-home\712657a4\workspace\POI\POI-DSL-Windows-1.17\poi-excelant\src\main\java\org\apache\poi\ss\excelant\util\ExcelAntWorkbookUtil.java:89: error: cannot find symbol
private Workbook loadWorkbook() {
^
symbol: class Workbook
location: class ExcelAntWorkbookUtil
F:\jenkins\jenkins-home\712657a4\workspace\POI\POI-DSL-Windows-1.17\poi-excelant\src\main\java\org\apache\poi\ss\excelant\util\ExcelAntWorkbookUtil.java:130: error: cannot find symbol
protected void addFunction(String name, FreeRefFunction func) {
^
symbol: class FreeRefFunction
location: class ExcelAntWorkbookUtil
F:\jenkins\jenkins-home\712657a4\workspace\POI\POI-DSL-Windows-1.17\poi-excelant\src\main\java\org\apache\poi\ss\excelant\util\ExcelAntWorkbookUtil.java:140: error: cannot find symbol
protected UDFFinder getFunctions() {
^
symbol: class UDFFinder
location: class ExcelAntWorkbookUtil
F:\jenkins\jenkins-home\712657a4\workspace\POI\POI-DSL-Windows-1.17\poi-excelant\src\main\java\org\apache\poi\ss\excelant\util\ExcelAntWorkbookUtil.java:165: error: cannot find symbol
protected FormulaEvaluator getEvaluator(String fileName) {
^
symbol: class FormulaEvaluator
location: class ExcelAntWorkbookUtil
F:\jenkins\jenkins-home\712657a4\workspace\POI\POI-DSL-Windows-1.17\poi-excelant\src\main\java\org\apache\poi\ss\excelant\util\ExcelAntWorkbookUtil.java:192: error: cannot find symbol
public Workbook getWorkbook() {
^
symbol: class Workbook
location: class ExcelAntWorkbookUtil
F:\jenkins\jenkins-home\712657a4\workspace\POI\POI-DSL-Windows-1.17\poi-excelant\src\main\java\org\apache\poi\ss\excelant\util\ExcelAntWorkbookUtil.java:326: error: cannot find symbol
private Cell getCell(String cellName) {
^
symbol: class Cell
location: class ExcelAntWorkbookUtil
F:\jenkins\jenkins-home\712657a4\workspace\POI\POI-DSL-Windows-1.17\poi-excelant\src\main\java\org\apache\poi\ss\excelant\IExcelAntWorkbookHandler.java:35: error: cannot find symbol
public void setWorkbook( Workbook workbook ) ;
^
symbol: class Workbook
location: interface IExcelAntWorkbookHandler
27 errors
> Task :poi:javadoc
error: cannot access POIXMLExtractorFactory
bad class file: F:\jenkins\jenkins-home\712657a4\workspace\POI\POI-DSL-Windows-1.17\poi-ooxml\build\classes\java\main\org\apache\poi\ooxml\extractor\POIXMLExtractorFactory.class
class file has wrong version 61.0, should be 55.0
Please remove or make sure it appears in the correct subdirectory of the classpath.
F:\jenkins\jenkins-home\712657a4\workspace\POI\POI-DSL-Windows-1.17\poi\src\main\java\org\apache\poi\extractor\ExtractorFactory.java:50: error: reference not found
* {@link org.apache.poi.ooxml.extractor.POIXMLExtractorFactory} contained within
^
F:\jenkins\jenkins-home\712657a4\workspace\POI\POI-DSL-Windows-1.17\poi\src\main\java\org\apache\poi\extractor\ExtractorFactory.java:1: error: cannot access VisioTextExtractor
/* ====================================================================
^
bad class file: F:\jenkins\jenkins-home\712657a4\workspace\POI\POI-DSL-Windows-1.17\poi-scratchpad\build\classes\java\main\org\apache\poi\hdgf\extractor\VisioTextExtractor.class
class file has wrong version 61.0, should be 55.0
Please remove or make sure it appears in the correct subdirectory of the classpath.
F:\jenkins\jenkins-home\712657a4\workspace\POI\POI-DSL-Windows-1.17\poi\src\main\java\org\apache\poi\extractor\POIOLE2TextExtractor.java:33: error: reference not found
* @see org.apache.poi.hdgf.extractor.VisioTextExtractor
^
F:\jenkins\jenkins-home\712657a4\workspace\POI\POI-DSL-Windows-1.17\poi\src\main\java\org\apache\poi\extractor\POIOLE2TextExtractor.java:34: error: reference not found
* @see org.apache.poi.hwpf.extractor.WordExtractor
^
F:\jenkins\jenkins-home\712657a4\workspace\POI\POI-DSL-Windows-1.17\poi\src\main\java\org\apache\poi\extractor\POITextExtractor.java:30: error: reference not found
* @see org.apache.poi.hdgf.extractor.VisioTextExtractor
^
F:\jenkins\jenkins-home\712657a4\workspace\POI\POI-DSL-Windows-1.17\poi\src\main\java\org\apache\poi\extractor\POITextExtractor.java:31: error: reference not found
* @see org.apache.poi.hwpf.extractor.WordExtractor
^
F:\jenkins\jenkins-home\712657a4\workspace\POI\POI-DSL-Windows-1.17\poi\src\main\java\org\apache\poi\ss\usermodel\ExtendedColor.java:23: error: reference not found
* {@link org.apache.poi.xssf.usermodel.XSSFColor} or a
^
F:\jenkins\jenkins-home\712657a4\workspace\POI\POI-DSL-Windows-1.17\poi\src\main\java\org\apache\poi\ss\formula\eval\forked\ForkedEvaluator.java:39: error: reference not found
* 90% of memory consumption is due to loading of the {@link HSSFWorkbook} or {@link org.apache.poi.xssf.usermodel.XSSFWorkbook}.
^
F:\jenkins\jenkins-home\712657a4\workspace\POI\POI-DSL-Windows-1.17\poi\src\main\java\org\apache\poi\ss\util\PropertyTemplate.java:43: error: reference not found
* {@link org.apache.poi.xssf.streaming.SXSSFWorkbook} Spreadsheets are not
^
F:\jenkins\jenkins-home\712657a4\workspace\POI\POI-DSL-Windows-1.17\poi\src\main\java\org\apache\poi\ss\util\PropertyTemplate.java:45: error: reference not found
* {@link HSSFWorkbook} and {@link org.apache.poi.xssf.usermodel.XSSFWorkbook}
^
> Task :poi-ooxml:compileTestJava
F:\jenkins\jenkins-home\712657a4\workspace\POI\POI-DSL-Windows-1.17\poi-ooxml\src\test\java\org\apache\poi\xssf\usermodel\TestXSSFFont.java:20: warning: [deprecation] FontCharset in org.apache.poi.ss.usermodel has been deprecated
import static org.apache.poi.ss.usermodel.FontCharset.*;
^
F:\jenkins\jenkins-home\712657a4\workspace\POI\POI-DSL-Windows-1.17\poi-ooxml\src\test\java\org\apache\poi\xddf\usermodel\chart\TestXDDFChartRemoveSeries.java:129: warning: [deprecation] getSeries() in XDDFChartData has been deprecated
assertThrows(UnsupportedOperationException.class, () -> chartData.getSeries().remove(0));
^
> Task :poi:javadoc
F:\jenkins\jenkins-home\712657a4\workspace\POI\POI-DSL-Windows-1.17\poi\src\main\java\org\apache\poi\extractor\ExtractorFactory.java:1: error: cannot access ColorSchemeAtom
/* ====================================================================
^
bad class file: F:\jenkins\jenkins-home\712657a4\workspace\POI\POI-DSL-Windows-1.17\poi-scratchpad\build\classes\java\main\org\apache\poi\hslf\record\ColorSchemeAtom.class
class file has wrong version 61.0, should be 55.0
Please remove or make sure it appears in the correct subdirectory of the classpath.
F:\jenkins\jenkins-home\712657a4\workspace\POI\POI-DSL-Windows-1.17\poi\src\main\java\org\apache\poi\ddf\EscherColorRef.java:285: error: reference not found
* @see org.apache.poi.hslf.record.ColorSchemeAtom#getColor(int)
^
F:\jenkins\jenkins-home\712657a4\workspace\POI\POI-DSL-Windows-1.17\poi\src\main\java\org\apache\poi\extractor\ExtractorFactory.java:262: error: reference not found
* {@link org.apache.poi.ooxml.extractor.POIXMLExtractorFactory} for that.
^
F:\jenkins\jenkins-home\712657a4\workspace\POI\POI-DSL-Windows-1.17\poi\src\main\java\org\apache\poi\extractor\ExtractorFactory.java:281: error: reference not found
* {@link org.apache.poi.ooxml.extractor.POIXMLExtractorFactory} for that.
^
F:\jenkins\jenkins-home\712657a4\workspace\POI\POI-DSL-Windows-1.17\poi\src\main\java\org\apache\poi\ss\formula\OperationEvaluationContext.java:213: warning: no description for @throws
* @throws IllegalArgumentException
^
F:\jenkins\jenkins-home\712657a4\workspace\POI\POI-DSL-Windows-1.17\poi\src\main\java\org\apache\poi\ss\formula\OperationEvaluationContext.java:214: warning: no description for @throws
* @throws IllegalStateException
^
> Task :poi-ooxml:compileTestJava
F:\jenkins\jenkins-home\712657a4\workspace\POI\POI-DSL-Windows-1.17\poi-ooxml\src\test\java\org\apache\poi\xssf\extractor\TestXSSFExportToXML.java:692: warning: [unchecked] getPrefixes(String) in TestXSSFExportToXML.XPathNSContext implements getPrefixes(String) in NamespaceContext
public Iterator getPrefixes(String val) {
^
return type requires unchecked conversion from Iterator to Iterator<String>
F:\jenkins\jenkins-home\712657a4\workspace\POI\POI-DSL-Windows-1.17\poi-ooxml\src\test\java\org\apache\poi\xssf\usermodel\TestXSSFWorkbook.java:1361: warning: [deprecation] getCTExternalLink() in ExternalLinksTable has been deprecated
CTExternalLink link = workbook2.getExternalLinksTable().get(0).getCTExternalLink();
^
F:\jenkins\jenkins-home\712657a4\workspace\POI\POI-DSL-Windows-1.17\poi-ooxml\src\test\java\org\apache\poi\xwpf\usermodel\TestXWPFRun.java:203: warning: [deprecation] getFontSize() in XWPFRun has been deprecated
assertEquals(7, run.getFontSize());
^
F:\jenkins\jenkins-home\712657a4\workspace\POI\POI-DSL-Windows-1.17\poi-ooxml\src\test\java\org\apache\poi\xwpf\usermodel\TestXWPFRun.java:211: warning: [deprecation] getFontSize() in XWPFRun has been deprecated
assertEquals(25, run.getFontSize());
^
F:\jenkins\jenkins-home\712657a4\workspace\POI\POI-DSL-Windows-1.17\poi-ooxml\src\test\java\org\apache\poi\xwpf\usermodel\TestXWPFRun.java:589: warning: [deprecation] getFontSize() in XWPFRun has been deprecated
assertEquals(-1, run.getFontSize());
^
F:\jenkins\jenkins-home\712657a4\workspace\POI\POI-DSL-Windows-1.17\poi-ooxml\src\test\java\org\apache\poi\xwpf\usermodel\TestXWPFRun.java:592: warning: [deprecation] getFontSize() in XWPFRun has been deprecated
assertEquals(10, run.getFontSize());
^
F:\jenkins\jenkins-home\712657a4\workspace\POI\POI-DSL-Windows-1.17\poi-ooxml\src\test\java\org\apache\poi\xwpf\usermodel\TestXWPFRun.java:595: warning: [deprecation] getFontSize() in XWPFRun has been deprecated
assertEquals(Short.MAX_VALUE - 1, run.getFontSize());
^
F:\jenkins\jenkins-home\712657a4\workspace\POI\POI-DSL-Windows-1.17\poi-ooxml\src\test\java\org\apache\poi\xwpf\usermodel\TestXWPFRun.java:598: warning: [deprecation] getFontSize() in XWPFRun has been deprecated
assertEquals(Short.MAX_VALUE, run.getFontSize());
^
F:\jenkins\jenkins-home\712657a4\workspace\POI\POI-DSL-Windows-1.17\poi-ooxml\src\test\java\org\apache\poi\xwpf\usermodel\TestXWPFRun.java:601: warning: [deprecation] getFontSize() in XWPFRun has been deprecated
assertEquals(Short.MAX_VALUE + 1, run.getFontSize());
^
F:\jenkins\jenkins-home\712657a4\workspace\POI\POI-DSL-Windows-1.17\poi-ooxml\src\test\java\org\apache\poi\xwpf\usermodel\TestXWPFRun.java:604: warning: [deprecation] getFontSize() in XWPFRun has been deprecated
assertEquals(Integer.MAX_VALUE - 1, run.getFontSize());
^
F:\jenkins\jenkins-home\712657a4\workspace\POI\POI-DSL-Windows-1.17\poi-ooxml\src\test\java\org\apache\poi\xwpf\usermodel\TestXWPFRun.java:607: warning: [deprecation] getFontSize() in XWPFRun has been deprecated
assertEquals(Integer.MAX_VALUE, run.getFontSize());
^
F:\jenkins\jenkins-home\712657a4\workspace\POI\POI-DSL-Windows-1.17\poi-ooxml\src\test\java\org\apache\poi\xwpf\usermodel\TestXWPFRun.java:610: warning: [deprecation] getFontSize() in XWPFRun has been deprecated
assertEquals(-1, run.getFontSize());
^
F:\jenkins\jenkins-home\712657a4\workspace\POI\POI-DSL-Windows-1.17\poi-ooxml\src\test\java\org\apache\poi\xwpf\usermodel\TestXWPFRun.java:658: warning: [deprecation] getFontSize() in XWPFRun has been deprecated
assertEquals(10, run.getFontSize());
^
15 warnings
> Task :poi:javadoc
F:\jenkins\jenkins-home\712657a4\workspace\POI\POI-DSL-Windows-1.17\poi\src\main\java\org\apache\poi\extractor\ExtractorFactory.java:1: error: cannot access POIXMLDocument
/* ====================================================================
^
bad class file: F:\jenkins\jenkins-home\712657a4\workspace\POI\POI-DSL-Windows-1.17\poi-ooxml\build\classes\java\main\org\apache\poi\ooxml\POIXMLDocument.class
class file has wrong version 61.0, should be 55.0
Please remove or make sure it appears in the correct subdirectory of the classpath.
F:\jenkins\jenkins-home\712657a4\workspace\POI\POI-DSL-Windows-1.17\poi\src\main\java\org\apache\poi\sl\usermodel\SlideShow.java:133: error: reference not found
* or {@link org.apache.poi.ooxml.POIXMLDocument}
^
17 errors
2 warnings
> Task :poi:javadoc FAILED
FAILURE: Build completed with 2 failures.
1: Task failed with an exception.
-----------
* What went wrong:
Execution failed for task ':poi-excelant:javadoc'.
> Javadoc generation failed. Generated Javadoc options file (useful for troubleshooting): 'F:\jenkins\jenkins-home\712657a4\workspace\POI\POI-DSL-Windows-1.17\poi-excelant\build\tmp\javadoc\javadoc.options'
* Try:
> Run with --stacktrace option to get the stack trace.
> Run with --info or --debug option to get more log output.
> Run with --scan to get full insights.
==============================================================================
2: Task failed with an exception.
-----------
* What went wrong:
Execution failed for task ':poi:javadoc'.
> Javadoc generation failed. Generated Javadoc options file (useful for troubleshooting): 'F:\jenkins\jenkins-home\712657a4\workspace\POI\POI-DSL-Windows-1.17\poi\build\tmp\javadoc\javadoc.options'
* Try:
> Run with --stacktrace option to get the stack trace.
> Run with --info or --debug option to get more log output.
> Run with --scan to get full insights.
==============================================================================
* Get more help at https://help.gradle.org
Deprecated Gradle features were used in this build, making it incompatible with Gradle 8.0.
You can use '--warning-mode all' to show the individual deprecation warnings and determine if they come from your own scripts or plugins.
See https://docs.gradle.org/7.4/userguide/command_line_interface.html#sec:command_line_warnings
BUILD FAILED in 42m 7s
66 actionable tasks: 66 executed
Build step 'Invoke Gradle script' changed build result to FAILURE
Build step 'Invoke Gradle script' marked build as failure
[SpotBugs] Skipping execution of recorder since overall result is 'FAILURE'
Archiving artifacts
Recording test results
[Checks API] No suitable checks publisher found.
---------------------------------------------------------------------
To unsubscribe, e-mail: dev-unsubscribe@poi.apache.org
For additional commands, e-mail: dev-help@poi.apache.org
Jenkins build is back to normal : POI » POI-DSL-Windows-1.17 #173
Posted by Apache Jenkins Server <je...@builds.apache.org>.
See <https://ci-builds.apache.org/job/POI/job/POI-DSL-Windows-1.17/173/display/redirect?page=changes>
---------------------------------------------------------------------
To unsubscribe, e-mail: dev-unsubscribe@poi.apache.org
For additional commands, e-mail: dev-help@poi.apache.org
Build failed in Jenkins: POI » POI-DSL-Windows-1.17 #172
Posted by Apache Jenkins Server <je...@builds.apache.org>.
See <https://ci-builds.apache.org/job/POI/job/POI-DSL-Windows-1.17/172/display/redirect?page=changes>
Changes:
[Andreas Beeker] javadoc and forbiddenApis fix
------------------------------------------
[...truncated 70.18 KB...]
> Task :poi-ooxml:jar
> Task :poi-excelant:compileJava
> Task :poi-excelant:compileJava9 SKIPPED
> Task :poi-excelant:cacheJava9 NO-SOURCE
> Task :poi-excelant:classes
> Task :poi-excelant:jar
> Task :poi:javadoc
> Task :poi-examples:compileJava
> Task :poi-ooxml:compileTestJava
> Task :poi-excelant:javadoc
> Task :poi:javadoc
F:\jenkins\jenkins-home\712657a4\workspace\POI\POI-DSL-Windows-1.17\poi\src\main\java\org\apache\poi\hssf\model\InternalWorkbook.java:22: warning: [removal] AccessControlException in java.security has been deprecated and marked for removal
import java.security.AccessControlException;
^
F:\jenkins\jenkins-home\712657a4\workspace\POI\POI-DSL-Windows-1.17\poi\src\main\java\org\apache\poi\poifs\nio\CleanerUtil.java:28: warning: [removal] AccessController in java.security has been deprecated and marked for removal
import java.security.AccessController;
^
> Task :poi-examples:compileJava9 SKIPPED
> Task :poi-examples:cacheJava9 NO-SOURCE
> Task :poi-examples:classes
> Task :poi-examples:jar
> Task :poi-excelant:javadocJar
> Task :poi-excelant:assemble
> Task :poi-excelant:forbiddenApisMain
> Task :poi-examples:javadoc
> Task :poi-ooxml:compileTestJava
F:\jenkins\jenkins-home\712657a4\workspace\POI\POI-DSL-Windows-1.17\poi-ooxml\src\test\java\org\apache\poi\xssf\usermodel\TestXSSFFont.java:20: warning: [deprecation] FontCharset in org.apache.poi.ss.usermodel has been deprecated
import static org.apache.poi.ss.usermodel.FontCharset.*;
^
> Task :poi-excelant:spotbugsMain
5 SpotBugs violations were found.See the report at: file:///F:/jenkins/jenkins-home/712657a4/workspace/POI/POI-DSL-Windows-1.17/poi-excelant/build/reports/spotbugs/main.xml
> Task :poi-ooxml:compileTestJava
F:\jenkins\jenkins-home\712657a4\workspace\POI\POI-DSL-Windows-1.17\poi-ooxml\src\test\java\org\apache\poi\xddf\usermodel\chart\TestXDDFChartRemoveSeries.java:129: warning: [deprecation] getSeries() in XDDFChartData has been deprecated
assertThrows(UnsupportedOperationException.class, () -> chartData.getSeries().remove(0));
^
F:\jenkins\jenkins-home\712657a4\workspace\POI\POI-DSL-Windows-1.17\poi-ooxml\src\test\java\org\apache\poi\xssf\extractor\TestXSSFExportToXML.java:692: warning: [unchecked] getPrefixes(String) in TestXSSFExportToXML.XPathNSContext implements getPrefixes(String) in NamespaceContext
public Iterator getPrefixes(String val) {
^
return type requires unchecked conversion from Iterator to Iterator<String>
> Task :poi-scratchpad:javadoc
> Task :poi-ooxml:compileTestJava
F:\jenkins\jenkins-home\712657a4\workspace\POI\POI-DSL-Windows-1.17\poi-ooxml\src\test\java\org\apache\poi\xssf\usermodel\TestXSSFWorkbook.java:1361: warning: [deprecation] getCTExternalLink() in ExternalLinksTable has been deprecated
CTExternalLink link = workbook2.getExternalLinksTable().get(0).getCTExternalLink();
^
F:\jenkins\jenkins-home\712657a4\workspace\POI\POI-DSL-Windows-1.17\poi-ooxml\src\test\java\org\apache\poi\xwpf\usermodel\TestXWPFRun.java:203: warning: [deprecation] getFontSize() in XWPFRun has been deprecated
assertEquals(7, run.getFontSize());
^
F:\jenkins\jenkins-home\712657a4\workspace\POI\POI-DSL-Windows-1.17\poi-ooxml\src\test\java\org\apache\poi\xwpf\usermodel\TestXWPFRun.java:211: warning: [deprecation] getFontSize() in XWPFRun has been deprecated
assertEquals(25, run.getFontSize());
^
F:\jenkins\jenkins-home\712657a4\workspace\POI\POI-DSL-Windows-1.17\poi-ooxml\src\test\java\org\apache\poi\xwpf\usermodel\TestXWPFRun.java:589: warning: [deprecation] getFontSize() in XWPFRun has been deprecated
assertEquals(-1, run.getFontSize());
^
F:\jenkins\jenkins-home\712657a4\workspace\POI\POI-DSL-Windows-1.17\poi-ooxml\src\test\java\org\apache\poi\xwpf\usermodel\TestXWPFRun.java:592: warning: [deprecation] getFontSize() in XWPFRun has been deprecated
assertEquals(10, run.getFontSize());
^
F:\jenkins\jenkins-home\712657a4\workspace\POI\POI-DSL-Windows-1.17\poi-ooxml\src\test\java\org\apache\poi\xwpf\usermodel\TestXWPFRun.java:595: warning: [deprecation] getFontSize() in XWPFRun has been deprecated
assertEquals(Short.MAX_VALUE - 1, run.getFontSize());
^
F:\jenkins\jenkins-home\712657a4\workspace\POI\POI-DSL-Windows-1.17\poi-ooxml\src\test\java\org\apache\poi\xwpf\usermodel\TestXWPFRun.java:598: warning: [deprecation] getFontSize() in XWPFRun has been deprecated
assertEquals(Short.MAX_VALUE, run.getFontSize());
^
F:\jenkins\jenkins-home\712657a4\workspace\POI\POI-DSL-Windows-1.17\poi-ooxml\src\test\java\org\apache\poi\xwpf\usermodel\TestXWPFRun.java:601: warning: [deprecation] getFontSize() in XWPFRun has been deprecated
assertEquals(Short.MAX_VALUE + 1, run.getFontSize());
^
F:\jenkins\jenkins-home\712657a4\workspace\POI\POI-DSL-Windows-1.17\poi-ooxml\src\test\java\org\apache\poi\xwpf\usermodel\TestXWPFRun.java:604: warning: [deprecation] getFontSize() in XWPFRun has been deprecated
assertEquals(Integer.MAX_VALUE - 1, run.getFontSize());
^
F:\jenkins\jenkins-home\712657a4\workspace\POI\POI-DSL-Windows-1.17\poi-ooxml\src\test\java\org\apache\poi\xwpf\usermodel\TestXWPFRun.java:607: warning: [deprecation] getFontSize() in XWPFRun has been deprecated
assertEquals(Integer.MAX_VALUE, run.getFontSize());
^
F:\jenkins\jenkins-home\712657a4\workspace\POI\POI-DSL-Windows-1.17\poi-ooxml\src\test\java\org\apache\poi\xwpf\usermodel\TestXWPFRun.java:610: warning: [deprecation] getFontSize() in XWPFRun has been deprecated
assertEquals(-1, run.getFontSize());
^
F:\jenkins\jenkins-home\712657a4\workspace\POI\POI-DSL-Windows-1.17\poi-ooxml\src\test\java\org\apache\poi\xwpf\usermodel\TestXWPFRun.java:658: warning: [deprecation] getFontSize() in XWPFRun has been deprecated
assertEquals(10, run.getFontSize());
^
15 warnings
> Task :poi-ooxml:compileTest9 SKIPPED
> Task :poi-ooxml:cacheTest9 NO-SOURCE
> Task :poi-ooxml:testClasses
> Task :poi-examples:javadocJar
> Task :poi-examples:assemble
> Task :poi-ooxml:testJar
> Task :poi-examples:forbiddenApisMain
> Task :poi-ooxml:test
OpenJDK 64-Bit Server VM warning: Ignoring option --illegal-access=warn; support was removed in 17.0
WARNING: Unknown module: org.junit.platform.commons specified to --add-exports
WARNING: Unknown module: org.junit.platform.commons specified to --add-exports
> Task :poi-integration:compileTestJava
[Test worker] INFO org.gradle.api.internal.tasks.testing.worker.TestWorker - Gradle Test Executor 8 started executing tests.
> Task :poi-ooxml:test
OpenJDK 64-Bit Server VM warning: Ignoring option --illegal-access=warn; support was removed in 17.0
WARNING: Unknown module: org.junit.platform.commons specified to --add-exports
WARNING: Unknown module: org.junit.platform.commons specified to --add-exports
[Test worker] INFO org.gradle.api.internal.tasks.testing.worker.TestWorker - Gradle Test Executor 9 started executing tests.
> Task :poi:javadoc
2 warnings
> Task :poi-excelant:compileTestJava
> Task :poi-excelant:compileTest9 SKIPPED
> Task :poi-excelant:cacheTest9 NO-SOURCE
> Task :poi-excelant:testClasses
> Task :poi-excelant:forbiddenApisTest
> Task :poi-excelant:forbiddenApis
> Task :poi-excelant:spotbugsTest
> Task :poi-excelant:testJar
> Task :poi-integration:compileTest9 SKIPPED
> Task :poi-integration:cacheTest9 NO-SOURCE
> Task :poi-integration:testClasses
> Task :poi-integration:testJar
> Task :poi:javadocJar
> Task :poi-excelant:test
OpenJDK 64-Bit Server VM warning: Ignoring option --illegal-access=warn; support was removed in 17.0
WARNING: Unknown module: org.junit.platform.commons specified to --add-exports
WARNING: Unknown module: org.junit.platform.commons specified to --add-exports
> Task :allJavaDoc
> Task :poi-integration:test
[Test worker] INFO org.gradle.api.internal.tasks.testing.worker.TestWorker - Gradle Test Executor 10 started executing tests.
[Test worker] INFO org.gradle.api.internal.tasks.testing.worker.TestWorker - Gradle Test Executor 10 finished executing tests.
> Task :poi-excelant:test
OpenJDK 64-Bit Server VM warning: Ignoring option --illegal-access=warn; support was removed in 17.0
WARNING: Unknown module: org.junit.platform.commons specified to --add-exports
WARNING: Unknown module: org.junit.platform.commons specified to --add-exports
[Test worker] INFO org.gradle.api.internal.tasks.testing.worker.TestWorker - Gradle Test Executor 11 started executing tests.
[Test worker] INFO org.gradle.api.internal.tasks.testing.worker.TestWorker - Gradle Test Executor 11 finished executing tests.
> Task :poi-integration:test
OpenJDK 64-Bit Server VM warning: Ignoring option --illegal-access=warn; support was removed in 17.0
WARNING: Unknown module: org.junit.platform.commons specified to --add-exports
WARNING: Unknown module: org.junit.platform.commons specified to --add-exports
[Test worker] INFO org.gradle.api.internal.tasks.testing.worker.TestWorker - Gradle Test Executor 12 started executing tests.
> Task :poi-ooxml:test
TestXSSFBugs > test58896WithFile() FAILED
org.opentest4j.AssertionFailedError at TestXSSFBugs.java:3313
[Test worker] INFO org.gradle.api.internal.tasks.testing.worker.TestWorker - Gradle Test Executor 9 finished executing tests.
> Task :poi-integration:test
OpenJDK 64-Bit Server VM warning: Ignoring option --illegal-access=warn; support was removed in 17.0
WARNING: Unknown module: org.junit.platform.commons specified to --add-exports
WARNING: Unknown module: org.junit.platform.commons specified to --add-exports
[Test worker] INFO org.gradle.api.internal.tasks.testing.worker.TestWorker - Gradle Test Executor 13 started executing tests.
[Test worker] INFO org.gradle.api.internal.tasks.testing.worker.TestWorker - Gradle Test Executor 13 finished executing tests.
> Task :poi-excelant:check
> Task :poi-excelant:build
> Task :poi:assemble
> Task :poi:build
> Task :poi-examples:compileTestJava
> Task :poi-examples:testClasses
> Task :poi-examples:forbiddenApisTest
> Task :poi-examples:forbiddenApis
> Task :poi-examples:spotbugsMain
[Test worker] INFO org.gradle.api.internal.tasks.testing.worker.TestWorker - Gradle Test Executor 8 finished executing tests.
> Task :poi-ooxml:test
3084 tests completed, 1 failed, 114 skipped
> Task :poi-ooxml:test FAILED
> Task :poi-examples:spotbugsMain
21 SpotBugs violations were found.See the report at: file:///F:/jenkins/jenkins-home/712657a4/workspace/POI/POI-DSL-Windows-1.17/poi-examples/build/reports/spotbugs/main.xml
FATAL: command execution failed
java.io.IOException: Backing channel 'JNLP4-connect connection from 52.177.73.244/52.177.73.244:62322' is disconnected.
at hudson.remoting.RemoteInvocationHandler.channelOrFail(RemoteInvocationHandler.java:216)
at hudson.remoting.RemoteInvocationHandler.invoke(RemoteInvocationHandler.java:286)
at com.sun.proxy.$Proxy162.isAlive(Unknown Source)
at hudson.Launcher$RemoteLauncher$ProcImpl.isAlive(Launcher.java:1213)
at hudson.Launcher$RemoteLauncher$ProcImpl.join(Launcher.java:1205)
at hudson.Launcher$ProcStarter.join(Launcher.java:522)
at hudson.plugins.gradle.Gradle.perform(Gradle.java:317)
at hudson.tasks.BuildStepMonitor$1.perform(BuildStepMonitor.java:20)
at hudson.model.AbstractBuild$AbstractBuildExecution.perform(AbstractBuild.java:806)
at hudson.model.Build$BuildExecution.build(Build.java:198)
at hudson.model.Build$BuildExecution.doRun(Build.java:163)
at hudson.model.AbstractBuild$AbstractBuildExecution.run(AbstractBuild.java:514)
at hudson.model.Run.execute(Run.java:1888)
at hudson.model.FreeStyleBuild.run(FreeStyleBuild.java:43)
at hudson.model.ResourceController.execute(ResourceController.java:99)
at hudson.model.Executor.run(Executor.java:432)
Caused by: java.nio.channels.ClosedChannelException
at org.jenkinsci.remoting.protocol.impl.ChannelApplicationLayer.onReadClosed(ChannelApplicationLayer.java:238)
at org.jenkinsci.remoting.protocol.ApplicationLayer.onRecvClosed(ApplicationLayer.java:221)
at org.jenkinsci.remoting.protocol.ProtocolStack$Ptr.onRecvClosed(ProtocolStack.java:825)
at org.jenkinsci.remoting.protocol.FilterLayer.onRecvClosed(FilterLayer.java:288)
at org.jenkinsci.remoting.protocol.impl.SSLEngineFilterLayer.onRecvClosed(SSLEngineFilterLayer.java:179)
at org.jenkinsci.remoting.protocol.impl.SSLEngineFilterLayer.switchToNoSecure(SSLEngineFilterLayer.java:281)
at org.jenkinsci.remoting.protocol.impl.SSLEngineFilterLayer.processWrite(SSLEngineFilterLayer.java:501)
at org.jenkinsci.remoting.protocol.impl.SSLEngineFilterLayer.processQueuedWrites(SSLEngineFilterLayer.java:246)
at org.jenkinsci.remoting.protocol.impl.SSLEngineFilterLayer.doSend(SSLEngineFilterLayer.java:198)
at org.jenkinsci.remoting.protocol.impl.SSLEngineFilterLayer.doCloseSend(SSLEngineFilterLayer.java:211)
at org.jenkinsci.remoting.protocol.ProtocolStack$Ptr.doCloseSend(ProtocolStack.java:793)
at org.jenkinsci.remoting.protocol.ApplicationLayer.doCloseWrite(ApplicationLayer.java:172)
at org.jenkinsci.remoting.protocol.impl.ChannelApplicationLayer$ByteBufferCommandTransport.closeWrite(ChannelApplicationLayer.java:340)
at hudson.remoting.Channel.close(Channel.java:1501)
at hudson.remoting.Channel.close(Channel.java:1454)
at hudson.slaves.SlaveComputer.closeChannel(SlaveComputer.java:894)
at hudson.slaves.SlaveComputer.access$100(SlaveComputer.java:108)
at hudson.slaves.SlaveComputer$2.run(SlaveComputer.java:774)
at jenkins.util.ContextResettingExecutorService$1.run(ContextResettingExecutorService.java:28)
at jenkins.security.ImpersonatingExecutorService$1.run(ImpersonatingExecutorService.java:68)
at java.util.concurrent.Executors$RunnableAdapter.call(Executors.java:511)
at java.util.concurrent.FutureTask.run(FutureTask.java:266)
at java.util.concurrent.ThreadPoolExecutor.runWorker(ThreadPoolExecutor.java:1149)
at java.util.concurrent.ThreadPoolExecutor$Worker.run(ThreadPoolExecutor.java:624)
at java.lang.Thread.run(Thread.java:748)
Build step 'Invoke Gradle script' changed build result to FAILURE
Build step 'Invoke Gradle script' marked build as failure
ERROR: Step ‘Record compiler warnings and static analysis results’ aborted due to exception:
java.io.IOException: No workspace found for POI/POI-DSL-Windows-1.17 #172
at io.jenkins.plugins.analysis.core.steps.IssuesRecorder.perform(IssuesRecorder.java:670)
at hudson.tasks.BuildStepMonitor$1.perform(BuildStepMonitor.java:20)
at hudson.model.AbstractBuild$AbstractBuildExecution.perform(AbstractBuild.java:806)
at hudson.model.AbstractBuild$AbstractBuildExecution.performAllBuildSteps(AbstractBuild.java:755)
at hudson.model.Build$BuildExecution.post2(Build.java:178)
at hudson.model.AbstractBuild$AbstractBuildExecution.post(AbstractBuild.java:699)
at hudson.model.Run.execute(Run.java:1913)
at hudson.model.FreeStyleBuild.run(FreeStyleBuild.java:43)
at hudson.model.ResourceController.execute(ResourceController.java:99)
at hudson.model.Executor.run(Executor.java:432)
ERROR: Step ‘Archive the artifacts’ failed: no workspace for POI/POI-DSL-Windows-1.17 #172
ERROR: Step ‘Publish JUnit test result report’ failed: no workspace for POI/POI-DSL-Windows-1.17 #172
ERROR: Step ‘Record JaCoCo coverage report’ failed: no workspace for POI/POI-DSL-Windows-1.17 #172
---------------------------------------------------------------------
To unsubscribe, e-mail: dev-unsubscribe@poi.apache.org
For additional commands, e-mail: dev-help@poi.apache.org
Build failed in Jenkins: POI » POI-DSL-Windows-1.17 #171
Posted by Apache Jenkins Server <je...@builds.apache.org>.
See <https://ci-builds.apache.org/job/POI/job/POI-DSL-Windows-1.17/171/display/redirect?page=changes>
Changes:
[PJ Fanning] revert last github actions change
[PJ Fanning] try to fix github actions
[PJ Fanning] try to fix github actions
------------------------------------------
[...truncated 126.16 KB...]
^
symbol: class FontInfo
F:\jenkins\jenkins-slave\712657a4\workspace\POI\POI-DSL-Windows-1.17\poi-scratchpad\src\main\java\org\apache\poi\hwmf\record\HwmfFont.java:45: error: cannot find symbol
public class HwmfFont implements FontInfo, GenericRecord {
^
symbol: class GenericRecord
F:\jenkins\jenkins-slave\712657a4\workspace\POI\POI-DSL-Windows-1.17\poi-scratchpad\src\main\java\org\apache\poi\hwmf\draw\HwmfDrawProperties.java:282: error: cannot find symbol
public ImageRenderer getBrushBitmap() {
^
symbol: class ImageRenderer
location: class HwmfDrawProperties
F:\jenkins\jenkins-slave\712657a4\workspace\POI\POI-DSL-Windows-1.17\poi-scratchpad\src\main\java\org\apache\poi\hwmf\draw\HwmfDrawProperties.java:286: error: cannot find symbol
public void setBrushBitmap(ImageRenderer brushBitmap) {
^
symbol: class ImageRenderer
location: class HwmfDrawProperties
F:\jenkins\jenkins-slave\712657a4\workspace\POI\POI-DSL-Windows-1.17\poi-scratchpad\src\main\java\org\apache\poi\hwmf\record\HwmfFont.java:351: error: cannot find symbol
protected FontCharset charSet;
^
symbol: class FontCharset
location: class HwmfFont
F:\jenkins\jenkins-slave\712657a4\workspace\POI\POI-DSL-Windows-1.17\poi-scratchpad\src\main\java\org\apache\poi\hwmf\record\HwmfFont.java:119: error: cannot find symbol
public static class WmfClipPrecision implements GenericRecord {
^
symbol: class GenericRecord
location: class HwmfFont
F:\jenkins\jenkins-slave\712657a4\workspace\POI\POI-DSL-Windows-1.17\poi-scratchpad\src\main\java\org\apache\poi\hwmf\record\HwmfFont.java:383: error: cannot find symbol
protected FontFamily family;
^
symbol: class FontFamily
location: class HwmfFont
F:\jenkins\jenkins-slave\712657a4\workspace\POI\POI-DSL-Windows-1.17\poi-scratchpad\src\main\java\org\apache\poi\hwmf\record\HwmfFont.java:388: error: cannot find symbol
protected FontPitch pitch;
^
symbol: class FontPitch
location: class HwmfFont
F:\jenkins\jenkins-slave\712657a4\workspace\POI\POI-DSL-Windows-1.17\poi-scratchpad\src\main\java\org\apache\poi\hwmf\record\HwmfFont.java:397: error: cannot find symbol
public int init(LittleEndianInputStream leis, long recordSize) throws IOException {
^
symbol: class LittleEndianInputStream
location: class HwmfFont
F:\jenkins\jenkins-slave\712657a4\workspace\POI\POI-DSL-Windows-1.17\poi-scratchpad\src\main\java\org\apache\poi\hwmf\record\HwmfFont.java:487: error: cannot find symbol
public FontFamily getFamily() {
^
symbol: class FontFamily
location: class HwmfFont
F:\jenkins\jenkins-slave\712657a4\workspace\POI\POI-DSL-Windows-1.17\poi-scratchpad\src\main\java\org\apache\poi\hwmf\record\HwmfFont.java:492: error: cannot find symbol
public FontPitch getPitch() {
^
symbol: class FontPitch
location: class HwmfFont
F:\jenkins\jenkins-slave\712657a4\workspace\POI\POI-DSL-Windows-1.17\poi-scratchpad\src\main\java\org\apache\poi\hwmf\record\HwmfFont.java:502: error: cannot find symbol
public FontCharset getCharset() {
^
symbol: class FontCharset
location: class HwmfFont
F:\jenkins\jenkins-slave\712657a4\workspace\POI\POI-DSL-Windows-1.17\poi-scratchpad\src\main\java\org\apache\poi\hwmf\record\HwmfFont.java:511: error: cannot find symbol
protected int readString(LittleEndianInputStream leis, StringBuilder sb, int limit) {
^
symbol: class LittleEndianInputStream
location: class HwmfFont
F:\jenkins\jenkins-slave\712657a4\workspace\POI\POI-DSL-Windows-1.17\poi-scratchpad\src\main\java\org\apache\poi\hwmf\record\HwmfFont.java:515: error: cannot find symbol
protected int readString(LittleEndianInputStream leis, StringBuilder sb, int limit, Charset charset) {
^
symbol: class LittleEndianInputStream
location: class HwmfFont
> Task :poi-examples:compileJava
> Task :poi-scratchpad:javadoc FAILED
100 errors
> Task :poi-ooxml:compileTestJava
F:\jenkins\jenkins-slave\712657a4\workspace\POI\POI-DSL-Windows-1.17\poi-ooxml\src\test\java\org\apache\poi\xssf\usermodel\TestXSSFFont.java:20: warning: [deprecation] FontCharset in org.apache.poi.ss.usermodel has been deprecated
import static org.apache.poi.ss.usermodel.FontCharset.*;
^
F:\jenkins\jenkins-slave\712657a4\workspace\POI\POI-DSL-Windows-1.17\poi-ooxml\src\test\java\org\apache\poi\xddf\usermodel\chart\TestXDDFChartRemoveSeries.java:129: warning: [deprecation] getSeries() in XDDFChartData has been deprecated
assertThrows(UnsupportedOperationException.class, () -> chartData.getSeries().remove(0));
^
F:\jenkins\jenkins-slave\712657a4\workspace\POI\POI-DSL-Windows-1.17\poi-ooxml\src\test\java\org\apache\poi\xssf\extractor\TestXSSFExportToXML.java:692: warning: [unchecked] getPrefixes(String) in TestXSSFExportToXML.XPathNSContext implements getPrefixes(String) in NamespaceContext
public Iterator getPrefixes(String val) {
^
return type requires unchecked conversion from Iterator to Iterator<String>
F:\jenkins\jenkins-slave\712657a4\workspace\POI\POI-DSL-Windows-1.17\poi-ooxml\src\test\java\org\apache\poi\xssf\usermodel\TestXSSFWorkbook.java:1361: warning: [deprecation] getCTExternalLink() in ExternalLinksTable has been deprecated
CTExternalLink link = workbook2.getExternalLinksTable().get(0).getCTExternalLink();
^
F:\jenkins\jenkins-slave\712657a4\workspace\POI\POI-DSL-Windows-1.17\poi-ooxml\src\test\java\org\apache\poi\xwpf\usermodel\TestXWPFRun.java:203: warning: [deprecation] getFontSize() in XWPFRun has been deprecated
assertEquals(7, run.getFontSize());
^
F:\jenkins\jenkins-slave\712657a4\workspace\POI\POI-DSL-Windows-1.17\poi-ooxml\src\test\java\org\apache\poi\xwpf\usermodel\TestXWPFRun.java:211: warning: [deprecation] getFontSize() in XWPFRun has been deprecated
assertEquals(25, run.getFontSize());
^
F:\jenkins\jenkins-slave\712657a4\workspace\POI\POI-DSL-Windows-1.17\poi-ooxml\src\test\java\org\apache\poi\xwpf\usermodel\TestXWPFRun.java:589: warning: [deprecation] getFontSize() in XWPFRun has been deprecated
assertEquals(-1, run.getFontSize());
^
F:\jenkins\jenkins-slave\712657a4\workspace\POI\POI-DSL-Windows-1.17\poi-ooxml\src\test\java\org\apache\poi\xwpf\usermodel\TestXWPFRun.java:592: warning: [deprecation] getFontSize() in XWPFRun has been deprecated
assertEquals(10, run.getFontSize());
^
F:\jenkins\jenkins-slave\712657a4\workspace\POI\POI-DSL-Windows-1.17\poi-ooxml\src\test\java\org\apache\poi\xwpf\usermodel\TestXWPFRun.java:595: warning: [deprecation] getFontSize() in XWPFRun has been deprecated
assertEquals(Short.MAX_VALUE - 1, run.getFontSize());
^
F:\jenkins\jenkins-slave\712657a4\workspace\POI\POI-DSL-Windows-1.17\poi-ooxml\src\test\java\org\apache\poi\xwpf\usermodel\TestXWPFRun.java:598: warning: [deprecation] getFontSize() in XWPFRun has been deprecated
assertEquals(Short.MAX_VALUE, run.getFontSize());
^
F:\jenkins\jenkins-slave\712657a4\workspace\POI\POI-DSL-Windows-1.17\poi-ooxml\src\test\java\org\apache\poi\xwpf\usermodel\TestXWPFRun.java:601: warning: [deprecation] getFontSize() in XWPFRun has been deprecated
assertEquals(Short.MAX_VALUE + 1, run.getFontSize());
^
F:\jenkins\jenkins-slave\712657a4\workspace\POI\POI-DSL-Windows-1.17\poi-ooxml\src\test\java\org\apache\poi\xwpf\usermodel\TestXWPFRun.java:604: warning: [deprecation] getFontSize() in XWPFRun has been deprecated
assertEquals(Integer.MAX_VALUE - 1, run.getFontSize());
^
F:\jenkins\jenkins-slave\712657a4\workspace\POI\POI-DSL-Windows-1.17\poi-ooxml\src\test\java\org\apache\poi\xwpf\usermodel\TestXWPFRun.java:607: warning: [deprecation] getFontSize() in XWPFRun has been deprecated
assertEquals(Integer.MAX_VALUE, run.getFontSize());
^
F:\jenkins\jenkins-slave\712657a4\workspace\POI\POI-DSL-Windows-1.17\poi-ooxml\src\test\java\org\apache\poi\xwpf\usermodel\TestXWPFRun.java:610: warning: [deprecation] getFontSize() in XWPFRun has been deprecated
assertEquals(-1, run.getFontSize());
^
F:\jenkins\jenkins-slave\712657a4\workspace\POI\POI-DSL-Windows-1.17\poi-ooxml\src\test\java\org\apache\poi\xwpf\usermodel\TestXWPFRun.java:658: warning: [deprecation] getFontSize() in XWPFRun has been deprecated
assertEquals(10, run.getFontSize());
^
15 warnings
> Task :poi:javadoc
error: cannot access POIXMLExtractorFactory
bad class file: F:\jenkins\jenkins-slave\712657a4\workspace\POI\POI-DSL-Windows-1.17\poi-ooxml\build\classes\java\main\org\apache\poi\ooxml\extractor\POIXMLExtractorFactory.class
class file has wrong version 61.0, should be 55.0
Please remove or make sure it appears in the correct subdirectory of the classpath.
F:\jenkins\jenkins-slave\712657a4\workspace\POI\POI-DSL-Windows-1.17\poi\src\main\java\org\apache\poi\extractor\ExtractorFactory.java:50: error: reference not found
* {@link org.apache.poi.ooxml.extractor.POIXMLExtractorFactory} contained within
^
F:\jenkins\jenkins-slave\712657a4\workspace\POI\POI-DSL-Windows-1.17\poi\src\main\java\org\apache\poi\extractor\ExtractorFactory.java:1: error: cannot access VisioTextExtractor
/* ====================================================================
^
bad class file: F:\jenkins\jenkins-slave\712657a4\workspace\POI\POI-DSL-Windows-1.17\poi-scratchpad\build\classes\java\main\org\apache\poi\hdgf\extractor\VisioTextExtractor.class
class file has wrong version 61.0, should be 55.0
Please remove or make sure it appears in the correct subdirectory of the classpath.
F:\jenkins\jenkins-slave\712657a4\workspace\POI\POI-DSL-Windows-1.17\poi\src\main\java\org\apache\poi\extractor\POIOLE2TextExtractor.java:33: error: reference not found
* @see org.apache.poi.hdgf.extractor.VisioTextExtractor
^
F:\jenkins\jenkins-slave\712657a4\workspace\POI\POI-DSL-Windows-1.17\poi\src\main\java\org\apache\poi\extractor\POIOLE2TextExtractor.java:34: error: reference not found
* @see org.apache.poi.hwpf.extractor.WordExtractor
^
F:\jenkins\jenkins-slave\712657a4\workspace\POI\POI-DSL-Windows-1.17\poi\src\main\java\org\apache\poi\extractor\POITextExtractor.java:30: error: reference not found
* @see org.apache.poi.hdgf.extractor.VisioTextExtractor
^
F:\jenkins\jenkins-slave\712657a4\workspace\POI\POI-DSL-Windows-1.17\poi\src\main\java\org\apache\poi\extractor\POITextExtractor.java:31: error: reference not found
* @see org.apache.poi.hwpf.extractor.WordExtractor
^
F:\jenkins\jenkins-slave\712657a4\workspace\POI\POI-DSL-Windows-1.17\poi\src\main\java\org\apache\poi\ss\usermodel\ExtendedColor.java:23: error: reference not found
* {@link org.apache.poi.xssf.usermodel.XSSFColor} or a
^
F:\jenkins\jenkins-slave\712657a4\workspace\POI\POI-DSL-Windows-1.17\poi\src\main\java\org\apache\poi\ss\formula\eval\forked\ForkedEvaluator.java:39: error: reference not found
* 90% of memory consumption is due to loading of the {@link HSSFWorkbook} or {@link org.apache.poi.xssf.usermodel.XSSFWorkbook}.
^
F:\jenkins\jenkins-slave\712657a4\workspace\POI\POI-DSL-Windows-1.17\poi\src\main\java\org\apache\poi\ss\util\PropertyTemplate.java:43: error: reference not found
* {@link org.apache.poi.xssf.streaming.SXSSFWorkbook} Spreadsheets are not
^
F:\jenkins\jenkins-slave\712657a4\workspace\POI\POI-DSL-Windows-1.17\poi\src\main\java\org\apache\poi\ss\util\PropertyTemplate.java:45: error: reference not found
* {@link HSSFWorkbook} and {@link org.apache.poi.xssf.usermodel.XSSFWorkbook}
^
F:\jenkins\jenkins-slave\712657a4\workspace\POI\POI-DSL-Windows-1.17\poi\src\main\java\org\apache\poi\extractor\ExtractorFactory.java:1: error: cannot access ColorSchemeAtom
/* ====================================================================
^
bad class file: F:\jenkins\jenkins-slave\712657a4\workspace\POI\POI-DSL-Windows-1.17\poi-scratchpad\build\classes\java\main\org\apache\poi\hslf\record\ColorSchemeAtom.class
class file has wrong version 61.0, should be 55.0
Please remove or make sure it appears in the correct subdirectory of the classpath.
F:\jenkins\jenkins-slave\712657a4\workspace\POI\POI-DSL-Windows-1.17\poi\src\main\java\org\apache\poi\ddf\EscherColorRef.java:285: error: reference not found
* @see org.apache.poi.hslf.record.ColorSchemeAtom#getColor(int)
^
F:\jenkins\jenkins-slave\712657a4\workspace\POI\POI-DSL-Windows-1.17\poi\src\main\java\org\apache\poi\extractor\ExtractorFactory.java:262: error: reference not found
* {@link org.apache.poi.ooxml.extractor.POIXMLExtractorFactory} for that.
^
F:\jenkins\jenkins-slave\712657a4\workspace\POI\POI-DSL-Windows-1.17\poi\src\main\java\org\apache\poi\extractor\ExtractorFactory.java:281: error: reference not found
* {@link org.apache.poi.ooxml.extractor.POIXMLExtractorFactory} for that.
^
F:\jenkins\jenkins-slave\712657a4\workspace\POI\POI-DSL-Windows-1.17\poi\src\main\java\org\apache\poi\ss\formula\OperationEvaluationContext.java:213: warning: no description for @throws
* @throws IllegalArgumentException
^
F:\jenkins\jenkins-slave\712657a4\workspace\POI\POI-DSL-Windows-1.17\poi\src\main\java\org\apache\poi\ss\formula\OperationEvaluationContext.java:214: warning: no description for @throws
* @throws IllegalStateException
^
F:\jenkins\jenkins-slave\712657a4\workspace\POI\POI-DSL-Windows-1.17\poi\src\main\java\org\apache\poi\extractor\ExtractorFactory.java:1: error: cannot access POIXMLDocument
/* ====================================================================
^
bad class file: F:\jenkins\jenkins-slave\712657a4\workspace\POI\POI-DSL-Windows-1.17\poi-ooxml\build\classes\java\main\org\apache\poi\ooxml\POIXMLDocument.class
class file has wrong version 61.0, should be 55.0
Please remove or make sure it appears in the correct subdirectory of the classpath.
F:\jenkins\jenkins-slave\712657a4\workspace\POI\POI-DSL-Windows-1.17\poi\src\main\java\org\apache\poi\sl\usermodel\SlideShow.java:133: error: reference not found
* or {@link org.apache.poi.ooxml.POIXMLDocument}
^
17 errors
2 warnings
> Task :poi:javadoc FAILED
FAILURE: Build completed with 3 failures.
1: Task failed with an exception.
-----------
* What went wrong:
Execution failed for task ':poi-excelant:javadoc'.
> Javadoc generation failed. Generated Javadoc options file (useful for troubleshooting): 'F:\jenkins\jenkins-slave\712657a4\workspace\POI\POI-DSL-Windows-1.17\poi-excelant\build\tmp\javadoc\javadoc.options'
* Try:
> Run with --stacktrace option to get the stack trace.
> Run with --info or --debug option to get more log output.
> Run with --scan to get full insights.
==============================================================================
2: Task failed with an exception.
-----------
* What went wrong:
Execution failed for task ':poi-scratchpad:javadoc'.
> Javadoc generation failed. Generated Javadoc options file (useful for troubleshooting): 'F:\jenkins\jenkins-slave\712657a4\workspace\POI\POI-DSL-Windows-1.17\poi-scratchpad\build\tmp\javadoc\javadoc.options'
* Try:
> Run with --stacktrace option to get the stack trace.
> Run with --info or --debug option to get more log output.
> Run with --scan to get full insights.
==============================================================================
3: Task failed with an exception.
-----------
* What went wrong:
Execution failed for task ':poi:javadoc'.
> Javadoc generation failed. Generated Javadoc options file (useful for troubleshooting): 'F:\jenkins\jenkins-slave\712657a4\workspace\POI\POI-DSL-Windows-1.17\poi\build\tmp\javadoc\javadoc.options'
* Try:
> Run with --stacktrace option to get the stack trace.
> Run with --info or --debug option to get more log output.
> Run with --scan to get full insights.
==============================================================================
* Get more help at https://help.gradle.org
Deprecated Gradle features were used in this build, making it incompatible with Gradle 8.0.
You can use '--warning-mode all' to show the individual deprecation warnings and determine if they come from your own scripts or plugins.
See https://docs.gradle.org/7.4/userguide/command_line_interface.html#sec:command_line_warnings
BUILD FAILED in 9m 4s
67 actionable tasks: 67 executed
Build step 'Invoke Gradle script' changed build result to FAILURE
Build step 'Invoke Gradle script' marked build as failure
[SpotBugs] Skipping execution of recorder since overall result is 'FAILURE'
Archiving artifacts
Recording test results
[Checks API] No suitable checks publisher found.
---------------------------------------------------------------------
To unsubscribe, e-mail: dev-unsubscribe@poi.apache.org
For additional commands, e-mail: dev-help@poi.apache.org
Build failed in Jenkins: POI » POI-DSL-Windows-1.17 #170
Posted by Apache Jenkins Server <je...@builds.apache.org>.
See <https://ci-builds.apache.org/job/POI/job/POI-DSL-Windows-1.17/170/display/redirect?page=changes>
Changes:
[Andreas Beeker] exclude files failing on windows nodes, because of limited JCE policies
[Andreas Beeker] fix SSL->TLS and LOG typo
[PJ Fanning] remove unused param
[PJ Fanning] revert gradle memory change
[PJ Fanning] code tidyup
[PJ Fanning] try more memory due to github workflow timeouts
------------------------------------------
[...truncated 41.71 KB...]
F:\jenkins\jenkins-home\712657a4\workspace\POI\POI-DSL-Windows-1.17\poi\src\test\java\org\apache\poi\hssf\extractor\TestOldExcelExtractor.java:314: warning: [removal] SecurityManager in java.lang has been deprecated and marked for removal
SecurityManager sm = System.getSecurityManager();
^
F:\jenkins\jenkins-home\712657a4\workspace\POI\POI-DSL-Windows-1.17\poi\src\test\java\org\apache\poi\hssf\extractor\TestOldExcelExtractor.java:314: warning: [removal] getSecurityManager() in System has been deprecated and marked for removal
SecurityManager sm = System.getSecurityManager();
^
F:\jenkins\jenkins-home\712657a4\workspace\POI\POI-DSL-Windows-1.17\poi\src\test\java\org\apache\poi\hssf\extractor\TestOldExcelExtractor.java:315: warning: [removal] setSecurityManager(SecurityManager) in System has been deprecated and marked for removal
System.setSecurityManager(new NoExitSecurityManager());
^
F:\jenkins\jenkins-home\712657a4\workspace\POI\POI-DSL-Windows-1.17\poi\src\test\java\org\apache\poi\hssf\extractor\TestOldExcelExtractor.java:321: warning: [removal] setSecurityManager(SecurityManager) in System has been deprecated and marked for removal
System.setSecurityManager(sm);
^
F:\jenkins\jenkins-home\712657a4\workspace\POI\POI-DSL-Windows-1.17\poi\src\test\java\org\apache\poi\hssf\extractor\TestOldExcelExtractor.java:366: warning: [removal] SecurityManager in java.lang has been deprecated and marked for removal
private static class NoExitSecurityManager extends SecurityManager {
^
F:\jenkins\jenkins-home\712657a4\workspace\POI\POI-DSL-Windows-1.17\poi\src\test\java\org\apache\poi\hssf\record\TestFormulaRecord.java:90: warning: [deprecation] getCode() in CellType has been deprecated
assertEquals(CellType.ERROR.getCode(), record.getCachedResultType());
^
F:\jenkins\jenkins-home\712657a4\workspace\POI\POI-DSL-Windows-1.17\poi\src\test\java\org\apache\poi\hssf\record\TestFormulaRecord.java:90: warning: [deprecation] getCachedResultType() in FormulaRecord has been deprecated
assertEquals(CellType.ERROR.getCode(), record.getCachedResultType());
^
F:\jenkins\jenkins-home\712657a4\workspace\POI\POI-DSL-Windows-1.17\poi\src\test\java\org\apache\poi\hssf\usermodel\TestBugs.java:2362: warning: [deprecation] setCellType(CellType) in Cell has been deprecated
cell.setCellType(CellType.STRING);
^
F:\jenkins\jenkins-home\712657a4\workspace\POI\POI-DSL-Windows-1.17\poi\src\test\java\org\apache\poi\hssf\usermodel\TestHSSFCell.java:385: warning: [deprecation] setCellType(CellType) in Cell has been deprecated
cell.setCellType(CellType.STRING);
^
F:\jenkins\jenkins-home\712657a4\workspace\POI\POI-DSL-Windows-1.17\poi\src\test\java\org\apache\poi\hssf\usermodel\TestHSSFCell.java:389: warning: [deprecation] setCellType(CellType) in Cell has been deprecated
cell.setCellType(CellType.BOOLEAN);
^
F:\jenkins\jenkins-home\712657a4\workspace\POI\POI-DSL-Windows-1.17\poi\src\test\java\org\apache\poi\hssf\usermodel\TestHSSFCell.java:391: warning: [deprecation] setCellType(CellType) in Cell has been deprecated
cell.setCellType(CellType.BOOLEAN);
^
F:\jenkins\jenkins-home\712657a4\workspace\POI\POI-DSL-Windows-1.17\poi\src\test\java\org\apache\poi\hssf\usermodel\TestHSSFCell.java:394: warning: [deprecation] setCellType(CellType) in Cell has been deprecated
cell.setCellType(CellType.BOOLEAN);
^
F:\jenkins\jenkins-home\712657a4\workspace\POI\POI-DSL-Windows-1.17\poi\src\test\java\org\apache\poi\hssf\usermodel\TestHSSFCell.java:398: warning: [deprecation] setCellType(CellType) in Cell has been deprecated
cell.setCellType(CellType.BOOLEAN);
^
F:\jenkins\jenkins-home\712657a4\workspace\POI\POI-DSL-Windows-1.17\poi\src\test\java\org\apache\poi\hssf\usermodel\TestHSSFCell.java:399: warning: [deprecation] setCellType(CellType) in Cell has been deprecated
cell.setCellType(CellType.STRING);
^
F:\jenkins\jenkins-home\712657a4\workspace\POI\POI-DSL-Windows-1.17\poi\src\test\java\org\apache\poi\hssf\usermodel\TestHSSFCell.java:400: warning: [deprecation] setCellType(CellType) in Cell has been deprecated
cell.setCellType(CellType.ERROR);
^
F:\jenkins\jenkins-home\712657a4\workspace\POI\POI-DSL-Windows-1.17\poi\src\test\java\org\apache\poi\hssf\usermodel\TestHSSFCell.java:401: warning: [deprecation] setCellType(CellType) in Cell has been deprecated
cell.setCellType(CellType.STRING);
^
F:\jenkins\jenkins-home\712657a4\workspace\POI\POI-DSL-Windows-1.17\poi\src\test\java\org\apache\poi\hssf\usermodel\TestHSSFCell.java:403: warning: [deprecation] setCellType(CellType) in Cell has been deprecated
cell.setCellType(CellType.STRING);
^
F:\jenkins\jenkins-home\712657a4\workspace\POI\POI-DSL-Windows-1.17\poi\src\test\java\org\apache\poi\ss\usermodel\BaseTestSheetUpdateArrayFormulas.java:277: warning: [deprecation] setCellType(CellType) in Cell has been deprecated
scell.setCellType(CellType.STRING);
^
F:\jenkins\jenkins-home\712657a4\workspace\POI\POI-DSL-Windows-1.17\poi\src\test\java\org\apache\poi\ss\usermodel\BaseTestSheetUpdateArrayFormulas.java:287: warning: [deprecation] setCellType(CellType) in Cell has been deprecated
IllegalStateException e = assertThrows(IllegalStateException.class, () -> mcell.setCellType(CellType.NUMERIC));
^
F:\jenkins\jenkins-home\712657a4\workspace\POI\POI-DSL-Windows-1.17\poi\src\test\java\org\apache\poi\poifs\dev\TestPOIFSDump.java:156: warning: [removal] SecurityManager in java.lang has been deprecated and marked for removal
private static class TestOverrideSecurityManager extends SecurityManager {
^
F:\jenkins\jenkins-home\712657a4\workspace\POI\POI-DSL-Windows-1.17\poi\src\test\java\org\apache\poi\poifs\dev\TestPOIFSDump.java:174: warning: [removal] SecurityManager in java.lang has been deprecated and marked for removal
SecurityManager sm = System.getSecurityManager();
^
F:\jenkins\jenkins-home\712657a4\workspace\POI\POI-DSL-Windows-1.17\poi\src\test\java\org\apache\poi\poifs\dev\TestPOIFSDump.java:174: warning: [removal] getSecurityManager() in System has been deprecated and marked for removal
SecurityManager sm = System.getSecurityManager();
^
F:\jenkins\jenkins-home\712657a4\workspace\POI\POI-DSL-Windows-1.17\poi\src\test\java\org\apache\poi\poifs\dev\TestPOIFSDump.java:176: warning: [removal] setSecurityManager(SecurityManager) in System has been deprecated and marked for removal
System.setSecurityManager(new TestOverrideSecurityManager());
^
F:\jenkins\jenkins-home\712657a4\workspace\POI\POI-DSL-Windows-1.17\poi\src\test\java\org\apache\poi\poifs\dev\TestPOIFSDump.java:179: warning: [removal] setSecurityManager(SecurityManager) in System has been deprecated and marked for removal
System.setSecurityManager(sm);
^
F:\jenkins\jenkins-home\712657a4\workspace\POI\POI-DSL-Windows-1.17\poi\src\test\java\org\apache\poi\ss\util\TestSheetUtil.java:212: warning: [deprecation] setCellType(CellType) in Cell has been deprecated
cell.setCellType(CellType.STRING);
^
26 warnings
> Task :poi:compileTest9 SKIPPED
> Task :poi:cacheTest9 NO-SOURCE
> Task :poi:processTestResources
> Task :poi:testClasses
> Task :poi:testJar
> Task :poi:sourcesJar
> Task :poi-scratchpad:compileTestJava
F:\jenkins\jenkins-home\712657a4\workspace\POI\POI-DSL-Windows-1.17\poi-scratchpad\src\test\java\org\apache\poi\hslf\extractor\TestExtractor.java:498: warning: [deprecation] getCodepoints(String,Boolean,Boolean) in SlideShowExtractor has been deprecated
BitSet l1 = ppt.getCodepoints(font, null, null);
^
> Task :poi:forbiddenApisMain
> Task :poi-scratchpad:compileTestJava
F:\jenkins\jenkins-home\712657a4\workspace\POI\POI-DSL-Windows-1.17\poi-scratchpad\src\test\java\org\apache\poi\hwpf\extractor\TestWordExtractor.java:190: warning: [deprecation] getHeaderText() in WordExtractor has been deprecated
assertEquals("First header column!\tMid header Right header!\n", extractor1.getHeaderText());
^
F:\jenkins\jenkins-home\712657a4\workspace\POI\POI-DSL-Windows-1.17\poi-scratchpad\src\test\java\org\apache\poi\hwpf\extractor\TestWordExtractor.java:200: warning: [deprecation] getHeaderText() in WordExtractor has been deprecated
assertEquals("This is a simple header, with a \u20ac euro symbol in it.\n\n", extractor2.getHeaderText());
^
F:\jenkins\jenkins-home\712657a4\workspace\POI\POI-DSL-Windows-1.17\poi-scratchpad\src\test\java\org\apache\poi\hwpf\extractor\TestWordExtractor.java:213: warning: [deprecation] getFooterText() in WordExtractor has been deprecated
assertEquals("Footer Left\tFooter Middle Footer Right\n", extractor1.getFooterText());
^
F:\jenkins\jenkins-home\712657a4\workspace\POI\POI-DSL-Windows-1.17\poi-scratchpad\src\test\java\org\apache\poi\hwpf\extractor\TestWordExtractor.java:223: warning: [deprecation] getFooterText() in WordExtractor has been deprecated
assertEquals("The footer, with Moli\u00e8re, has Unicode in it.\n", extractor2.getFooterText());
^
F:\jenkins\jenkins-home\712657a4\workspace\POI\POI-DSL-Windows-1.17\poi-scratchpad\src\test\java\org\apache\poi\hwpf\extractor\TestWordExtractorBugs.java:56: warning: [deprecation] getParagraphText() in Word6Extractor has been deprecated
assertNotNull(extractor.getParagraphText());
^
F:\jenkins\jenkins-home\712657a4\workspace\POI\POI-DSL-Windows-1.17\poi-scratchpad\src\test\java\org\apache\poi\hwpf\model\TestCHPBinTable.java:53: warning: [deprecation] writeTo(HWPFFileSystem,int,CharIndexTranslator) in CHPBinTable has been deprecated
_cHPBinTable.writeTo(fileSys, 0, fakeTPT);
^
F:\jenkins\jenkins-home\712657a4\workspace\POI\POI-DSL-Windows-1.17\poi-scratchpad\src\test\java\org\apache\poi\hwpf\model\TestFontTable.java:47: warning: [deprecation] writeTo(HWPFFileSystem) in FontTable has been deprecated
_fontTable.writeTo(fileSys);
^
F:\jenkins\jenkins-home\712657a4\workspace\POI\POI-DSL-Windows-1.17\poi-scratchpad\src\test\java\org\apache\poi\hwpf\model\TestSectionTable.java:50: warning: [deprecation] writeTo(HWPFFileSystem,int) in SectionTable has been deprecated
sectionTable.writeTo(fileSys, 0);
^
F:\jenkins\jenkins-home\712657a4\workspace\POI\POI-DSL-Windows-1.17\poi-scratchpad\src\test\java\org\apache\poi\hwpf\sprm\TestSprms.java:77: warning: [deprecation] getParagraphStyle(int) in StyleSheet has been deprecated
assertEquals(1, hwpfDocument.getStyleSheet().getParagraphStyle(8).getJustification());
^
F:\jenkins\jenkins-home\712657a4\workspace\POI\POI-DSL-Windows-1.17\poi-scratchpad\src\test\java\org\apache\poi\hwpf\sprm\TestSprms.java:80: warning: [deprecation] getParagraphStyle(int) in StyleSheet has been deprecated
assertEquals(1, hwpfDocument2.getStyleSheet().getParagraphStyle(8).getJustification());
^
F:\jenkins\jenkins-home\712657a4\workspace\POI\POI-DSL-Windows-1.17\poi-scratchpad\src\test\java\org\apache\poi\hwpf\usermodel\TestBug49820.java:64: warning: [deprecation] getParagraphStyle(int) in StyleSheet has been deprecated
assertEquals(expectedStyleLvl, styleSheet.getParagraphStyle(par.getStyleIndex()).getLvl());
^
F:\jenkins\jenkins-home\712657a4\workspace\POI\POI-DSL-Windows-1.17\poi-scratchpad\src\test\java\org\apache\poi\hwpf\usermodel\TestHWPFOldDocument.java:186: warning: [deprecation] getParagraphText() in Word6Extractor has been deprecated
for (String p : ex.getParagraphText()) {
^
F:\jenkins\jenkins-home\712657a4\workspace\POI\POI-DSL-Windows-1.17\poi-scratchpad\src\test\java\org\apache\poi\hwpf\usermodel\TestHWPFOldDocument.java:203: warning: [deprecation] getParagraphText() in Word6Extractor has been deprecated
for (String p : ex.getParagraphText()) {
^
F:\jenkins\jenkins-home\712657a4\workspace\POI\POI-DSL-Windows-1.17\poi-scratchpad\src\test\java\org\apache\poi\hwpf\usermodel\TestHWPFOldDocument.java:240: warning: [deprecation] getParagraphText() in Word6Extractor has been deprecated
for (String p : ex.getParagraphText()) {
^
15 warnings
> Task :poi:forbiddenApisTest
> Task :poi:forbiddenApis
> Task :poi:spotbugsMain
> Task :poi:spotbugsTest
> Task :poi-scratchpad:compileTest9 SKIPPED
> Task :poi-scratchpad:cacheTest9 NO-SOURCE
> Task :poi-scratchpad:testClasses
> Task :poi-scratchpad:testJar
WARNING: A terminally deprecated method in java.lang.System has been called
WARNING: System::setSecurityManager has been called by edu.umd.cs.findbugs.ba.jsr305.TypeQualifierValue (file:/C:/Users/jenkins/.gradle/caches/modules-2/files-2.1/com.github.spotbugs/spotbugs/4.5.0/6bc031deec8506968417da46ba4367d159b99d76/spotbugs-4.5.0.jar)
WARNING: Please consider reporting this to the maintainers of edu.umd.cs.findbugs.ba.jsr305.TypeQualifierValue
WARNING: System::setSecurityManager will be removed in a future release
> Task :poi:test
OpenJDK 64-Bit Server VM warning: Ignoring option --illegal-access=warn; support was removed in 17.0
WARNING: Unknown module: org.junit.platform.commons specified to --add-exports
WARNING: Unknown module: org.junit.platform.commons specified to --add-exports
WARNING: A terminally deprecated method in java.lang.System has been called
WARNING: System::setSecurityManager has been called by org.apache.poi.poifs.dev.TestPOIFSDump (file:/F:/jenkins/jenkins-home/712657a4/workspace/POI/POI-DSL-Windows-1.17/poi/build/classes/java/test/)
WARNING: Please consider reporting this to the maintainers of org.apache.poi.poifs.dev.TestPOIFSDump
WARNING: System::setSecurityManager will be removed in a future release
WARNING: A terminally deprecated method in java.lang.System has been called
WARNING: System::setSecurityManager has been called by org.apache.poi.poifs.dev.TestPOIFSDump (file:/F:/jenkins/jenkins-home/712657a4/workspace/POI/POI-DSL-Windows-1.17/poi/build/classes/java/test/)
WARNING: Please consider reporting this to the maintainers of org.apache.poi.poifs.dev.TestPOIFSDump
WARNING: System::setSecurityManager will be removed in a future release
#
# A fatal error has been detected by the Java Runtime Environment:
#
# EXCEPTION_ACCESS_VIOLATION (0xc0000005) at pc=0x00007ffa03eafc35, pid=14760, tid=4132
#
# JRE version: OpenJDK Runtime Environment (17.0+28) (build 17-ea+28-2534)
# Java VM: OpenJDK 64-Bit Server VM (17-ea+28-2534, mixed mode, sharing, tiered, compressed oops, compressed class ptrs, g1 gc, windows-amd64)
# Problematic frame:
# V [jvm.dll+0x6efc35]
#
# Core dump will be written. Default location: C:\Users\jenkins\.gradle\workers\hs_err_pid14760.mdmp
#
# An error report file with more information is saved as:
# C:\Users\jenkins\.gradle\workers\hs_err_pid14760.log
#
# Compiler replay data is saved as:
# C:\Users\jenkins\.gradle\workers\replay_pid14760.log
#
# If you would like to submit a bug report, please visit:
# https://bugreport.java.com/bugreport/crash.jsp
#
> Task :poi:spotbugsTest
448 SpotBugs violations were found.See the report at: file:///F:/jenkins/jenkins-home/712657a4/workspace/POI/POI-DSL-Windows-1.17/poi/build/reports/spotbugs/test.xml
> Task :poi-scratchpad:forbiddenApisTest
> Task :poi-scratchpad:forbiddenApis
Unexpected exception thrown.
org.gradle.internal.remote.internal.MessageIOException: Could not write '/127.0.0.1:57152'.
at org.gradle.internal.remote.internal.inet.SocketConnection.flush(SocketConnection.java:140)
at org.gradle.internal.remote.internal.hub.MessageHub$ConnectionDispatch.run(MessageHub.java:333)
at org.gradle.internal.concurrent.ExecutorPolicy$CatchAndRecordFailures.onExecute(ExecutorPolicy.java:64)
at org.gradle.internal.concurrent.ManagedExecutorImpl$1.run(ManagedExecutorImpl.java:48)
at java.base/java.util.concurrent.ThreadPoolExecutor.runWorker(ThreadPoolExecutor.java:1136)
at java.base/java.util.concurrent.ThreadPoolExecutor$Worker.run(ThreadPoolExecutor.java:635)
at java.base/java.lang.Thread.run(Thread.java:833)
Caused by: java.io.IOException: Connection reset by peer
at java.base/sun.nio.ch.SocketDispatcher.write0(Native Method)
at java.base/sun.nio.ch.SocketDispatcher.write(SocketDispatcher.java:54)
at java.base/sun.nio.ch.IOUtil.writeFromNativeBuffer(IOUtil.java:132)
at java.base/sun.nio.ch.IOUtil.write(IOUtil.java:76)
at java.base/sun.nio.ch.IOUtil.write(IOUtil.java:53)
at java.base/sun.nio.ch.SocketChannelImpl.write(SocketChannelImpl.java:532)
at org.gradle.internal.remote.internal.inet.SocketConnection$SocketOutputStream.writeWithNonBlockingRetry(SocketConnection.java:279)
at org.gradle.internal.remote.internal.inet.SocketConnection$SocketOutputStream.writeBufferToChannel(SocketConnection.java:267)
at org.gradle.internal.remote.internal.inet.SocketConnection$SocketOutputStream.flush(SocketConnection.java:261)
at org.gradle.internal.remote.internal.inet.SocketConnection.flush(SocketConnection.java:138)
... 6 more
> Task :poi:spotbugsMain FAILED
> Task :poi:test
OpenJDK 64-Bit Server VM warning: Ignoring option --illegal-access=warn; support was removed in 17.0
WARNING: Unknown module: org.junit.platform.commons specified to --add-exports
WARNING: Unknown module: org.junit.platform.commons specified to --add-exports
> Task :poi-scratchpad:spotbugsTest
41 SpotBugs violations were found.See the report at: file:///F:/jenkins/jenkins-home/712657a4/workspace/POI/POI-DSL-Windows-1.17/poi-scratchpad/build/reports/spotbugs/test.xml
FAILURE: Build failed with an exception.
* What went wrong:
Execution failed for task ':poi:spotbugsMain'.
> A failure occurred while executing com.github.spotbugs.snom.internal.SpotBugsRunnerForWorker$SpotBugsExecutor
> Failed to run Gradle Worker Daemon
> Process 'Gradle Worker Daemon 1' finished with non-zero exit value 1
* Try:
> Run with --stacktrace option to get the stack trace.
> Run with --info or --debug option to get more log output.
> Run with --scan to get full insights.
* Get more help at https://help.gradle.org
Deprecated Gradle features were used in this build, making it incompatible with Gradle 8.0.
You can use '--warning-mode all' to show the individual deprecation warnings and determine if they come from your own scripts or plugins.
See https://docs.gradle.org/7.4/userguide/command_line_interface.html#sec:command_line_warnings
BUILD FAILED in 28m 40s
51 actionable tasks: 50 executed, 1 up-to-date
Build step 'Invoke Gradle script' changed build result to FAILURE
Build step 'Invoke Gradle script' marked build as failure
[SpotBugs] Skipping execution of recorder since overall result is 'FAILURE'
Archiving artifacts
Recording test results
[Checks API] No suitable checks publisher found.
---------------------------------------------------------------------
To unsubscribe, e-mail: dev-unsubscribe@poi.apache.org
For additional commands, e-mail: dev-help@poi.apache.org
Build failed in Jenkins: POI » POI-DSL-Windows-1.17 #169
Posted by Apache Jenkins Server <je...@builds.apache.org>.
See <https://ci-builds.apache.org/job/POI/job/POI-DSL-Windows-1.17/169/display/redirect?page=changes>
Changes:
[PJ Fanning] standardise on poi 5.2.1
[PJ Fanning] get TestIndirectFunctionFromSpreadsheet to pass even though code looks wrong
[PJ Fanning] java 17 build issue
[PJ Fanning] sonar issues
------------------------------------------
[...truncated 180.04 KB...]
F:\jenkins\jenkins-slave\712657a4\workspace\POI\POI-DSL-Windows-1.17\poi-examples\src\main\java\org\apache\poi\examples\hslf\TableDemo.java:25: error: cannot access HSLFTable
import org.apache.poi.hslf.usermodel.HSLFTable;
^
bad class file: F:\jenkins\jenkins-slave\712657a4\workspace\POI\POI-DSL-Windows-1.17\build\dist\maven\poi-scratchpad\poi-scratchpad-5.2.1-SNAPSHOT.jar(/org/apache/poi/hslf/usermodel/HSLFTable.class)
class file has wrong version 61.0, should be 55.0
Please remove or make sure it appears in the correct subdirectory of the classpath.
F:\jenkins\jenkins-slave\712657a4\workspace\POI\POI-DSL-Windows-1.17\poi-examples\src\main\java\org\apache\poi\examples\hslf\TableDemo.java:26: error: cannot access HSLFTableCell
import org.apache.poi.hslf.usermodel.HSLFTableCell;
^
bad class file: F:\jenkins\jenkins-slave\712657a4\workspace\POI\POI-DSL-Windows-1.17\build\dist\maven\poi-scratchpad\poi-scratchpad-5.2.1-SNAPSHOT.jar(/org/apache/poi/hslf/usermodel/HSLFTableCell.class)
class file has wrong version 61.0, should be 55.0
Please remove or make sure it appears in the correct subdirectory of the classpath.
F:\jenkins\jenkins-slave\712657a4\workspace\POI\POI-DSL-Windows-1.17\poi-examples\src\main\java\org\apache\poi\examples\hslf\TableDemo.java:68: error: cannot find symbol
static void create1stTable(HSLFSlide slide) {
^
symbol: class HSLFSlide
location: class TableDemo
F:\jenkins\jenkins-slave\712657a4\workspace\POI\POI-DSL-Windows-1.17\poi-examples\src\main\java\org\apache\poi\examples\hslf\TableDemo.java:98: error: cannot find symbol
static void create2ndTable(HSLFSlide slide) {
^
symbol: class HSLFSlide
location: class TableDemo
F:\jenkins\jenkins-slave\712657a4\workspace\POI\POI-DSL-Windows-1.17\poi-examples\src\main\java\org\apache\poi\examples\hsmf\Msg2txt.java:26: error: cannot access MAPIMessage
import org.apache.poi.hsmf.MAPIMessage;
^
bad class file: F:\jenkins\jenkins-slave\712657a4\workspace\POI\POI-DSL-Windows-1.17\build\dist\maven\poi-scratchpad\poi-scratchpad-5.2.1-SNAPSHOT.jar(/org/apache/poi/hsmf/MAPIMessage.class)
class file has wrong version 61.0, should be 55.0
Please remove or make sure it appears in the correct subdirectory of the classpath.
F:\jenkins\jenkins-slave\712657a4\workspace\POI\POI-DSL-Windows-1.17\poi-examples\src\main\java\org\apache\poi\examples\hsmf\Msg2txt.java:27: error: cannot access AttachmentChunks
import org.apache.poi.hsmf.datatypes.AttachmentChunks;
^
bad class file: F:\jenkins\jenkins-slave\712657a4\workspace\POI\POI-DSL-Windows-1.17\build\dist\maven\poi-scratchpad\poi-scratchpad-5.2.1-SNAPSHOT.jar(/org/apache/poi/hsmf/datatypes/AttachmentChunks.class)
class file has wrong version 61.0, should be 55.0
Please remove or make sure it appears in the correct subdirectory of the classpath.
F:\jenkins\jenkins-slave\712657a4\workspace\POI\POI-DSL-Windows-1.17\poi-examples\src\main\java\org\apache\poi\examples\hsmf\Msg2txt.java:28: error: cannot access ChunkNotFoundException
import org.apache.poi.hsmf.exceptions.ChunkNotFoundException;
^
bad class file: F:\jenkins\jenkins-slave\712657a4\workspace\POI\POI-DSL-Windows-1.17\build\dist\maven\poi-scratchpad\poi-scratchpad-5.2.1-SNAPSHOT.jar(/org/apache/poi/hsmf/exceptions/ChunkNotFoundException.class)
class file has wrong version 61.0, should be 55.0
Please remove or make sure it appears in the correct subdirectory of the classpath.
F:\jenkins\jenkins-slave\712657a4\workspace\POI\POI-DSL-Windows-1.17\poi-examples\src\main\java\org\apache\poi\examples\hsmf\Msg2txt.java:47: error: cannot find symbol
private MAPIMessage msg;
^
symbol: class MAPIMessage
location: class Msg2txt
F:\jenkins\jenkins-slave\712657a4\workspace\POI\POI-DSL-Windows-1.17\poi-examples\src\main\java\org\apache\poi\examples\hsmf\Msg2txt.java:125: error: cannot find symbol
public void processAttachment(AttachmentChunks attachment,
^
symbol: class AttachmentChunks
location: class Msg2txt
F:\jenkins\jenkins-slave\712657a4\workspace\POI\POI-DSL-Windows-1.17\poi-examples\src\main\java\org\apache\poi\examples\hssf\eventusermodel\XLS2CSVmra.java:26: error: cannot access EventWorkbookBuilder
import org.apache.poi.hssf.eventusermodel.EventWorkbookBuilder.SheetRecordCollectingListener;
^
bad class file: F:\jenkins\jenkins-slave\712657a4\workspace\POI\POI-DSL-Windows-1.17\build\dist\maven\poi\poi-5.2.1-SNAPSHOT.jar(/org/apache/poi/hssf/eventusermodel/EventWorkbookBuilder.class)
class file has wrong version 61.0, should be 55.0
Please remove or make sure it appears in the correct subdirectory of the classpath.
100 errors
> Task :poi-examples:javadoc FAILED
> Task :poi-ooxml:compileTestJava
F:\jenkins\jenkins-slave\712657a4\workspace\POI\POI-DSL-Windows-1.17\poi-ooxml\src\test\java\org\apache\poi\xssf\usermodel\TestXSSFFont.java:20: warning: [deprecation] FontCharset in org.apache.poi.ss.usermodel has been deprecated
import static org.apache.poi.ss.usermodel.FontCharset.*;
^
F:\jenkins\jenkins-slave\712657a4\workspace\POI\POI-DSL-Windows-1.17\poi-ooxml\src\test\java\org\apache\poi\xddf\usermodel\chart\TestXDDFChartRemoveSeries.java:129: warning: [deprecation] getSeries() in XDDFChartData has been deprecated
assertThrows(UnsupportedOperationException.class, () -> chartData.getSeries().remove(0));
^
F:\jenkins\jenkins-slave\712657a4\workspace\POI\POI-DSL-Windows-1.17\poi-ooxml\src\test\java\org\apache\poi\xssf\extractor\TestXSSFExportToXML.java:692: warning: [unchecked] getPrefixes(String) in TestXSSFExportToXML.XPathNSContext implements getPrefixes(String) in NamespaceContext
public Iterator getPrefixes(String val) {
^
return type requires unchecked conversion from Iterator to Iterator<String>
F:\jenkins\jenkins-slave\712657a4\workspace\POI\POI-DSL-Windows-1.17\poi-ooxml\src\test\java\org\apache\poi\xssf\usermodel\TestXSSFWorkbook.java:1361: warning: [deprecation] getCTExternalLink() in ExternalLinksTable has been deprecated
CTExternalLink link = workbook2.getExternalLinksTable().get(0).getCTExternalLink();
^
F:\jenkins\jenkins-slave\712657a4\workspace\POI\POI-DSL-Windows-1.17\poi-ooxml\src\test\java\org\apache\poi\xwpf\usermodel\TestXWPFRun.java:203: warning: [deprecation] getFontSize() in XWPFRun has been deprecated
assertEquals(7, run.getFontSize());
^
F:\jenkins\jenkins-slave\712657a4\workspace\POI\POI-DSL-Windows-1.17\poi-ooxml\src\test\java\org\apache\poi\xwpf\usermodel\TestXWPFRun.java:211: warning: [deprecation] getFontSize() in XWPFRun has been deprecated
assertEquals(25, run.getFontSize());
^
F:\jenkins\jenkins-slave\712657a4\workspace\POI\POI-DSL-Windows-1.17\poi-ooxml\src\test\java\org\apache\poi\xwpf\usermodel\TestXWPFRun.java:589: warning: [deprecation] getFontSize() in XWPFRun has been deprecated
assertEquals(-1, run.getFontSize());
^
F:\jenkins\jenkins-slave\712657a4\workspace\POI\POI-DSL-Windows-1.17\poi-ooxml\src\test\java\org\apache\poi\xwpf\usermodel\TestXWPFRun.java:592: warning: [deprecation] getFontSize() in XWPFRun has been deprecated
assertEquals(10, run.getFontSize());
^
F:\jenkins\jenkins-slave\712657a4\workspace\POI\POI-DSL-Windows-1.17\poi-ooxml\src\test\java\org\apache\poi\xwpf\usermodel\TestXWPFRun.java:595: warning: [deprecation] getFontSize() in XWPFRun has been deprecated
assertEquals(Short.MAX_VALUE - 1, run.getFontSize());
^
F:\jenkins\jenkins-slave\712657a4\workspace\POI\POI-DSL-Windows-1.17\poi-ooxml\src\test\java\org\apache\poi\xwpf\usermodel\TestXWPFRun.java:598: warning: [deprecation] getFontSize() in XWPFRun has been deprecated
assertEquals(Short.MAX_VALUE, run.getFontSize());
^
F:\jenkins\jenkins-slave\712657a4\workspace\POI\POI-DSL-Windows-1.17\poi-ooxml\src\test\java\org\apache\poi\xwpf\usermodel\TestXWPFRun.java:601: warning: [deprecation] getFontSize() in XWPFRun has been deprecated
assertEquals(Short.MAX_VALUE + 1, run.getFontSize());
^
F:\jenkins\jenkins-slave\712657a4\workspace\POI\POI-DSL-Windows-1.17\poi-ooxml\src\test\java\org\apache\poi\xwpf\usermodel\TestXWPFRun.java:604: warning: [deprecation] getFontSize() in XWPFRun has been deprecated
assertEquals(Integer.MAX_VALUE - 1, run.getFontSize());
^
F:\jenkins\jenkins-slave\712657a4\workspace\POI\POI-DSL-Windows-1.17\poi-ooxml\src\test\java\org\apache\poi\xwpf\usermodel\TestXWPFRun.java:607: warning: [deprecation] getFontSize() in XWPFRun has been deprecated
assertEquals(Integer.MAX_VALUE, run.getFontSize());
^
F:\jenkins\jenkins-slave\712657a4\workspace\POI\POI-DSL-Windows-1.17\poi-ooxml\src\test\java\org\apache\poi\xwpf\usermodel\TestXWPFRun.java:610: warning: [deprecation] getFontSize() in XWPFRun has been deprecated
assertEquals(-1, run.getFontSize());
^
F:\jenkins\jenkins-slave\712657a4\workspace\POI\POI-DSL-Windows-1.17\poi-ooxml\src\test\java\org\apache\poi\xwpf\usermodel\TestXWPFRun.java:658: warning: [deprecation] getFontSize() in XWPFRun has been deprecated
assertEquals(10, run.getFontSize());
^
15 warnings
> Task :poi:javadoc
error: cannot access POIXMLExtractorFactory
bad class file: F:\jenkins\jenkins-slave\712657a4\workspace\POI\POI-DSL-Windows-1.17\poi-ooxml\build\classes\java\main\org\apache\poi\ooxml\extractor\POIXMLExtractorFactory.class
class file has wrong version 61.0, should be 55.0
Please remove or make sure it appears in the correct subdirectory of the classpath.
F:\jenkins\jenkins-slave\712657a4\workspace\POI\POI-DSL-Windows-1.17\poi\src\main\java\org\apache\poi\extractor\ExtractorFactory.java:50: error: reference not found
* {@link org.apache.poi.ooxml.extractor.POIXMLExtractorFactory} contained within
^
F:\jenkins\jenkins-slave\712657a4\workspace\POI\POI-DSL-Windows-1.17\poi\src\main\java\org\apache\poi\extractor\ExtractorFactory.java:1: error: cannot access VisioTextExtractor
/* ====================================================================
^
bad class file: F:\jenkins\jenkins-slave\712657a4\workspace\POI\POI-DSL-Windows-1.17\poi-scratchpad\build\classes\java\main\org\apache\poi\hdgf\extractor\VisioTextExtractor.class
class file has wrong version 61.0, should be 55.0
Please remove or make sure it appears in the correct subdirectory of the classpath.
F:\jenkins\jenkins-slave\712657a4\workspace\POI\POI-DSL-Windows-1.17\poi\src\main\java\org\apache\poi\extractor\POIOLE2TextExtractor.java:33: error: reference not found
* @see org.apache.poi.hdgf.extractor.VisioTextExtractor
^
F:\jenkins\jenkins-slave\712657a4\workspace\POI\POI-DSL-Windows-1.17\poi\src\main\java\org\apache\poi\extractor\POIOLE2TextExtractor.java:34: error: reference not found
* @see org.apache.poi.hwpf.extractor.WordExtractor
^
F:\jenkins\jenkins-slave\712657a4\workspace\POI\POI-DSL-Windows-1.17\poi\src\main\java\org\apache\poi\extractor\POITextExtractor.java:30: error: reference not found
* @see org.apache.poi.hdgf.extractor.VisioTextExtractor
^
F:\jenkins\jenkins-slave\712657a4\workspace\POI\POI-DSL-Windows-1.17\poi\src\main\java\org\apache\poi\extractor\POITextExtractor.java:31: error: reference not found
* @see org.apache.poi.hwpf.extractor.WordExtractor
^
F:\jenkins\jenkins-slave\712657a4\workspace\POI\POI-DSL-Windows-1.17\poi\src\main\java\org\apache\poi\ss\usermodel\ExtendedColor.java:23: error: reference not found
* {@link org.apache.poi.xssf.usermodel.XSSFColor} or a
^
F:\jenkins\jenkins-slave\712657a4\workspace\POI\POI-DSL-Windows-1.17\poi\src\main\java\org\apache\poi\ss\formula\eval\forked\ForkedEvaluator.java:39: error: reference not found
* 90% of memory consumption is due to loading of the {@link HSSFWorkbook} or {@link org.apache.poi.xssf.usermodel.XSSFWorkbook}.
^
F:\jenkins\jenkins-slave\712657a4\workspace\POI\POI-DSL-Windows-1.17\poi\src\main\java\org\apache\poi\ss\util\PropertyTemplate.java:43: error: reference not found
* {@link org.apache.poi.xssf.streaming.SXSSFWorkbook} Spreadsheets are not
^
F:\jenkins\jenkins-slave\712657a4\workspace\POI\POI-DSL-Windows-1.17\poi\src\main\java\org\apache\poi\ss\util\PropertyTemplate.java:45: error: reference not found
* {@link HSSFWorkbook} and {@link org.apache.poi.xssf.usermodel.XSSFWorkbook}
^
F:\jenkins\jenkins-slave\712657a4\workspace\POI\POI-DSL-Windows-1.17\poi\src\main\java\org\apache\poi\extractor\ExtractorFactory.java:1: error: cannot access ColorSchemeAtom
/* ====================================================================
^
bad class file: F:\jenkins\jenkins-slave\712657a4\workspace\POI\POI-DSL-Windows-1.17\poi-scratchpad\build\classes\java\main\org\apache\poi\hslf\record\ColorSchemeAtom.class
class file has wrong version 61.0, should be 55.0
Please remove or make sure it appears in the correct subdirectory of the classpath.
F:\jenkins\jenkins-slave\712657a4\workspace\POI\POI-DSL-Windows-1.17\poi\src\main\java\org\apache\poi\ddf\EscherColorRef.java:285: error: reference not found
* @see org.apache.poi.hslf.record.ColorSchemeAtom#getColor(int)
^
F:\jenkins\jenkins-slave\712657a4\workspace\POI\POI-DSL-Windows-1.17\poi\src\main\java\org\apache\poi\extractor\ExtractorFactory.java:262: error: reference not found
* {@link org.apache.poi.ooxml.extractor.POIXMLExtractorFactory} for that.
^
F:\jenkins\jenkins-slave\712657a4\workspace\POI\POI-DSL-Windows-1.17\poi\src\main\java\org\apache\poi\extractor\ExtractorFactory.java:281: error: reference not found
* {@link org.apache.poi.ooxml.extractor.POIXMLExtractorFactory} for that.
^
F:\jenkins\jenkins-slave\712657a4\workspace\POI\POI-DSL-Windows-1.17\poi\src\main\java\org\apache\poi\ss\formula\OperationEvaluationContext.java:213: warning: no description for @throws
* @throws IllegalArgumentException
^
F:\jenkins\jenkins-slave\712657a4\workspace\POI\POI-DSL-Windows-1.17\poi\src\main\java\org\apache\poi\ss\formula\OperationEvaluationContext.java:214: warning: no description for @throws
* @throws IllegalStateException
^
F:\jenkins\jenkins-slave\712657a4\workspace\POI\POI-DSL-Windows-1.17\poi\src\main\java\org\apache\poi\extractor\ExtractorFactory.java:1: error: cannot access POIXMLDocument
/* ====================================================================
^
bad class file: F:\jenkins\jenkins-slave\712657a4\workspace\POI\POI-DSL-Windows-1.17\poi-ooxml\build\classes\java\main\org\apache\poi\ooxml\POIXMLDocument.class
class file has wrong version 61.0, should be 55.0
Please remove or make sure it appears in the correct subdirectory of the classpath.
F:\jenkins\jenkins-slave\712657a4\workspace\POI\POI-DSL-Windows-1.17\poi\src\main\java\org\apache\poi\sl\usermodel\SlideShow.java:133: error: reference not found
* or {@link org.apache.poi.ooxml.POIXMLDocument}
^
17 errors
2 warnings
> Task :poi:javadoc FAILED
FAILURE: Build completed with 4 failures.
1: Task failed with an exception.
-----------
* What went wrong:
Execution failed for task ':poi-scratchpad:javadoc'.
> Javadoc generation failed. Generated Javadoc options file (useful for troubleshooting): 'F:\jenkins\jenkins-slave\712657a4\workspace\POI\POI-DSL-Windows-1.17\poi-scratchpad\build\tmp\javadoc\javadoc.options'
* Try:
> Run with --stacktrace option to get the stack trace.
> Run with --info or --debug option to get more log output.
> Run with --scan to get full insights.
==============================================================================
2: Task failed with an exception.
-----------
* What went wrong:
Execution failed for task ':poi-excelant:javadoc'.
> Javadoc generation failed. Generated Javadoc options file (useful for troubleshooting): 'F:\jenkins\jenkins-slave\712657a4\workspace\POI\POI-DSL-Windows-1.17\poi-excelant\build\tmp\javadoc\javadoc.options'
* Try:
> Run with --stacktrace option to get the stack trace.
> Run with --info or --debug option to get more log output.
> Run with --scan to get full insights.
==============================================================================
3: Task failed with an exception.
-----------
* What went wrong:
Execution failed for task ':poi-examples:javadoc'.
> Javadoc generation failed. Generated Javadoc options file (useful for troubleshooting): 'F:\jenkins\jenkins-slave\712657a4\workspace\POI\POI-DSL-Windows-1.17\poi-examples\build\tmp\javadoc\javadoc.options'
* Try:
> Run with --stacktrace option to get the stack trace.
> Run with --info or --debug option to get more log output.
> Run with --scan to get full insights.
==============================================================================
4: Task failed with an exception.
-----------
* What went wrong:
Execution failed for task ':poi:javadoc'.
> Javadoc generation failed. Generated Javadoc options file (useful for troubleshooting): 'F:\jenkins\jenkins-slave\712657a4\workspace\POI\POI-DSL-Windows-1.17\poi\build\tmp\javadoc\javadoc.options'
* Try:
> Run with --stacktrace option to get the stack trace.
> Run with --info or --debug option to get more log output.
> Run with --scan to get full insights.
==============================================================================
* Get more help at https://help.gradle.org
Deprecated Gradle features were used in this build, making it incompatible with Gradle 8.0.
You can use '--warning-mode all' to show the individual deprecation warnings and determine if they come from your own scripts or plugins.
See https://docs.gradle.org/7.4/userguide/command_line_interface.html#sec:command_line_warnings
BUILD FAILED in 6m 48s
69 actionable tasks: 69 executed
Build step 'Invoke Gradle script' changed build result to FAILURE
Build step 'Invoke Gradle script' marked build as failure
[SpotBugs] Skipping execution of recorder since overall result is 'FAILURE'
Archiving artifacts
Recording test results
[Checks API] No suitable checks publisher found.
---------------------------------------------------------------------
To unsubscribe, e-mail: dev-unsubscribe@poi.apache.org
For additional commands, e-mail: dev-help@poi.apache.org