You are viewing a plain text version of this content. The canonical link for it is here.
Posted to commits@flex.apache.org by fl...@gmail.com on 2017/02/17 07:03:03 UTC

Build failed in Jenkins: flex-tlf #1005

See <http://apacheflexbuild.cloudapp.net:8080/job/flex-tlf/1005/>

------------------------------------------
Started by timer
Building remotely on flex_sdk_slave2 in workspace <http://apacheflexbuild.cloudapp.net:8080/job/flex-tlf/ws/>
 > C:\Program Files (x86)\Git\cmd\git.exe rev-parse --is-inside-work-tree # timeout=10
Fetching changes from the remote Git repository
 > C:\Program Files (x86)\Git\cmd\git.exe config remote.origin.url https://git-wip-us.apache.org/repos/asf/flex-tlf.git # timeout=10
Fetching upstream changes from https://git-wip-us.apache.org/repos/asf/flex-tlf.git
 > C:\Program Files (x86)\Git\cmd\git.exe --version # timeout=10
 > C:\Program Files (x86)\Git\cmd\git.exe fetch --tags --progress https://git-wip-us.apache.org/repos/asf/flex-tlf.git +refs/heads/*:refs/remotes/origin/*
 > C:\Program Files (x86)\Git\cmd\git.exe rev-parse "origin/develop^{commit}" # timeout=10
Checking out Revision 7fe228452bf7aff8bd670dbdc7cb4e6858628bab (origin/develop)
 > C:\Program Files (x86)\Git\cmd\git.exe config core.sparsecheckout # timeout=10
 > C:\Program Files (x86)\Git\cmd\git.exe checkout -f 7fe228452bf7aff8bd670dbdc7cb4e6858628bab
 > C:\Program Files (x86)\Git\cmd\git.exe rev-list 7fe228452bf7aff8bd670dbdc7cb4e6858628bab # timeout=10
[flex-tlf] $ cmd.exe /C "c:\Jenkins\tools\hudson.tasks.Ant_AntInstallation\c_apache-ant-1.9.3\bin\ant.bat -file build.xml all && exit %%ERRORLEVEL%%"
Buildfile: <http://apacheflexbuild.cloudapp.net:8080/job/flex-tlf/ws/build.xml>
     [echo] FLEX_HOME is <http://apacheflexbuild.cloudapp.net:8080/job/flex-tlf/ws/../flex-sdk>
     [echo] Minimal test is set false

clean:
   [delete] Deleting directory <http://apacheflexbuild.cloudapp.net:8080/job/flex-tlf/ws/bin>
   [delete] Deleting: <http://apacheflexbuild.cloudapp.net:8080/job/flex-tlf/ws/bundles.properties>

textLayout:
    [compc] Loading configuration file C:\Jenkins\workspace\flex-sdk\frameworks\flex-config.xml
    [compc] C:\Jenkins\workspace\flex-tlf\bin\textLayout.swc (550054 bytes)
    [compc] Picked up JAVA_TOOL_OPTIONS: -Dfile.encoding=UTF8

main:

asTestApps:
     [echo] FLEX_HOME is <http://apacheflexbuild.cloudapp.net:8080/job/flex-tlf/ws/../flex-sdk>
     [echo] Minimal test is set false

asTestApp:
    [mxmlc] Loading configuration file C:\Jenkins\workspace\flex-sdk\frameworks\flex-config.xml
    [mxmlc] C:\Jenkins\workspace\flex-tlf\bin\apps\asTestApps\bin\ExplicitFormField.swf (521424 bytes)
    [mxmlc] Picked up JAVA_TOOL_OPTIONS: -Dfile.encoding=UTF8
     [echo] FLEX_HOME is <http://apacheflexbuild.cloudapp.net:8080/job/flex-tlf/ws/../flex-sdk>
     [echo] Minimal test is set false

asTestApp:
    [mxmlc] Loading configuration file C:\Jenkins\workspace\flex-sdk\frameworks\flex-config.xml
    [mxmlc] Picked up JAVA_TOOL_OPTIONS: -Dfile.encoding=UTF8
    [mxmlc] C:\Jenkins\workspace\flex-tlf\bin\apps\asTestApps\bin\TCMTestFocus2.swf (528617 bytes)
     [echo] FLEX_HOME is <http://apacheflexbuild.cloudapp.net:8080/job/flex-tlf/ws/../flex-sdk>
     [echo] Minimal test is set false

asTestApp:
    [mxmlc] Loading configuration file C:\Jenkins\workspace\flex-sdk\frameworks\flex-config.xml
    [mxmlc] Picked up JAVA_TOOL_OPTIONS: -Dfile.encoding=UTF8
    [mxmlc] C:\Jenkins\workspace\flex-tlf\bin\apps\asTestApps\bin\AliceScroll.swf (589424 bytes)
     [echo] FLEX_HOME is <http://apacheflexbuild.cloudapp.net:8080/job/flex-tlf/ws/../flex-sdk>
     [echo] Minimal test is set false

asTestApp:
    [mxmlc] Loading configuration file C:\Jenkins\workspace\flex-sdk\frameworks\flex-config.xml
    [mxmlc] C:\Jenkins\workspace\flex-tlf\bin\apps\asTestApps\bin\KeyLogger.swf (2165 bytes)
    [mxmlc] Picked up JAVA_TOOL_OPTIONS: -Dfile.encoding=UTF8
     [echo] FLEX_HOME is <http://apacheflexbuild.cloudapp.net:8080/job/flex-tlf/ws/../flex-sdk>
     [echo] Minimal test is set false

asTestApp:
    [mxmlc] Loading configuration file C:\Jenkins\workspace\flex-sdk\frameworks\flex-config.xml
    [mxmlc] C:\Jenkins\workspace\flex-tlf\bin\apps\asTestApps\bin\OpHammer.swf (531607 bytes)
    [mxmlc] Picked up JAVA_TOOL_OPTIONS: -Dfile.encoding=UTF8

textLayout_editBar:
    [compc] Loading configuration file C:\Jenkins\workspace\flex-sdk\frameworks\flex-config.xml
    [compc] Picked up JAVA_TOOL_OPTIONS: -Dfile.encoding=UTF8
    [compc] C:\Jenkins\workspace\flex-tlf\bin\apps\testApps\bin\textLayout_editBar.swc (23173 bytes)

textLayout_ui:
    [compc] Loading configuration file C:\Jenkins\workspace\flex-sdk\frameworks\flex-config.xml
    [compc] C:\Jenkins\workspace\flex-tlf\bin\apps\testApps\bin\textLayout_ui.swc (112809 bytes)
    [compc] Picked up JAVA_TOOL_OPTIONS: -Dfile.encoding=UTF8

testApps:
    [mxmlc] Loading configuration file C:\Jenkins\workspace\flex-sdk\frameworks\flex-config.xml
    [mxmlc] Picked up JAVA_TOOL_OPTIONS: -Dfile.encoding=UTF8
    [mxmlc] C:\Jenkins\workspace\flex-tlf\bin\apps\automation_apps\bin\Flow.swf (2191218 bytes)

automation_core:
    [compc] Loading configuration file C:\Jenkins\workspace\flex-sdk\frameworks\flex-config.xml
    [compc] C:\Jenkins\workspace\flex-tlf\bin\apps\automation_apps\bin\automation_core.swc (36790 bytes)
    [compc] Picked up JAVA_TOOL_OPTIONS: -Dfile.encoding=UTF8

automation_tests:
    [compc] Loading configuration file C:\Jenkins\workspace\flex-sdk\frameworks\flex-config.xml
    [compc] C:\Jenkins\workspace\flex-tlf\bin\apps\automation_apps\bin\automation_tests.swc (494901 bytes)
    [compc] Picked up JAVA_TOOL_OPTIONS: -Dfile.encoding=UTF8

automation_apps:
    [mxmlc] Loading configuration file C:\Jenkins\workspace\flex-sdk\frameworks\flex-config.xml
    [mxmlc] Picked up JAVA_TOOL_OPTIONS: -Dfile.encoding=UTF8
    [mxmlc] C:\Jenkins\workspace\flex-tlf\bin\apps\automation_apps\bin\VellumUnit.swf (2684434 bytes)
     [copy] Copying 152 files to <http://apacheflexbuild.cloudapp.net:8080/job/flex-tlf/ws/bin/apps/test>

test:
 [flexunit] Validating task attributes ...
 [flexunit] Generating default values ...
 [flexunit] Using default working dir [<http://apacheflexbuild.cloudapp.net:8080/job/flex-tlf/ws/]>
 [flexunit] Using the following settings for the test run:
 [flexunit] 	FLEX_HOME: [<http://apacheflexbuild.cloudapp.net:8080/job/flex-tlf/ws/../flex-sdk]>
 [flexunit] 	haltonfailure: [true]
 [flexunit] 	headless: [false]
 [flexunit] 	display: [99]
 [flexunit] 	localTrusted: [true]
 [flexunit] 	player: [flash]
 [flexunit] 	port: [1024]
 [flexunit] 	swf: [<http://apacheflexbuild.cloudapp.net:8080/job/flex-tlf/ws/bin/apps/automation_apps/bin/VellumUnit.swf]>
 [flexunit] 	timeout: [60000ms]
 [flexunit] 	toDir: [<http://apacheflexbuild.cloudapp.net:8080/job/flex-tlf/ws/bin/apps/automation_apps]>
 [flexunit] Setting up server process ...
 [flexunit] Entry [<http://apacheflexbuild.cloudapp.net:8080/job/flex-tlf/ws/bin/apps/automation_apps/bin]> already available in local trust file at [C:\Users\apacheflexbuild\AppData\Roaming\Macromedia\Flash Player\#Security\FlashPlayerTrust\flexUnit.cfg].
 [flexunit] Executing 'rundll32' with arguments:
 [flexunit] 'url.dll,FileProtocolHandler'
 [flexunit] '<http://apacheflexbuild.cloudapp.net:8080/job/flex-tlf/ws/bin/apps/automation_apps/bin/VellumUnit.swf'>
 [flexunit] 
 [flexunit] The ' characters around the executable and arguments are
 [flexunit] not part of the command.
 [flexunit] 
 [flexunit] Starting server ...
 [flexunit] Opening server socket on port [1024].
 [flexunit] Waiting for client connection ...
 [flexunit] Client connected.
 [flexunit] Setting inbound buffer size to [262144] bytes.
 [flexunit] Receiving data ...
 [flexunit] Sending acknowledgement to player to start sending test data ...
 [flexunit] 
 [flexunit] FlexUnit test ShortTextMouseEventRLLTRTest ([object TestCaseVo]) in suite UnitTest.Tests.AllEventTest was ignored.
 [flexunit] FlexUnit test ShortTextMouseEventRLRTLTest ([object TestCaseVo]) in suite UnitTest.Tests.AllEventTest was ignored.
 [flexunit] FlexUnit test ShortTextMouseEventTBRTLTest ([object TestCaseVo]) in suite UnitTest.Tests.AllEventTest was ignored.
 [flexunit] FlexUnit test ShortTextMouseEventTBLTRTest ([object TestCaseVo]) in suite UnitTest.Tests.AllEventTest was ignored.
 [flexunit] FlexUnit test testAllEnumProps in suite UnitTest.Tests.AllParaAttributeTest was ignored.
 [flexunit] FlexUnit test partialCompositionTest (simple in suite UnitTest.Tests.CompositionTest was ignored.
 [flexunit] FlexUnit test deleteAtContainerStart (simple in suite UnitTest.Tests.CompositionTest was ignored.
 [flexunit] FlexUnit test partialCompositionTest (asknot in suite UnitTest.Tests.CompositionTest was ignored.
 [flexunit] FlexUnit test deleteAtContainerStart (asknot in suite UnitTest.Tests.CompositionTest was ignored.
 [flexunit] FlexUnit test draggingSelectioinMultiFlows in suite UnitTest.Tests.ContainerTypeTest was ignored.
 [flexunit] FlexUnit test contentWidthCheckLongFloat in suite UnitTest.Tests.FloatTest was ignored.
 [flexunit] FlexUnit test applyFormatToElementTest in suite UnitTest.Tests.OperationTest was ignored.
 [flexunit] FlexUnit test deletePreviousWordTest in suite UnitTest.Tests.OperationTest was ignored.
 [flexunit] FlexUnit test checkColumnGapOnWidthChangeTest ([object TestCaseVo]) in suite UnitTest.Tests.ContainerAttributeTest was ignored.
 [flexunit] FlexUnit test checkColumnGapOnWidthChangeTest ([object TestCaseVo]) in suite UnitTest.Tests.ContainerAttributeTest was ignored.
 [flexunit] FlexUnit test paddingBottomTest ([object TestCaseVo]) in suite UnitTest.Tests.ContainerAttributeTest was ignored.
 [flexunit] FlexUnit test spanElementReplaceTextInvalidPos in suite UnitTest.Tests.ElementOperationTest was ignored.
 [flexunit] FlexUnit test noTabStop in suite UnitTest.Tests.TabTest was ignored.
 [flexunit] FlexUnit test clipboardImporterTest in suite UnitTest.Tests.ImportAPITest failed.
 [flexunit] FlexUnit test clipboardExporterTest in suite UnitTest.Tests.ImportAPITest failed.
 [flexunit] FlexUnit test Uncaught Top Level Exception in suite org.flexunit.events.UnknownError had errors.
 [flexunit] 
 [flexunit] Stopping server ...
 [flexunit] End of test data reached, sending acknowledgement to player ...
 [flexunit] Closing client connection ...
 [flexunit] Closing server on port [1024] ...
 [flexunit] Analyzing reports ...
 [flexunit] 
 [flexunit] Suite: UnitTest.Tests.CrossContainerTest
 [flexunit] Tests run: 1, Failures: 0, Errors: 0, Skipped: 0, Time elapsed: 0.156 sec
 [flexunit] Suite: UnitTest.Tests.ImpliedParagraphTest
 [flexunit] Tests run: 6, Failures: 0, Errors: 0, Skipped: 0, Time elapsed: 0.355 sec
 [flexunit] Suite: UnitTest.Tests.FLEX_34807_Test
 [flexunit] Tests run: 5, Failures: 0, Errors: 0, Skipped: 0, Time elapsed: 0.669 sec
 [flexunit] Suite: UnitTest.Tests.BoundsAndAlignmentTest
 [flexunit] Tests run: 6, Failures: 0, Errors: 0, Skipped: 0, Time elapsed: 6.843 sec
 [flexunit] Suite: UnitTest.Tests.AttributeTest
 [flexunit] Tests run: 44, Failures: 0, Errors: 0, Skipped: 0, Time elapsed: 6.571 sec
 [flexunit] Suite: UnitTest.Tests.ContainerTypeTest
 [flexunit] Tests run: 22, Failures: 0, Errors: 0, Skipped: 1, Time elapsed: 4.843 sec
 [flexunit] Suite: UnitTest.Tests.UndoRedoTest
 [flexunit] Tests run: 1, Failures: 0, Errors: 0, Skipped: 0, Time elapsed: 0.183 sec
 [flexunit] Suite: UnitTest.Tests.BoxTest
 [flexunit] Tests run: 13, Failures: 0, Errors: 0, Skipped: 0, Time elapsed: 4.431 sec
 [flexunit] Suite: UnitTest.Tests.ScrollingTest
 [flexunit] Tests run: 15, Failures: 0, Errors: 0, Skipped: 0, Time elapsed: 18.374 sec
 [flexunit] Suite: UnitTest.Tests.HorizontalScrollingTest
 [flexunit] Tests run: 43, Failures: 0, Errors: 0, Skipped: 0, Time elapsed: 7.359 sec
 [flexunit] Suite: UnitTest.Tests.ContainerAttributeTest
 [flexunit] Tests run: 31, Failures: 0, Errors: 0, Skipped: 3, Time elapsed: 510.241 sec
 [flexunit] Suite: UnitTest.Tests.KeyboardGestureTest
 [flexunit] Tests run: 32, Failures: 0, Errors: 0, Skipped: 0, Time elapsed: 10.541 sec
 [flexunit] Suite: UnitTest.Tests.CompositionTest
 [flexunit] Tests run: 24, Failures: 0, Errors: 0, Skipped: 4, Time elapsed: 15.314 sec
 [flexunit] Suite: UnitTest.Tests.OperationTest
 [flexunit] Tests run: 47, Failures: 0, Errors: 0, Skipped: 2, Time elapsed: 22.776 sec
 [flexunit] Suite: UnitTest.Tests.GeneralFunctionsTest
 [flexunit] Tests run: 36, Failures: 0, Errors: 0, Skipped: 0, Time elapsed: 9.390 sec
 [flexunit] Suite: UnitTest.Tests.TextBlock_FLEX_35100_Test
 [flexunit] Tests run: 25, Failures: 0, Errors: 0, Skipped: 0, Time elapsed: 3.362 sec
 [flexunit] Suite: UnitTest.Tests.AllParaAttributeTest
 [flexunit] Tests run: 6, Failures: 0, Errors: 0, Skipped: 1, Time elapsed: 8.515 sec
 [flexunit] Suite: UnitTest.Tests.TabTest
 [flexunit] Tests run: 19, Failures: 0, Errors: 0, Skipped: 1, Time elapsed: 2.928 sec
 [flexunit] Suite: UnitTest.Tests.AllContAttributeTest
 [flexunit] Tests run: 6, Failures: 0, Errors: 0, Skipped: 0, Time elapsed: 10.936 sec
 [flexunit] Suite: UnitTest.Tests.EventOverrideTest
 [flexunit] Tests run: 12, Failures: 0, Errors: 0, Skipped: 0, Time elapsed: 2.373 sec
 [flexunit] Suite: UnitTest.Tests.AccessibilityMethodsTest
 [flexunit] Tests run: 5, Failures: 0, Errors: 0, Skipped: 0, Time elapsed: 0.746 sec
 [flexunit] Suite: UnitTest.Tests.ImportAPITest
 [flexunit] Tests run: 22, Failures: 2, Errors: 0, Skipped: 0, Time elapsed: 3.310 sec
 [flexunit] Suite: UnitTest.Tests.FactoryImportTest
 [flexunit] Tests run: 1, Failures: 0, Errors: 0, Skipped: 0, Time elapsed: 2.049 sec
 [flexunit] Suite: UnitTest.Tests.AllEventTest
 [flexunit] Tests run: 13, Failures: 0, Errors: 0, Skipped: 4, Time elapsed: 3.240 sec
 [flexunit] Suite: UnitTest.Tests.TextFlowEditTest
 [flexunit] Tests run: 3, Failures: 0, Errors: 0, Skipped: 0, Time elapsed: 0.553 sec
 [flexunit] Suite: UnitTest.Tests.FloatTest
 [flexunit] Tests run: 56, Failures: 0, Errors: 0, Skipped: 1, Time elapsed: 115.091 sec
 [flexunit] Suite: UnitTest.Tests.ElementOperationTest
 [flexunit] Tests run: 25, Failures: 0, Errors: 0, Skipped: 1, Time elapsed: 6.693 sec
 [flexunit] Suite: UnitTest.Tests.FlowModelTest
 [flexunit] Tests run: 23, Failures: 0, Errors: 0, Skipped: 0, Time elapsed: 5.697 sec
 [flexunit] Suite: UnitTest.Tests.WritingModeTest
 [flexunit] Tests run: 13, Failures: 0, Errors: 0, Skipped: 0, Time elapsed: 2.175 sec
 [flexunit] Suite: UnitTest.Tests.AllCharAttributeTest
 [flexunit] Tests run: 6, Failures: 0, Errors: 0, Skipped: 0, Time elapsed: 76.735 sec
 [flexunit] Suite: org.flexunit.events.UnknownError
 [flexunit] Tests run: 1, Failures: 0, Errors: 1, Skipped: 0, Time elapsed: 61.127 sec
 [flexunit] 
 [flexunit] Results :
 [flexunit] 
 [flexunit] Tests run: 562, Failures: 2, Errors: 1, Skipped: 18, Time elapsed: 923.576 sec
 [flexunit] 

BUILD FAILED
<http://apacheflexbuild.cloudapp.net:8080/job/flex-tlf/ws/build.xml>:319: FlexUnit tests failed during the test run.

Total time: 21 minutes 54 seconds
Picked up JAVA_TOOL_OPTIONS: -Dfile.encoding=UTF8
Build step 'Invoke Ant' marked build as failure
Archiving artifacts
Recording test results

Jenkins build is back to normal : flex-tlf #1008

Posted by fl...@gmail.com.
See <http://apacheflexbuild.cloudapp.net:8080/job/flex-tlf/1008/>


Build failed in Jenkins: flex-tlf #1007

Posted by fl...@gmail.com.
See <http://apacheflexbuild.cloudapp.net:8080/job/flex-tlf/1007/>

------------------------------------------
Started by timer
Building remotely on flex_sdk_slave2 in workspace <http://apacheflexbuild.cloudapp.net:8080/job/flex-tlf/ws/>
 > C:\Program Files (x86)\Git\cmd\git.exe rev-parse --is-inside-work-tree # timeout=10
Fetching changes from the remote Git repository
 > C:\Program Files (x86)\Git\cmd\git.exe config remote.origin.url https://git-wip-us.apache.org/repos/asf/flex-tlf.git # timeout=10
Fetching upstream changes from https://git-wip-us.apache.org/repos/asf/flex-tlf.git
 > C:\Program Files (x86)\Git\cmd\git.exe --version # timeout=10
 > C:\Program Files (x86)\Git\cmd\git.exe fetch --tags --progress https://git-wip-us.apache.org/repos/asf/flex-tlf.git +refs/heads/*:refs/remotes/origin/*
 > C:\Program Files (x86)\Git\cmd\git.exe rev-parse "origin/develop^{commit}" # timeout=10
Checking out Revision 7fe228452bf7aff8bd670dbdc7cb4e6858628bab (origin/develop)
 > C:\Program Files (x86)\Git\cmd\git.exe config core.sparsecheckout # timeout=10
 > C:\Program Files (x86)\Git\cmd\git.exe checkout -f 7fe228452bf7aff8bd670dbdc7cb4e6858628bab
 > C:\Program Files (x86)\Git\cmd\git.exe rev-list 7fe228452bf7aff8bd670dbdc7cb4e6858628bab # timeout=10
[flex-tlf] $ cmd.exe /C "c:\Jenkins\tools\hudson.tasks.Ant_AntInstallation\c_apache-ant-1.9.3\bin\ant.bat -file build.xml all && exit %%ERRORLEVEL%%"
Buildfile: <http://apacheflexbuild.cloudapp.net:8080/job/flex-tlf/ws/build.xml>
     [echo] FLEX_HOME is <http://apacheflexbuild.cloudapp.net:8080/job/flex-tlf/ws/../flex-sdk>
     [echo] Minimal test is set false

clean:
   [delete] Deleting directory <http://apacheflexbuild.cloudapp.net:8080/job/flex-tlf/ws/bin>
   [delete] Deleting: <http://apacheflexbuild.cloudapp.net:8080/job/flex-tlf/ws/bundles.properties>

textLayout:
    [compc] Loading configuration file C:\Jenkins\workspace\flex-sdk\frameworks\flex-config.xml
    [compc] C:\Jenkins\workspace\flex-tlf\bin\textLayout.swc (550049 bytes)
    [compc] Picked up JAVA_TOOL_OPTIONS: -Dfile.encoding=UTF8

main:

asTestApps:
     [echo] FLEX_HOME is <http://apacheflexbuild.cloudapp.net:8080/job/flex-tlf/ws/../flex-sdk>
     [echo] Minimal test is set false

asTestApp:
    [mxmlc] Loading configuration file C:\Jenkins\workspace\flex-sdk\frameworks\flex-config.xml
    [mxmlc] Picked up JAVA_TOOL_OPTIONS: -Dfile.encoding=UTF8
    [mxmlc] C:\Jenkins\workspace\flex-tlf\bin\apps\asTestApps\bin\ExplicitFormField.swf (521422 bytes)
     [echo] FLEX_HOME is <http://apacheflexbuild.cloudapp.net:8080/job/flex-tlf/ws/../flex-sdk>
     [echo] Minimal test is set false

asTestApp:
    [mxmlc] Loading configuration file C:\Jenkins\workspace\flex-sdk\frameworks\flex-config.xml
    [mxmlc] C:\Jenkins\workspace\flex-tlf\bin\apps\asTestApps\bin\TCMTestFocus2.swf (528615 bytes)
    [mxmlc] Picked up JAVA_TOOL_OPTIONS: -Dfile.encoding=UTF8
     [echo] FLEX_HOME is <http://apacheflexbuild.cloudapp.net:8080/job/flex-tlf/ws/../flex-sdk>
     [echo] Minimal test is set false

asTestApp:
    [mxmlc] Loading configuration file C:\Jenkins\workspace\flex-sdk\frameworks\flex-config.xml
    [mxmlc] Picked up JAVA_TOOL_OPTIONS: -Dfile.encoding=UTF8
    [mxmlc] C:\Jenkins\workspace\flex-tlf\bin\apps\asTestApps\bin\AliceScroll.swf (589427 bytes)
     [echo] FLEX_HOME is <http://apacheflexbuild.cloudapp.net:8080/job/flex-tlf/ws/../flex-sdk>
     [echo] Minimal test is set false

asTestApp:
    [mxmlc] Loading configuration file C:\Jenkins\workspace\flex-sdk\frameworks\flex-config.xml
    [mxmlc] C:\Jenkins\workspace\flex-tlf\bin\apps\asTestApps\bin\KeyLogger.swf (2165 bytes)
    [mxmlc] Picked up JAVA_TOOL_OPTIONS: -Dfile.encoding=UTF8
     [echo] FLEX_HOME is <http://apacheflexbuild.cloudapp.net:8080/job/flex-tlf/ws/../flex-sdk>
     [echo] Minimal test is set false

asTestApp:
    [mxmlc] Loading configuration file C:\Jenkins\workspace\flex-sdk\frameworks\flex-config.xml
    [mxmlc] C:\Jenkins\workspace\flex-tlf\bin\apps\asTestApps\bin\OpHammer.swf (531609 bytes)
    [mxmlc] Picked up JAVA_TOOL_OPTIONS: -Dfile.encoding=UTF8

textLayout_editBar:
    [compc] Loading configuration file C:\Jenkins\workspace\flex-sdk\frameworks\flex-config.xml
    [compc] C:\Jenkins\workspace\flex-tlf\bin\apps\testApps\bin\textLayout_editBar.swc (23170 bytes)
    [compc] Picked up JAVA_TOOL_OPTIONS: -Dfile.encoding=UTF8

textLayout_ui:
    [compc] Loading configuration file C:\Jenkins\workspace\flex-sdk\frameworks\flex-config.xml
    [compc] C:\Jenkins\workspace\flex-tlf\bin\apps\testApps\bin\textLayout_ui.swc (112812 bytes)
    [compc] Picked up JAVA_TOOL_OPTIONS: -Dfile.encoding=UTF8

testApps:
    [mxmlc] Loading configuration file C:\Jenkins\workspace\flex-sdk\frameworks\flex-config.xml
    [mxmlc] C:\Jenkins\workspace\flex-tlf\bin\apps\automation_apps\bin\Flow.swf (2191226 bytes)
    [mxmlc] Picked up JAVA_TOOL_OPTIONS: -Dfile.encoding=UTF8

automation_core:
    [compc] Loading configuration file C:\Jenkins\workspace\flex-sdk\frameworks\flex-config.xml
    [compc] C:\Jenkins\workspace\flex-tlf\bin\apps\automation_apps\bin\automation_core.swc (36792 bytes)
    [compc] Picked up JAVA_TOOL_OPTIONS: -Dfile.encoding=UTF8

automation_tests:
    [compc] Loading configuration file C:\Jenkins\workspace\flex-sdk\frameworks\flex-config.xml
    [compc] C:\Jenkins\workspace\flex-tlf\bin\apps\automation_apps\bin\automation_tests.swc (494917 bytes)
    [compc] Picked up JAVA_TOOL_OPTIONS: -Dfile.encoding=UTF8

automation_apps:
    [mxmlc] Loading configuration file C:\Jenkins\workspace\flex-sdk\frameworks\flex-config.xml
    [mxmlc] C:\Jenkins\workspace\flex-tlf\bin\apps\automation_apps\bin\VellumUnit.swf (2684424 bytes)
    [mxmlc] Picked up JAVA_TOOL_OPTIONS: -Dfile.encoding=UTF8
     [copy] Copying 152 files to <http://apacheflexbuild.cloudapp.net:8080/job/flex-tlf/ws/bin/apps/test>

test:
 [flexunit] Validating task attributes ...
 [flexunit] Generating default values ...
 [flexunit] Using default working dir [<http://apacheflexbuild.cloudapp.net:8080/job/flex-tlf/ws/]>
 [flexunit] Using the following settings for the test run:
 [flexunit] 	FLEX_HOME: [<http://apacheflexbuild.cloudapp.net:8080/job/flex-tlf/ws/../flex-sdk]>
 [flexunit] 	haltonfailure: [true]
 [flexunit] 	headless: [false]
 [flexunit] 	display: [99]
 [flexunit] 	localTrusted: [true]
 [flexunit] 	player: [flash]
 [flexunit] 	port: [1024]
 [flexunit] 	swf: [<http://apacheflexbuild.cloudapp.net:8080/job/flex-tlf/ws/bin/apps/automation_apps/bin/VellumUnit.swf]>
 [flexunit] 	timeout: [60000ms]
 [flexunit] 	toDir: [<http://apacheflexbuild.cloudapp.net:8080/job/flex-tlf/ws/bin/apps/automation_apps]>
 [flexunit] Setting up server process ...
 [flexunit] Entry [<http://apacheflexbuild.cloudapp.net:8080/job/flex-tlf/ws/bin/apps/automation_apps/bin]> already available in local trust file at [C:\Users\apacheflexbuild\AppData\Roaming\Macromedia\Flash Player\#Security\FlashPlayerTrust\flexUnit.cfg].
 [flexunit] Executing 'rundll32' with arguments:
 [flexunit] 'url.dll,FileProtocolHandler'
 [flexunit] '<http://apacheflexbuild.cloudapp.net:8080/job/flex-tlf/ws/bin/apps/automation_apps/bin/VellumUnit.swf'>
 [flexunit] 
 [flexunit] The ' characters around the executable and arguments are
 [flexunit] not part of the command.
 [flexunit] 
 [flexunit] Starting server ...
 [flexunit] Opening server socket on port [1024].
 [flexunit] Waiting for client connection ...
 [flexunit] Client connected.
 [flexunit] Setting inbound buffer size to [262144] bytes.
 [flexunit] Receiving data ...
 [flexunit] Sending acknowledgement to player to start sending test data ...
 [flexunit] 
 [flexunit] FlexUnit test ShortTextMouseEventRLLTRTest ([object TestCaseVo]) in suite UnitTest.Tests.AllEventTest was ignored.
 [flexunit] FlexUnit test ShortTextMouseEventRLRTLTest ([object TestCaseVo]) in suite UnitTest.Tests.AllEventTest was ignored.
 [flexunit] FlexUnit test ShortTextMouseEventTBRTLTest ([object TestCaseVo]) in suite UnitTest.Tests.AllEventTest was ignored.
 [flexunit] FlexUnit test ShortTextMouseEventTBLTRTest ([object TestCaseVo]) in suite UnitTest.Tests.AllEventTest was ignored.
 [flexunit] FlexUnit test testAllEnumProps in suite UnitTest.Tests.AllParaAttributeTest was ignored.
 [flexunit] FlexUnit test partialCompositionTest (simple in suite UnitTest.Tests.CompositionTest was ignored.
 [flexunit] FlexUnit test deleteAtContainerStart (simple in suite UnitTest.Tests.CompositionTest was ignored.
 [flexunit] FlexUnit test partialCompositionTest (asknot in suite UnitTest.Tests.CompositionTest was ignored.
 [flexunit] FlexUnit test deleteAtContainerStart (asknot in suite UnitTest.Tests.CompositionTest was ignored.
 [flexunit] FlexUnit test draggingSelectioinMultiFlows in suite UnitTest.Tests.ContainerTypeTest was ignored.
 [flexunit] FlexUnit test contentWidthCheckLongFloat in suite UnitTest.Tests.FloatTest was ignored.
 [flexunit] FlexUnit test applyFormatToElementTest in suite UnitTest.Tests.OperationTest was ignored.
 [flexunit] FlexUnit test deletePreviousWordTest in suite UnitTest.Tests.OperationTest was ignored.
 [flexunit] FlexUnit test checkColumnGapOnWidthChangeTest ([object TestCaseVo]) in suite UnitTest.Tests.ContainerAttributeTest was ignored.
 [flexunit] FlexUnit test checkColumnGapOnWidthChangeTest ([object TestCaseVo]) in suite UnitTest.Tests.ContainerAttributeTest was ignored.
 [flexunit] FlexUnit test paddingBottomTest ([object TestCaseVo]) in suite UnitTest.Tests.ContainerAttributeTest was ignored.
 [flexunit] FlexUnit test spanElementReplaceTextInvalidPos in suite UnitTest.Tests.ElementOperationTest was ignored.
 [flexunit] FlexUnit test noTabStop in suite UnitTest.Tests.TabTest was ignored.
 [flexunit] FlexUnit test clipboardImporterTest in suite UnitTest.Tests.ImportAPITest failed.
 [flexunit] FlexUnit test clipboardExporterTest in suite UnitTest.Tests.ImportAPITest failed.
 [flexunit] FlexUnit test Uncaught Top Level Exception in suite org.flexunit.events.UnknownError had errors.
 [flexunit] 
 [flexunit] Stopping server ...
 [flexunit] End of test data reached, sending acknowledgement to player ...
 [flexunit] Closing client connection ...
 [flexunit] Closing server on port [1024] ...
 [flexunit] Analyzing reports ...
 [flexunit] 
 [flexunit] Suite: UnitTest.Tests.CrossContainerTest
 [flexunit] Tests run: 1, Failures: 0, Errors: 0, Skipped: 0, Time elapsed: 0.165 sec
 [flexunit] Suite: UnitTest.Tests.ImpliedParagraphTest
 [flexunit] Tests run: 6, Failures: 0, Errors: 0, Skipped: 0, Time elapsed: 0.364 sec
 [flexunit] Suite: UnitTest.Tests.FLEX_34807_Test
 [flexunit] Tests run: 5, Failures: 0, Errors: 0, Skipped: 0, Time elapsed: 0.730 sec
 [flexunit] Suite: UnitTest.Tests.BoundsAndAlignmentTest
 [flexunit] Tests run: 6, Failures: 0, Errors: 0, Skipped: 0, Time elapsed: 7.267 sec
 [flexunit] Suite: UnitTest.Tests.AttributeTest
 [flexunit] Tests run: 44, Failures: 0, Errors: 0, Skipped: 0, Time elapsed: 7.054 sec
 [flexunit] Suite: UnitTest.Tests.ContainerTypeTest
 [flexunit] Tests run: 22, Failures: 0, Errors: 0, Skipped: 1, Time elapsed: 5.321 sec
 [flexunit] Suite: UnitTest.Tests.UndoRedoTest
 [flexunit] Tests run: 1, Failures: 0, Errors: 0, Skipped: 0, Time elapsed: 0.204 sec
 [flexunit] Suite: UnitTest.Tests.BoxTest
 [flexunit] Tests run: 13, Failures: 0, Errors: 0, Skipped: 0, Time elapsed: 4.672 sec
 [flexunit] Suite: UnitTest.Tests.ScrollingTest
 [flexunit] Tests run: 15, Failures: 0, Errors: 0, Skipped: 0, Time elapsed: 18.679 sec
 [flexunit] Suite: UnitTest.Tests.HorizontalScrollingTest
 [flexunit] Tests run: 43, Failures: 0, Errors: 0, Skipped: 0, Time elapsed: 7.509 sec
 [flexunit] Suite: UnitTest.Tests.ContainerAttributeTest
 [flexunit] Tests run: 31, Failures: 0, Errors: 0, Skipped: 3, Time elapsed: 511.434 sec
 [flexunit] Suite: UnitTest.Tests.KeyboardGestureTest
 [flexunit] Tests run: 32, Failures: 0, Errors: 0, Skipped: 0, Time elapsed: 10.644 sec
 [flexunit] Suite: UnitTest.Tests.CompositionTest
 [flexunit] Tests run: 24, Failures: 0, Errors: 0, Skipped: 4, Time elapsed: 15.477 sec
 [flexunit] Suite: UnitTest.Tests.OperationTest
 [flexunit] Tests run: 47, Failures: 0, Errors: 0, Skipped: 2, Time elapsed: 23.264 sec
 [flexunit] Suite: UnitTest.Tests.GeneralFunctionsTest
 [flexunit] Tests run: 36, Failures: 0, Errors: 0, Skipped: 0, Time elapsed: 10.127 sec
 [flexunit] Suite: UnitTest.Tests.TextBlock_FLEX_35100_Test
 [flexunit] Tests run: 25, Failures: 0, Errors: 0, Skipped: 0, Time elapsed: 3.624 sec
 [flexunit] Suite: UnitTest.Tests.AllParaAttributeTest
 [flexunit] Tests run: 6, Failures: 0, Errors: 0, Skipped: 1, Time elapsed: 8.775 sec
 [flexunit] Suite: UnitTest.Tests.TabTest
 [flexunit] Tests run: 19, Failures: 0, Errors: 0, Skipped: 1, Time elapsed: 2.728 sec
 [flexunit] Suite: UnitTest.Tests.AllContAttributeTest
 [flexunit] Tests run: 6, Failures: 0, Errors: 0, Skipped: 0, Time elapsed: 11.085 sec
 [flexunit] Suite: UnitTest.Tests.EventOverrideTest
 [flexunit] Tests run: 12, Failures: 0, Errors: 0, Skipped: 0, Time elapsed: 2.180 sec
 [flexunit] Suite: UnitTest.Tests.AccessibilityMethodsTest
 [flexunit] Tests run: 5, Failures: 0, Errors: 0, Skipped: 0, Time elapsed: 0.823 sec
 [flexunit] Suite: UnitTest.Tests.ImportAPITest
 [flexunit] Tests run: 22, Failures: 2, Errors: 0, Skipped: 0, Time elapsed: 3.361 sec
 [flexunit] Suite: UnitTest.Tests.FactoryImportTest
 [flexunit] Tests run: 1, Failures: 0, Errors: 0, Skipped: 0, Time elapsed: 1.780 sec
 [flexunit] Suite: UnitTest.Tests.AllEventTest
 [flexunit] Tests run: 13, Failures: 0, Errors: 0, Skipped: 4, Time elapsed: 3.238 sec
 [flexunit] Suite: UnitTest.Tests.TextFlowEditTest
 [flexunit] Tests run: 3, Failures: 0, Errors: 0, Skipped: 0, Time elapsed: 0.576 sec
 [flexunit] Suite: UnitTest.Tests.FloatTest
 [flexunit] Tests run: 56, Failures: 0, Errors: 0, Skipped: 1, Time elapsed: 118.359 sec
 [flexunit] Suite: UnitTest.Tests.ElementOperationTest
 [flexunit] Tests run: 25, Failures: 0, Errors: 0, Skipped: 1, Time elapsed: 6.524 sec
 [flexunit] Suite: UnitTest.Tests.FlowModelTest
 [flexunit] Tests run: 23, Failures: 0, Errors: 0, Skipped: 0, Time elapsed: 5.977 sec
 [flexunit] Suite: UnitTest.Tests.WritingModeTest
 [flexunit] Tests run: 13, Failures: 0, Errors: 0, Skipped: 0, Time elapsed: 2.289 sec
 [flexunit] Suite: UnitTest.Tests.AllCharAttributeTest
 [flexunit] Tests run: 6, Failures: 0, Errors: 0, Skipped: 0, Time elapsed: 79.835 sec
 [flexunit] Suite: org.flexunit.events.UnknownError
 [flexunit] Tests run: 1, Failures: 0, Errors: 1, Skipped: 0, Time elapsed: 60.114 sec
 [flexunit] 
 [flexunit] Results :
 [flexunit] 
 [flexunit] Tests run: 562, Failures: 2, Errors: 1, Skipped: 18, Time elapsed: 934.179 sec
 [flexunit] 

BUILD FAILED
<http://apacheflexbuild.cloudapp.net:8080/job/flex-tlf/ws/build.xml>:319: FlexUnit tests failed during the test run.

Total time: 22 minutes 7 seconds
Picked up JAVA_TOOL_OPTIONS: -Dfile.encoding=UTF8
Build step 'Invoke Ant' marked build as failure
Archiving artifacts
Recording test results

Build failed in Jenkins: flex-tlf #1006

Posted by fl...@gmail.com.
See <http://apacheflexbuild.cloudapp.net:8080/job/flex-tlf/1006/>

------------------------------------------
Started by timer
Started by timer
Started by timer
Building remotely on flex_sdk_slave2 in workspace <http://apacheflexbuild.cloudapp.net:8080/job/flex-tlf/ws/>
 > C:\Program Files (x86)\Git\cmd\git.exe rev-parse --is-inside-work-tree # timeout=10
Fetching changes from the remote Git repository
 > C:\Program Files (x86)\Git\cmd\git.exe config remote.origin.url https://git-wip-us.apache.org/repos/asf/flex-tlf.git # timeout=10
Fetching upstream changes from https://git-wip-us.apache.org/repos/asf/flex-tlf.git
 > C:\Program Files (x86)\Git\cmd\git.exe --version # timeout=10
 > C:\Program Files (x86)\Git\cmd\git.exe fetch --tags --progress https://git-wip-us.apache.org/repos/asf/flex-tlf.git +refs/heads/*:refs/remotes/origin/*
 > C:\Program Files (x86)\Git\cmd\git.exe rev-parse "origin/develop^{commit}" # timeout=10
Checking out Revision 7fe228452bf7aff8bd670dbdc7cb4e6858628bab (origin/develop)
 > C:\Program Files (x86)\Git\cmd\git.exe config core.sparsecheckout # timeout=10
 > C:\Program Files (x86)\Git\cmd\git.exe checkout -f 7fe228452bf7aff8bd670dbdc7cb4e6858628bab
 > C:\Program Files (x86)\Git\cmd\git.exe rev-list 7fe228452bf7aff8bd670dbdc7cb4e6858628bab # timeout=10
[flex-tlf] $ cmd.exe /C "c:\Jenkins\tools\hudson.tasks.Ant_AntInstallation\c_apache-ant-1.9.3\bin\ant.bat -file build.xml all && exit %%ERRORLEVEL%%"
Buildfile: <http://apacheflexbuild.cloudapp.net:8080/job/flex-tlf/ws/build.xml>
     [echo] FLEX_HOME is <http://apacheflexbuild.cloudapp.net:8080/job/flex-tlf/ws/../flex-sdk>
     [echo] Minimal test is set false

clean:
   [delete] Deleting directory <http://apacheflexbuild.cloudapp.net:8080/job/flex-tlf/ws/bin>
   [delete] Deleting: <http://apacheflexbuild.cloudapp.net:8080/job/flex-tlf/ws/bundles.properties>

textLayout:
    [compc] Loading configuration file C:\Jenkins\workspace\flex-sdk\frameworks\flex-config.xml
    [compc] C:\Jenkins\workspace\flex-tlf\bin\textLayout.swc (550037 bytes)
    [compc] Picked up JAVA_TOOL_OPTIONS: -Dfile.encoding=UTF8

main:

asTestApps:
     [echo] FLEX_HOME is <http://apacheflexbuild.cloudapp.net:8080/job/flex-tlf/ws/../flex-sdk>
     [echo] Minimal test is set false

asTestApp:
    [mxmlc] Loading configuration file C:\Jenkins\workspace\flex-sdk\frameworks\flex-config.xml
    [mxmlc] Picked up JAVA_TOOL_OPTIONS: -Dfile.encoding=UTF8
    [mxmlc] C:\Jenkins\workspace\flex-tlf\bin\apps\asTestApps\bin\ExplicitFormField.swf (521418 bytes)
     [echo] FLEX_HOME is <http://apacheflexbuild.cloudapp.net:8080/job/flex-tlf/ws/../flex-sdk>
     [echo] Minimal test is set false

asTestApp:
    [mxmlc] Loading configuration file C:\Jenkins\workspace\flex-sdk\frameworks\flex-config.xml
    [mxmlc] Picked up JAVA_TOOL_OPTIONS: -Dfile.encoding=UTF8
    [mxmlc] C:\Jenkins\workspace\flex-tlf\bin\apps\asTestApps\bin\TCMTestFocus2.swf (528616 bytes)
     [echo] FLEX_HOME is <http://apacheflexbuild.cloudapp.net:8080/job/flex-tlf/ws/../flex-sdk>
     [echo] Minimal test is set false

asTestApp:
    [mxmlc] Loading configuration file C:\Jenkins\workspace\flex-sdk\frameworks\flex-config.xml
    [mxmlc] Picked up JAVA_TOOL_OPTIONS: -Dfile.encoding=UTF8
    [mxmlc] C:\Jenkins\workspace\flex-tlf\bin\apps\asTestApps\bin\AliceScroll.swf (589428 bytes)
     [echo] FLEX_HOME is <http://apacheflexbuild.cloudapp.net:8080/job/flex-tlf/ws/../flex-sdk>
     [echo] Minimal test is set false

asTestApp:
    [mxmlc] Loading configuration file C:\Jenkins\workspace\flex-sdk\frameworks\flex-config.xml
    [mxmlc] Picked up JAVA_TOOL_OPTIONS: -Dfile.encoding=UTF8
    [mxmlc] C:\Jenkins\workspace\flex-tlf\bin\apps\asTestApps\bin\KeyLogger.swf (2164 bytes)
     [echo] FLEX_HOME is <http://apacheflexbuild.cloudapp.net:8080/job/flex-tlf/ws/../flex-sdk>
     [echo] Minimal test is set false

asTestApp:
    [mxmlc] Loading configuration file C:\Jenkins\workspace\flex-sdk\frameworks\flex-config.xml
    [mxmlc] C:\Jenkins\workspace\flex-tlf\bin\apps\asTestApps\bin\OpHammer.swf (531608 bytes)
    [mxmlc] Picked up JAVA_TOOL_OPTIONS: -Dfile.encoding=UTF8

textLayout_editBar:
    [compc] Loading configuration file C:\Jenkins\workspace\flex-sdk\frameworks\flex-config.xml
    [compc] C:\Jenkins\workspace\flex-tlf\bin\apps\testApps\bin\textLayout_editBar.swc (23173 bytes)
    [compc] Picked up JAVA_TOOL_OPTIONS: -Dfile.encoding=UTF8

textLayout_ui:
    [compc] Loading configuration file C:\Jenkins\workspace\flex-sdk\frameworks\flex-config.xml
    [compc] C:\Jenkins\workspace\flex-tlf\bin\apps\testApps\bin\textLayout_ui.swc (112805 bytes)
    [compc] Picked up JAVA_TOOL_OPTIONS: -Dfile.encoding=UTF8

testApps:
    [mxmlc] Loading configuration file C:\Jenkins\workspace\flex-sdk\frameworks\flex-config.xml
    [mxmlc] C:\Jenkins\workspace\flex-tlf\bin\apps\automation_apps\bin\Flow.swf (2191734 bytes)
    [mxmlc] Picked up JAVA_TOOL_OPTIONS: -Dfile.encoding=UTF8

automation_core:
    [compc] Loading configuration file C:\Jenkins\workspace\flex-sdk\frameworks\flex-config.xml
    [compc] Picked up JAVA_TOOL_OPTIONS: -Dfile.encoding=UTF8
    [compc] C:\Jenkins\workspace\flex-tlf\bin\apps\automation_apps\bin\automation_core.swc (36786 bytes)

automation_tests:
    [compc] Loading configuration file C:\Jenkins\workspace\flex-sdk\frameworks\flex-config.xml
    [compc] Picked up JAVA_TOOL_OPTIONS: -Dfile.encoding=UTF8
    [compc] C:\Jenkins\workspace\flex-tlf\bin\apps\automation_apps\bin\automation_tests.swc (494900 bytes)

automation_apps:
    [mxmlc] Loading configuration file C:\Jenkins\workspace\flex-sdk\frameworks\flex-config.xml
    [mxmlc] C:\Jenkins\workspace\flex-tlf\bin\apps\automation_apps\bin\VellumUnit.swf (2684420 bytes)
    [mxmlc] Picked up JAVA_TOOL_OPTIONS: -Dfile.encoding=UTF8
     [copy] Copying 152 files to <http://apacheflexbuild.cloudapp.net:8080/job/flex-tlf/ws/bin/apps/test>

test:
 [flexunit] Validating task attributes ...
 [flexunit] Generating default values ...
 [flexunit] Using default working dir [<http://apacheflexbuild.cloudapp.net:8080/job/flex-tlf/ws/]>
 [flexunit] Using the following settings for the test run:
 [flexunit] 	FLEX_HOME: [<http://apacheflexbuild.cloudapp.net:8080/job/flex-tlf/ws/../flex-sdk]>
 [flexunit] 	haltonfailure: [true]
 [flexunit] 	headless: [false]
 [flexunit] 	display: [99]
 [flexunit] 	localTrusted: [true]
 [flexunit] 	player: [flash]
 [flexunit] 	port: [1024]
 [flexunit] 	swf: [<http://apacheflexbuild.cloudapp.net:8080/job/flex-tlf/ws/bin/apps/automation_apps/bin/VellumUnit.swf]>
 [flexunit] 	timeout: [60000ms]
 [flexunit] 	toDir: [<http://apacheflexbuild.cloudapp.net:8080/job/flex-tlf/ws/bin/apps/automation_apps]>
 [flexunit] Setting up server process ...
 [flexunit] Entry [<http://apacheflexbuild.cloudapp.net:8080/job/flex-tlf/ws/bin/apps/automation_apps/bin]> already available in local trust file at [C:\Users\apacheflexbuild\AppData\Roaming\Macromedia\Flash Player\#Security\FlashPlayerTrust\flexUnit.cfg].
 [flexunit] Executing 'rundll32' with arguments:
 [flexunit] 'url.dll,FileProtocolHandler'
 [flexunit] '<http://apacheflexbuild.cloudapp.net:8080/job/flex-tlf/ws/bin/apps/automation_apps/bin/VellumUnit.swf'>
 [flexunit] 
 [flexunit] The ' characters around the executable and arguments are
 [flexunit] not part of the command.
 [flexunit] 
 [flexunit] Starting server ...
 [flexunit] Opening server socket on port [1024].
 [flexunit] Waiting for client connection ...
 [flexunit] Client connected.
 [flexunit] Setting inbound buffer size to [262144] bytes.
 [flexunit] Receiving data ...
 [flexunit] Sending acknowledgement to player to start sending test data ...
 [flexunit] 
 [flexunit] FlexUnit test ShortTextMouseEventRLLTRTest ([object TestCaseVo]) in suite UnitTest.Tests.AllEventTest was ignored.
 [flexunit] FlexUnit test ShortTextMouseEventRLRTLTest ([object TestCaseVo]) in suite UnitTest.Tests.AllEventTest was ignored.
 [flexunit] FlexUnit test ShortTextMouseEventTBRTLTest ([object TestCaseVo]) in suite UnitTest.Tests.AllEventTest was ignored.
 [flexunit] FlexUnit test ShortTextMouseEventTBLTRTest ([object TestCaseVo]) in suite UnitTest.Tests.AllEventTest was ignored.
 [flexunit] FlexUnit test testAllEnumProps in suite UnitTest.Tests.AllParaAttributeTest was ignored.
 [flexunit] FlexUnit test deleteAtContainerStart (simple in suite UnitTest.Tests.CompositionTest was ignored.
 [flexunit] FlexUnit test partialCompositionTest (simple in suite UnitTest.Tests.CompositionTest was ignored.
 [flexunit] FlexUnit test deleteAtContainerStart (asknot in suite UnitTest.Tests.CompositionTest was ignored.
 [flexunit] FlexUnit test partialCompositionTest (asknot in suite UnitTest.Tests.CompositionTest was ignored.
 [flexunit] FlexUnit test draggingSelectioinMultiFlows in suite UnitTest.Tests.ContainerTypeTest was ignored.
 [flexunit] FlexUnit test contentWidthCheckLongFloat in suite UnitTest.Tests.FloatTest was ignored.
 [flexunit] FlexUnit test applyFormatToElementTest in suite UnitTest.Tests.OperationTest was ignored.
 [flexunit] FlexUnit test deletePreviousWordTest in suite UnitTest.Tests.OperationTest was ignored.
 [flexunit] FlexUnit test checkColumnGapOnWidthChangeTest ([object TestCaseVo]) in suite UnitTest.Tests.ContainerAttributeTest was ignored.
 [flexunit] FlexUnit test checkColumnGapOnWidthChangeTest ([object TestCaseVo]) in suite UnitTest.Tests.ContainerAttributeTest was ignored.
 [flexunit] FlexUnit test paddingBottomTest ([object TestCaseVo]) in suite UnitTest.Tests.ContainerAttributeTest was ignored.
 [flexunit] FlexUnit test spanElementReplaceTextInvalidPos in suite UnitTest.Tests.ElementOperationTest was ignored.
 [flexunit] FlexUnit test noTabStop in suite UnitTest.Tests.TabTest was ignored.
 [flexunit] FlexUnit test clipboardImporterTest in suite UnitTest.Tests.ImportAPITest failed.
 [flexunit] FlexUnit test clipboardExporterTest in suite UnitTest.Tests.ImportAPITest failed.
 [flexunit] FlexUnit test TabPromoteDemoteListTest in suite UnitTest.Tests.KeyboardGestureTest failed.
 [flexunit] FlexUnit test Uncaught Top Level Exception in suite org.flexunit.events.UnknownError had errors.
 [flexunit] 
 [flexunit] Stopping server ...
 [flexunit] End of test data reached, sending acknowledgement to player ...
 [flexunit] Closing client connection ...
 [flexunit] Closing server on port [1024] ...
 [flexunit] Analyzing reports ...
 [flexunit] 
 [flexunit] Suite: UnitTest.Tests.CrossContainerTest
 [flexunit] Tests run: 1, Failures: 0, Errors: 0, Skipped: 0, Time elapsed: 0.162 sec
 [flexunit] Suite: UnitTest.Tests.ImpliedParagraphTest
 [flexunit] Tests run: 6, Failures: 0, Errors: 0, Skipped: 0, Time elapsed: 0.335 sec
 [flexunit] Suite: UnitTest.Tests.FLEX_34807_Test
 [flexunit] Tests run: 5, Failures: 0, Errors: 0, Skipped: 0, Time elapsed: 0.979 sec
 [flexunit] Suite: UnitTest.Tests.BoundsAndAlignmentTest
 [flexunit] Tests run: 6, Failures: 0, Errors: 0, Skipped: 0, Time elapsed: 7.637 sec
 [flexunit] Suite: UnitTest.Tests.AttributeTest
 [flexunit] Tests run: 44, Failures: 0, Errors: 0, Skipped: 0, Time elapsed: 6.709 sec
 [flexunit] Suite: UnitTest.Tests.ContainerTypeTest
 [flexunit] Tests run: 22, Failures: 0, Errors: 0, Skipped: 1, Time elapsed: 4.724 sec
 [flexunit] Suite: UnitTest.Tests.UndoRedoTest
 [flexunit] Tests run: 1, Failures: 0, Errors: 0, Skipped: 0, Time elapsed: 0.261 sec
 [flexunit] Suite: UnitTest.Tests.BoxTest
 [flexunit] Tests run: 13, Failures: 0, Errors: 0, Skipped: 0, Time elapsed: 4.537 sec
 [flexunit] Suite: UnitTest.Tests.ScrollingTest
 [flexunit] Tests run: 15, Failures: 0, Errors: 0, Skipped: 0, Time elapsed: 18.125 sec
 [flexunit] Suite: UnitTest.Tests.HorizontalScrollingTest
 [flexunit] Tests run: 43, Failures: 0, Errors: 0, Skipped: 0, Time elapsed: 7.310 sec
 [flexunit] Suite: UnitTest.Tests.ContainerAttributeTest
 [flexunit] Tests run: 31, Failures: 0, Errors: 0, Skipped: 3, Time elapsed: 521.904 sec
 [flexunit] Suite: UnitTest.Tests.KeyboardGestureTest
 [flexunit] Tests run: 37, Failures: 1, Errors: 0, Skipped: 0, Time elapsed: 10.019 sec
 [flexunit] Suite: UnitTest.Tests.CompositionTest
 [flexunit] Tests run: 24, Failures: 0, Errors: 0, Skipped: 4, Time elapsed: 16.082 sec
 [flexunit] Suite: UnitTest.Tests.OperationTest
 [flexunit] Tests run: 47, Failures: 0, Errors: 0, Skipped: 2, Time elapsed: 22.812 sec
 [flexunit] Suite: UnitTest.Tests.GeneralFunctionsTest
 [flexunit] Tests run: 36, Failures: 0, Errors: 0, Skipped: 0, Time elapsed: 10.122 sec
 [flexunit] Suite: UnitTest.Tests.TextBlock_FLEX_35100_Test
 [flexunit] Tests run: 25, Failures: 0, Errors: 0, Skipped: 0, Time elapsed: 3.261 sec
 [flexunit] Suite: UnitTest.Tests.AllParaAttributeTest
 [flexunit] Tests run: 6, Failures: 0, Errors: 0, Skipped: 1, Time elapsed: 8.780 sec
 [flexunit] Suite: UnitTest.Tests.TabTest
 [flexunit] Tests run: 19, Failures: 0, Errors: 0, Skipped: 1, Time elapsed: 2.751 sec
 [flexunit] Suite: UnitTest.Tests.AllContAttributeTest
 [flexunit] Tests run: 6, Failures: 0, Errors: 0, Skipped: 0, Time elapsed: 11.218 sec
 [flexunit] Suite: UnitTest.Tests.EventOverrideTest
 [flexunit] Tests run: 12, Failures: 0, Errors: 0, Skipped: 0, Time elapsed: 2.102 sec
 [flexunit] Suite: UnitTest.Tests.AccessibilityMethodsTest
 [flexunit] Tests run: 5, Failures: 0, Errors: 0, Skipped: 0, Time elapsed: 0.764 sec
 [flexunit] Suite: UnitTest.Tests.ImportAPITest
 [flexunit] Tests run: 22, Failures: 2, Errors: 0, Skipped: 0, Time elapsed: 3.445 sec
 [flexunit] Suite: UnitTest.Tests.FactoryImportTest
 [flexunit] Tests run: 1, Failures: 0, Errors: 0, Skipped: 0, Time elapsed: 1.452 sec
 [flexunit] Suite: UnitTest.Tests.AllEventTest
 [flexunit] Tests run: 13, Failures: 0, Errors: 0, Skipped: 4, Time elapsed: 3.530 sec
 [flexunit] Suite: UnitTest.Tests.TextFlowEditTest
 [flexunit] Tests run: 3, Failures: 0, Errors: 0, Skipped: 0, Time elapsed: 0.566 sec
 [flexunit] Suite: UnitTest.Tests.FloatTest
 [flexunit] Tests run: 56, Failures: 0, Errors: 0, Skipped: 1, Time elapsed: 118.882 sec
 [flexunit] Suite: UnitTest.Tests.ElementOperationTest
 [flexunit] Tests run: 25, Failures: 0, Errors: 0, Skipped: 1, Time elapsed: 6.349 sec
 [flexunit] Suite: UnitTest.Tests.FlowModelTest
 [flexunit] Tests run: 23, Failures: 0, Errors: 0, Skipped: 0, Time elapsed: 6.039 sec
 [flexunit] Suite: UnitTest.Tests.WritingModeTest
 [flexunit] Tests run: 13, Failures: 0, Errors: 0, Skipped: 0, Time elapsed: 2.330 sec
 [flexunit] Suite: UnitTest.Tests.AllCharAttributeTest
 [flexunit] Tests run: 6, Failures: 0, Errors: 0, Skipped: 0, Time elapsed: 82.411 sec
 [flexunit] Suite: org.flexunit.events.UnknownError
 [flexunit] Tests run: 1, Failures: 0, Errors: 1, Skipped: 0, Time elapsed: 60.169 sec
 [flexunit] 
 [flexunit] Results :
 [flexunit] 
 [flexunit] Tests run: 567, Failures: 3, Errors: 1, Skipped: 18, Time elapsed: 945.767 sec
 [flexunit] 

BUILD FAILED
<http://apacheflexbuild.cloudapp.net:8080/job/flex-tlf/ws/build.xml>:319: FlexUnit tests failed during the test run.

Total time: 22 minutes 24 seconds
Picked up JAVA_TOOL_OPTIONS: -Dfile.encoding=UTF8
Build step 'Invoke Ant' marked build as failure
Archiving artifacts
Recording test results