You are viewing a plain text version of this content. The canonical link for it is here.
Posted to builds@beam.apache.org by Apache Jenkins Server <je...@builds.apache.org> on 2022/08/19 07:17:29 UTC

Build failed in Jenkins: beam_PerformanceTests_InfluxDbIO_IT #2235

See <https://ci-beam.apache.org/job/beam_PerformanceTests_InfluxDbIO_IT/2235/display/redirect>

Changes:


------------------------------------------
[...truncated 148.69 KB...]

> Task :sdks:java:core:testClasses
Skipping task ':sdks:java:core:testClasses' as it has no actions.
:sdks:java:core:testClasses (Thread[Execution worker for ':' Thread 6,5,main]) completed. Took 0.0 secs.
:sdks:java:core:shadowTestJar (Thread[Execution worker for ':' Thread 6,5,main]) started.

> Task :runners:core-java:jar
Caching disabled for task ':runners:core-java:jar' because:
  Not worth caching
Task ':runners:core-java:jar' is not up-to-date because:
  No history is available.
file or directory '<https://ci-beam.apache.org/job/beam_PerformanceTests_InfluxDbIO_IT/ws/src/runners/core-java/build/resources/main',> not found
:runners:core-java:jar (Thread[included builds,5,main]) completed. Took 0.069 secs.
:sdks:java:extensions:google-cloud-platform-core:compileJava (Thread[included builds,5,main]) started.

> Task :sdks:java:extensions:google-cloud-platform-core:compileJava FROM-CACHE
Custom actions are attached to task ':sdks:java:extensions:google-cloud-platform-core:compileJava'.
Build cache key for task ':sdks:java:extensions:google-cloud-platform-core:compileJava' is ff41b211a9a782fe456a70f2185baab0
Task ':sdks:java:extensions:google-cloud-platform-core:compileJava' is not up-to-date because:
  No history is available.
Loaded cache entry for task ':sdks:java:extensions:google-cloud-platform-core:compileJava' with cache key ff41b211a9a782fe456a70f2185baab0
:sdks:java:extensions:google-cloud-platform-core:compileJava (Thread[included builds,5,main]) completed. Took 0.087 secs.
:sdks:java:extensions:google-cloud-platform-core:classes (Thread[included builds,5,main]) started.

> Task :sdks:java:extensions:google-cloud-platform-core:classes UP-TO-DATE
Skipping task ':sdks:java:extensions:google-cloud-platform-core:classes' as it has no actions.
:sdks:java:extensions:google-cloud-platform-core:classes (Thread[included builds,5,main]) completed. Took 0.0 secs.
:sdks:java:extensions:google-cloud-platform-core:jar (Thread[included builds,5,main]) started.

> Task :sdks:java:core:shadowTestJar FROM-CACHE
Build cache key for task ':sdks:java:core:shadowTestJar' is 32abc96ae6b8fe1487aadf35c555dc26
Task ':sdks:java:core:shadowTestJar' is not up-to-date because:
  No history is available.
Loaded cache entry for task ':sdks:java:core:shadowTestJar' with cache key 32abc96ae6b8fe1487aadf35c555dc26
:sdks:java:core:shadowTestJar (Thread[Execution worker for ':' Thread 6,5,main]) completed. Took 0.11 secs.
:runners:core-java:compileTestJava (Thread[Execution worker for ':' Thread 6,5,main]) started.

> Task :sdks:java:extensions:google-cloud-platform-core:jar
Caching disabled for task ':sdks:java:extensions:google-cloud-platform-core:jar' because:
  Not worth caching
Task ':sdks:java:extensions:google-cloud-platform-core:jar' is not up-to-date because:
  No history is available.
file or directory '<https://ci-beam.apache.org/job/beam_PerformanceTests_InfluxDbIO_IT/ws/src/sdks/java/extensions/google-cloud-platform-core/build/resources/main',> not found
:sdks:java:extensions:google-cloud-platform-core:jar (Thread[included builds,5,main]) completed. Took 0.025 secs.
:sdks:java:harness:compileJava (Thread[included builds,5,main]) started.

> Task :sdks:java:harness:compileJava FROM-CACHE
Custom actions are attached to task ':sdks:java:harness:compileJava'.
Build cache key for task ':sdks:java:harness:compileJava' is 5170e054f2287e5973f5b67df8a496f0
Task ':sdks:java:harness:compileJava' is not up-to-date because:
  No history is available.
Loaded cache entry for task ':sdks:java:harness:compileJava' with cache key 5170e054f2287e5973f5b67df8a496f0
:sdks:java:harness:compileJava (Thread[included builds,5,main]) completed. Took 0.078 secs.
:sdks:java:harness:classes (Thread[included builds,5,main]) started.

> Task :sdks:java:harness:classes UP-TO-DATE
Skipping task ':sdks:java:harness:classes' as it has no actions.
:sdks:java:harness:classes (Thread[included builds,5,main]) completed. Took 0.0 secs.
:sdks:java:harness:jar (Thread[included builds,5,main]) started.

> Task :sdks:java:harness:jar
Caching disabled for task ':sdks:java:harness:jar' because:
  Not worth caching
Task ':sdks:java:harness:jar' is not up-to-date because:
  No history is available.
file or directory '<https://ci-beam.apache.org/job/beam_PerformanceTests_InfluxDbIO_IT/ws/src/sdks/java/harness/build/resources/main',> not found
:sdks:java:harness:jar (Thread[included builds,5,main]) completed. Took 0.063 secs.
:runners:java-fn-execution:compileJava (Thread[included builds,5,main]) started.

> Task :runners:java-fn-execution:compileJava FROM-CACHE
Custom actions are attached to task ':runners:java-fn-execution:compileJava'.
Build cache key for task ':runners:java-fn-execution:compileJava' is 2d0a8e639d9c06e20ec3c61675899f73
Task ':runners:java-fn-execution:compileJava' is not up-to-date because:
  No history is available.
Loaded cache entry for task ':runners:java-fn-execution:compileJava' with cache key 2d0a8e639d9c06e20ec3c61675899f73
:runners:java-fn-execution:compileJava (Thread[included builds,5,main]) completed. Took 0.081 secs.
:runners:java-fn-execution:classes (Thread[included builds,5,main]) started.

> Task :runners:java-fn-execution:classes UP-TO-DATE
Skipping task ':runners:java-fn-execution:classes' as it has no actions.
:runners:java-fn-execution:classes (Thread[included builds,5,main]) completed. Took 0.0 secs.
:runners:java-fn-execution:jar (Thread[included builds,5,main]) started.

> Task :runners:java-fn-execution:jar
Caching disabled for task ':runners:java-fn-execution:jar' because:
  Not worth caching
Task ':runners:java-fn-execution:jar' is not up-to-date because:
  No history is available.
file or directory '<https://ci-beam.apache.org/job/beam_PerformanceTests_InfluxDbIO_IT/ws/src/runners/java-fn-execution/build/resources/main',> not found
:runners:java-fn-execution:jar (Thread[included builds,5,main]) completed. Took 0.04 secs.
:runners:direct-java:compileJava (Thread[included builds,5,main]) started.

> Task :runners:core-java:compileTestJava FROM-CACHE
Custom actions are attached to task ':runners:core-java:compileTestJava'.
Build cache key for task ':runners:core-java:compileTestJava' is 54b5c1c57b697073b837a72db0d69de1
Task ':runners:core-java:compileTestJava' is not up-to-date because:
  No history is available.
Loaded cache entry for task ':runners:core-java:compileTestJava' with cache key 54b5c1c57b697073b837a72db0d69de1
:runners:core-java:compileTestJava (Thread[Execution worker for ':' Thread 6,5,main]) completed. Took 0.317 secs.
:runners:core-java:testClasses (Thread[Execution worker for ':' Thread 6,5,main]) started.

> Task :runners:core-java:testClasses UP-TO-DATE
Skipping task ':runners:core-java:testClasses' as it has no actions.
:runners:core-java:testClasses (Thread[Execution worker for ':' Thread 6,5,main]) completed. Took 0.0 secs.
:runners:core-java:testJar (Thread[Execution worker for ':' Thread 2,5,main]) started.

> Task :runners:core-java:testJar
Caching disabled for task ':runners:core-java:testJar' because:
  Not worth caching
Task ':runners:core-java:testJar' is not up-to-date because:
  No history is available.
file or directory '<https://ci-beam.apache.org/job/beam_PerformanceTests_InfluxDbIO_IT/ws/src/runners/core-java/build/resources/test',> not found
:runners:core-java:testJar (Thread[Execution worker for ':' Thread 2,5,main]) completed. Took 0.038 secs.

> Task :runners:direct-java:compileJava FROM-CACHE
Custom actions are attached to task ':runners:direct-java:compileJava'.
Build cache key for task ':runners:direct-java:compileJava' is cc69bda8a4657eb86fbe7adede0c6bfc
Task ':runners:direct-java:compileJava' is not up-to-date because:
  No history is available.
Loaded cache entry for task ':runners:direct-java:compileJava' with cache key cc69bda8a4657eb86fbe7adede0c6bfc
:runners:direct-java:compileJava (Thread[included builds,5,main]) completed. Took 0.091 secs.
:runners:direct-java:classes (Thread[included builds,5,main]) started.

> Task :runners:direct-java:classes UP-TO-DATE
Skipping task ':runners:direct-java:classes' as it has no actions.
:runners:direct-java:classes (Thread[included builds,5,main]) completed. Took 0.0 secs.
:runners:direct-java:shadowJar (Thread[included builds,5,main]) started.

> Task :runners:direct-java:shadowJar FROM-CACHE
Custom actions are attached to task ':runners:direct-java:shadowJar'.
Build cache key for task ':runners:direct-java:shadowJar' is 4f98c1231921a8bd82bafc94bba8b599
Task ':runners:direct-java:shadowJar' is not up-to-date because:
  No history is available.
Loaded cache entry for task ':runners:direct-java:shadowJar' with cache key 4f98c1231921a8bd82bafc94bba8b599
:runners:direct-java:shadowJar (Thread[included builds,5,main]) completed. Took 0.295 secs.
:runners:direct-java:compileTestJava (Thread[included builds,5,main]) started.

> Task :runners:direct-java:compileTestJava FROM-CACHE
Custom actions are attached to task ':runners:direct-java:compileTestJava'.
Build cache key for task ':runners:direct-java:compileTestJava' is 8e3905f6fff1d77fb11ffd70f152bbbc
Task ':runners:direct-java:compileTestJava' is not up-to-date because:
  No history is available.
Loaded cache entry for task ':runners:direct-java:compileTestJava' with cache key 8e3905f6fff1d77fb11ffd70f152bbbc
:runners:direct-java:compileTestJava (Thread[included builds,5,main]) completed. Took 0.106 secs.
:runners:direct-java:testClasses (Thread[included builds,5,main]) started.

> Task :runners:direct-java:testClasses UP-TO-DATE
Skipping task ':runners:direct-java:testClasses' as it has no actions.
:runners:direct-java:testClasses (Thread[included builds,5,main]) completed. Took 0.0 secs.
:runners:direct-java:shadowTestJar (Thread[included builds,5,main]) started.

> Task :runners:direct-java:shadowTestJar FROM-CACHE
Build cache key for task ':runners:direct-java:shadowTestJar' is 874bc6cbbf029bbd3c3c84cf7246ec47
Task ':runners:direct-java:shadowTestJar' is not up-to-date because:
  No history is available.
Loaded cache entry for task ':runners:direct-java:shadowTestJar' with cache key 874bc6cbbf029bbd3c3c84cf7246ec47
:runners:direct-java:shadowTestJar (Thread[included builds,5,main]) completed. Took 0.213 secs.
:sdks:java:io:influxdb:integrationTest (Thread[included builds,5,main]) started.
producer locations for task group 0 (Thread[Execution worker for ':' Thread 7,5,main]) started.
producer locations for task group 0 (Thread[Execution worker for ':' Thread 7,5,main]) completed. Took 0.0 secs.
Gradle Test Executor 144 started executing tests.

> Task :sdks:java:io:influxdb:integrationTest
Custom actions are attached to task ':sdks:java:io:influxdb:integrationTest'.
Build cache key for task ':sdks:java:io:influxdb:integrationTest' is 0e7e41c9305bd1e8f1ba69635ff0c204
Task ':sdks:java:io:influxdb:integrationTest' is not up-to-date because:
  Task.upToDateWhen is false.
Starting process 'Gradle Test Executor 144'. Working directory: <https://ci-beam.apache.org/job/beam_PerformanceTests_InfluxDbIO_IT/ws/src/sdks/java/io/influxdb> Command: /usr/lib/jvm/java-8-openjdk-amd64/bin/java -DbeamTestPipelineOptions=["--influxDBURL=http://34.173.97.189:8086","--influxDBUserName=superadmin","--influxDBPassword=supersecretpassword","--databaseName=db1"] -Djava.security.manager=worker.org.gradle.process.internal.worker.child.BootstrapSecurityManager -Dorg.gradle.internal.worker.tmpdir=<https://ci-beam.apache.org/job/beam_PerformanceTests_InfluxDbIO_IT/ws/src/sdks/java/io/influxdb/build/tmp/integrationTest/work> -Dorg.gradle.native=false -Xmx2g -Dfile.encoding=UTF-8 -Duser.country=US -Duser.language=en -Duser.variant -ea -cp /home/jenkins/.gradle/caches/7.4/workerMain/gradle-worker.jar worker.org.gradle.process.internal.worker.GradleWorkerMain 'Gradle Test Executor 144'
Successfully started process 'Gradle Test Executor 144'

org.apache.beam.sdk.io.influxdb.InfluxDbIOIT > testWriteAndReadWithMultipleMetric FAILED
    org.influxdb.InfluxDBIOException: java.net.SocketTimeoutException: connect timed out
        at org.influxdb.impl.InfluxDBImpl.execute(InfluxDBImpl.java:836)
        at org.influxdb.impl.InfluxDBImpl.executeQuery(InfluxDBImpl.java:819)
        at org.influxdb.impl.InfluxDBImpl.query(InfluxDBImpl.java:554)
        at org.apache.beam.sdk.io.influxdb.InfluxDbIOIT.initTest(InfluxDbIOIT.java:99)

        Caused by:
        java.net.SocketTimeoutException: connect timed out
            at java.net.PlainSocketImpl.socketConnect(Native Method)
            at java.net.AbstractPlainSocketImpl.doConnect(AbstractPlainSocketImpl.java:350)
            at java.net.AbstractPlainSocketImpl.connectToAddress(AbstractPlainSocketImpl.java:206)
            at java.net.AbstractPlainSocketImpl.connect(AbstractPlainSocketImpl.java:188)
            at java.net.SocksSocketImpl.connect(SocksSocketImpl.java:392)
            at java.net.Socket.connect(Socket.java:607)
            at okhttp3.internal.platform.Platform.connectSocket(Platform.kt:119)
            at okhttp3.internal.connection.RealConnection.connectSocket(RealConnection.kt:283)
            at okhttp3.internal.connection.RealConnection.connect(RealConnection.kt:195)
            at okhttp3.internal.connection.ExchangeFinder.findConnection(ExchangeFinder.kt:249)
            at okhttp3.internal.connection.ExchangeFinder.findHealthyConnection(ExchangeFinder.kt:108)
            at okhttp3.internal.connection.ExchangeFinder.find(ExchangeFinder.kt:76)
            at okhttp3.internal.connection.RealCall.initExchange$okhttp(RealCall.kt:245)
            at okhttp3.internal.connection.ConnectInterceptor.intercept(ConnectInterceptor.kt:32)
            at okhttp3.internal.http.RealInterceptorChain.proceed(RealInterceptorChain.kt:100)
            at okhttp3.internal.cache.CacheInterceptor.intercept(CacheInterceptor.kt:82)
            at okhttp3.internal.http.RealInterceptorChain.proceed(RealInterceptorChain.kt:100)
            at okhttp3.internal.http.BridgeInterceptor.intercept(BridgeInterceptor.kt:83)
            at okhttp3.internal.http.RealInterceptorChain.proceed(RealInterceptorChain.kt:100)
            at okhttp3.internal.http.RetryAndFollowUpInterceptor.intercept(RetryAndFollowUpInterceptor.kt:76)
            at okhttp3.internal.http.RealInterceptorChain.proceed(RealInterceptorChain.kt:100)
            at org.influxdb.impl.BasicAuthInterceptor.intercept(BasicAuthInterceptor.java:22)
            at okhttp3.internal.http.RealInterceptorChain.proceed(RealInterceptorChain.kt:100)
            at org.influxdb.impl.GzipRequestInterceptor.intercept(GzipRequestInterceptor.java:42)
            at okhttp3.internal.http.RealInterceptorChain.proceed(RealInterceptorChain.kt:100)
            at okhttp3.logging.HttpLoggingInterceptor.intercept(HttpLoggingInterceptor.kt:152)
            at okhttp3.internal.http.RealInterceptorChain.proceed(RealInterceptorChain.kt:100)
            at okhttp3.internal.connection.RealCall.getResponseWithInterceptorChain$okhttp(RealCall.kt:197)
            at okhttp3.internal.connection.RealCall.execute(RealCall.kt:148)
            at retrofit2.OkHttpCall.execute(OkHttpCall.java:190)
            at org.influxdb.impl.InfluxDBImpl.execute(InfluxDBImpl.java:824)
            ... 3 more

Gradle Test Executor 144 finished executing tests.

> Task :sdks:java:io:influxdb:integrationTest FAILED

6 tests completed, 1 failed
Finished generating test XML results (0.001 secs) into: <https://ci-beam.apache.org/job/beam_PerformanceTests_InfluxDbIO_IT/ws/src/sdks/java/io/influxdb/build/test-results/integrationTest>
Generating HTML test report...
Finished generating test html results (0.002 secs) into: <https://ci-beam.apache.org/job/beam_PerformanceTests_InfluxDbIO_IT/ws/src/sdks/java/io/influxdb/build/reports/tests/integrationTest>
:sdks:java:io:influxdb:integrationTest (Thread[included builds,5,main]) completed. Took 18.34 secs.

FAILURE: Build failed with an exception.

* What went wrong:
Execution failed for task ':sdks:java:io:influxdb:integrationTest'.
> There were failing tests. See the report at: file://<https://ci-beam.apache.org/job/beam_PerformanceTests_InfluxDbIO_IT/ws/src/sdks/java/io/influxdb/build/reports/tests/integrationTest/index.html>

* Try:
> Run with --stacktrace option to get the stack trace.
> Run with --debug option to get more log output.
> Run with --scan to get full insights.

* Get more help at https://help.gradle.org

Deprecated Gradle features were used in this build, making it incompatible with Gradle 8.0.

You can use '--warning-mode all' to show the individual deprecation warnings and determine if they come from your own scripts or plugins.

See https://docs.gradle.org/7.4/userguide/command_line_interface.html#sec:command_line_warnings

BUILD FAILED in 26s
77 actionable tasks: 42 executed, 33 from cache, 2 up-to-date

Publishing build scan...
https://gradle.com/s/zj73b74neagi6

Build step 'Invoke Gradle script' changed build result to FAILURE
Build step 'Invoke Gradle script' marked build as failure

---------------------------------------------------------------------
To unsubscribe, e-mail: builds-unsubscribe@beam.apache.org
For additional commands, e-mail: builds-help@beam.apache.org


Jenkins build is back to normal : beam_PerformanceTests_InfluxDbIO_IT #2240

Posted by Apache Jenkins Server <je...@builds.apache.org>.
See <https://ci-beam.apache.org/job/beam_PerformanceTests_InfluxDbIO_IT/2240/display/redirect>


---------------------------------------------------------------------
To unsubscribe, e-mail: builds-unsubscribe@beam.apache.org
For additional commands, e-mail: builds-help@beam.apache.org


Build failed in Jenkins: beam_PerformanceTests_InfluxDbIO_IT #2239

Posted by Apache Jenkins Server <je...@builds.apache.org>.
See <https://ci-beam.apache.org/job/beam_PerformanceTests_InfluxDbIO_IT/2239/display/redirect>

Changes:


------------------------------------------
[...truncated 148.88 KB...]
Custom actions are attached to task ':sdks:java:core:compileTestJava'.
Build cache key for task ':sdks:java:core:compileTestJava' is ebbb5da702186fd81d409b192615be05
Task ':sdks:java:core:compileTestJava' is not up-to-date because:
  No history is available.
Loaded cache entry for task ':sdks:java:core:compileTestJava' with cache key ebbb5da702186fd81d409b192615be05
:sdks:java:core:compileTestJava (Thread[Execution worker for ':' Thread 5,5,main]) completed. Took 1.934 secs.
:sdks:java:core:testClasses (Thread[Execution worker for ':' Thread 5,5,main]) started.

> Task :sdks:java:core:testClasses
Skipping task ':sdks:java:core:testClasses' as it has no actions.
:sdks:java:core:testClasses (Thread[Execution worker for ':' Thread 5,5,main]) completed. Took 0.0 secs.
:sdks:java:core:shadowTestJar (Thread[Execution worker for ':' Thread 5,5,main]) started.

> Task :sdks:java:core:shadowTestJar FROM-CACHE
Build cache key for task ':sdks:java:core:shadowTestJar' is 8b20d0725a7535a80613a640c910a5b4
Task ':sdks:java:core:shadowTestJar' is not up-to-date because:
  No history is available.
Loaded cache entry for task ':sdks:java:core:shadowTestJar' with cache key 8b20d0725a7535a80613a640c910a5b4
:sdks:java:core:shadowTestJar (Thread[Execution worker for ':' Thread 5,5,main]) completed. Took 0.126 secs.
:runners:core-java:compileTestJava (Thread[Execution worker for ':' Thread 5,5,main]) started.

> Task :sdks:java:extensions:google-cloud-platform-core:compileJava FROM-CACHE
Custom actions are attached to task ':sdks:java:extensions:google-cloud-platform-core:compileJava'.
Build cache key for task ':sdks:java:extensions:google-cloud-platform-core:compileJava' is 897457a1f7a9429b8144ed484ac69221
Task ':sdks:java:extensions:google-cloud-platform-core:compileJava' is not up-to-date because:
  No history is available.
Loaded cache entry for task ':sdks:java:extensions:google-cloud-platform-core:compileJava' with cache key 897457a1f7a9429b8144ed484ac69221
:sdks:java:extensions:google-cloud-platform-core:compileJava (Thread[Execution worker for ':' Thread 6,5,main]) completed. Took 0.191 secs.
:sdks:java:extensions:google-cloud-platform-core:classes (Thread[Execution worker for ':' Thread 6,5,main]) started.

> Task :sdks:java:extensions:google-cloud-platform-core:classes UP-TO-DATE
Skipping task ':sdks:java:extensions:google-cloud-platform-core:classes' as it has no actions.
:sdks:java:extensions:google-cloud-platform-core:classes (Thread[Execution worker for ':' Thread 6,5,main]) completed. Took 0.0 secs.
:sdks:java:extensions:google-cloud-platform-core:jar (Thread[Execution worker for ':' Thread 6,5,main]) started.

> Task :sdks:java:extensions:google-cloud-platform-core:jar
Caching disabled for task ':sdks:java:extensions:google-cloud-platform-core:jar' because:
  Not worth caching
Task ':sdks:java:extensions:google-cloud-platform-core:jar' is not up-to-date because:
  No history is available.
file or directory '<https://ci-beam.apache.org/job/beam_PerformanceTests_InfluxDbIO_IT/ws/src/sdks/java/extensions/google-cloud-platform-core/build/resources/main',> not found
:sdks:java:extensions:google-cloud-platform-core:jar (Thread[Execution worker for ':' Thread 6,5,main]) completed. Took 0.034 secs.
:sdks:java:harness:compileJava (Thread[Execution worker for ':' Thread 6,5,main]) started.

> Task :sdks:java:harness:compileJava FROM-CACHE
Custom actions are attached to task ':sdks:java:harness:compileJava'.
Build cache key for task ':sdks:java:harness:compileJava' is 95437ca8415749a06a04b9cc56246001
Task ':sdks:java:harness:compileJava' is not up-to-date because:
  No history is available.
Loaded cache entry for task ':sdks:java:harness:compileJava' with cache key 95437ca8415749a06a04b9cc56246001
:sdks:java:harness:compileJava (Thread[Execution worker for ':' Thread 6,5,main]) completed. Took 0.106 secs.
:sdks:java:harness:classes (Thread[Execution worker for ':' Thread 6,5,main]) started.

> Task :sdks:java:harness:classes UP-TO-DATE
Skipping task ':sdks:java:harness:classes' as it has no actions.
:sdks:java:harness:classes (Thread[Execution worker for ':' Thread 6,5,main]) completed. Took 0.0 secs.
:sdks:java:harness:jar (Thread[Execution worker for ':' Thread 6,5,main]) started.

> Task :sdks:java:harness:jar
Caching disabled for task ':sdks:java:harness:jar' because:
  Not worth caching
Task ':sdks:java:harness:jar' is not up-to-date because:
  No history is available.
file or directory '<https://ci-beam.apache.org/job/beam_PerformanceTests_InfluxDbIO_IT/ws/src/sdks/java/harness/build/resources/main',> not found
:sdks:java:harness:jar (Thread[Execution worker for ':' Thread 6,5,main]) completed. Took 0.096 secs.
:runners:java-fn-execution:compileJava (Thread[Execution worker for ':' Thread 6,5,main]) started.

> Task :runners:java-fn-execution:compileJava FROM-CACHE
Custom actions are attached to task ':runners:java-fn-execution:compileJava'.
Build cache key for task ':runners:java-fn-execution:compileJava' is 7fb04af66efc9114ef6ad42c69069994
Task ':runners:java-fn-execution:compileJava' is not up-to-date because:
  No history is available.
Loaded cache entry for task ':runners:java-fn-execution:compileJava' with cache key 7fb04af66efc9114ef6ad42c69069994
:runners:java-fn-execution:compileJava (Thread[Execution worker for ':' Thread 6,5,main]) completed. Took 0.137 secs.
:runners:java-fn-execution:classes (Thread[Execution worker for ':' Thread 6,5,main]) started.

> Task :runners:java-fn-execution:classes UP-TO-DATE
Skipping task ':runners:java-fn-execution:classes' as it has no actions.
:runners:java-fn-execution:classes (Thread[Execution worker for ':' Thread 6,5,main]) completed. Took 0.0 secs.
:runners:java-fn-execution:jar (Thread[Execution worker for ':' Thread 6,5,main]) started.

> Task :runners:core-java:compileTestJava FROM-CACHE
Custom actions are attached to task ':runners:core-java:compileTestJava'.
Build cache key for task ':runners:core-java:compileTestJava' is 5a7cd8aacaa024ab4927923e36265f6d
Task ':runners:core-java:compileTestJava' is not up-to-date because:
  No history is available.
Loaded cache entry for task ':runners:core-java:compileTestJava' with cache key 5a7cd8aacaa024ab4927923e36265f6d
:runners:core-java:compileTestJava (Thread[Execution worker for ':' Thread 5,5,main]) completed. Took 0.436 secs.
:runners:core-java:testClasses (Thread[Execution worker for ':' Thread 5,5,main]) started.

> Task :runners:core-java:testClasses UP-TO-DATE
Skipping task ':runners:core-java:testClasses' as it has no actions.
:runners:core-java:testClasses (Thread[Execution worker for ':' Thread 5,5,main]) completed. Took 0.0 secs.
:runners:core-java:testJar (Thread[Execution worker for ':' Thread 5,5,main]) started.

> Task :runners:core-java:testJar
Caching disabled for task ':runners:core-java:testJar' because:
  Not worth caching
Task ':runners:core-java:testJar' is not up-to-date because:
  No history is available.
file or directory '<https://ci-beam.apache.org/job/beam_PerformanceTests_InfluxDbIO_IT/ws/src/runners/core-java/build/resources/test',> not found
:runners:core-java:testJar (Thread[Execution worker for ':' Thread 5,5,main]) completed. Took 0.039 secs.

> Task :runners:java-fn-execution:jar
Caching disabled for task ':runners:java-fn-execution:jar' because:
  Not worth caching
Task ':runners:java-fn-execution:jar' is not up-to-date because:
  No history is available.
file or directory '<https://ci-beam.apache.org/job/beam_PerformanceTests_InfluxDbIO_IT/ws/src/runners/java-fn-execution/build/resources/main',> not found
:runners:java-fn-execution:jar (Thread[Execution worker for ':' Thread 6,5,main]) completed. Took 0.049 secs.
:runners:direct-java:compileJava (Thread[Execution worker for ':' Thread 6,5,main]) started.

> Task :runners:direct-java:compileJava FROM-CACHE
Custom actions are attached to task ':runners:direct-java:compileJava'.
Build cache key for task ':runners:direct-java:compileJava' is dc63821f0b4bd88ec502fe262bef132f
Task ':runners:direct-java:compileJava' is not up-to-date because:
  No history is available.
Loaded cache entry for task ':runners:direct-java:compileJava' with cache key dc63821f0b4bd88ec502fe262bef132f
:runners:direct-java:compileJava (Thread[Execution worker for ':' Thread 6,5,main]) completed. Took 0.148 secs.
:runners:direct-java:classes (Thread[Execution worker for ':' Thread 6,5,main]) started.

> Task :runners:direct-java:classes UP-TO-DATE
Skipping task ':runners:direct-java:classes' as it has no actions.
:runners:direct-java:classes (Thread[Execution worker for ':' Thread 6,5,main]) completed. Took 0.0 secs.
:runners:direct-java:shadowJar (Thread[Execution worker for ':' Thread 6,5,main]) started.

> Task :runners:direct-java:shadowJar FROM-CACHE
Custom actions are attached to task ':runners:direct-java:shadowJar'.
Build cache key for task ':runners:direct-java:shadowJar' is cc1952617c767d341797ba9787b1cbb7
Task ':runners:direct-java:shadowJar' is not up-to-date because:
  No history is available.
Loaded cache entry for task ':runners:direct-java:shadowJar' with cache key cc1952617c767d341797ba9787b1cbb7
:runners:direct-java:shadowJar (Thread[Execution worker for ':' Thread 6,5,main]) completed. Took 0.316 secs.
:runners:direct-java:compileTestJava (Thread[Execution worker for ':' Thread 6,5,main]) started.

> Task :runners:direct-java:compileTestJava FROM-CACHE
Custom actions are attached to task ':runners:direct-java:compileTestJava'.
Build cache key for task ':runners:direct-java:compileTestJava' is 9b7c26f059e0896e2b9eceb336a07426
Task ':runners:direct-java:compileTestJava' is not up-to-date because:
  No history is available.
Loaded cache entry for task ':runners:direct-java:compileTestJava' with cache key 9b7c26f059e0896e2b9eceb336a07426
:runners:direct-java:compileTestJava (Thread[Execution worker for ':' Thread 6,5,main]) completed. Took 0.115 secs.
:runners:direct-java:testClasses (Thread[Execution worker for ':' Thread 6,5,main]) started.

> Task :runners:direct-java:testClasses UP-TO-DATE
Skipping task ':runners:direct-java:testClasses' as it has no actions.
:runners:direct-java:testClasses (Thread[Execution worker for ':' Thread 6,5,main]) completed. Took 0.0 secs.
:runners:direct-java:shadowTestJar (Thread[Execution worker for ':' Thread 7,5,main]) started.

> Task :runners:direct-java:shadowTestJar FROM-CACHE
Build cache key for task ':runners:direct-java:shadowTestJar' is d2125362120d6450cf7921e8a8874590
Task ':runners:direct-java:shadowTestJar' is not up-to-date because:
  No history is available.
Loaded cache entry for task ':runners:direct-java:shadowTestJar' with cache key d2125362120d6450cf7921e8a8874590
:runners:direct-java:shadowTestJar (Thread[Execution worker for ':' Thread 7,5,main]) completed. Took 0.235 secs.
:sdks:java:io:influxdb:integrationTest (Thread[Execution worker for ':' Thread 7,5,main]) started.
producer locations for task group 0 (Thread[Execution worker for ':' Thread 3,5,main]) started.
producer locations for task group 0 (Thread[Execution worker for ':' Thread 3,5,main]) completed. Took 0.0 secs.
Gradle Test Executor 1 started executing tests.

> Task :sdks:java:io:influxdb:integrationTest
Custom actions are attached to task ':sdks:java:io:influxdb:integrationTest'.
Build cache key for task ':sdks:java:io:influxdb:integrationTest' is bbffa730c5ccab7b3096075b8c1b5f16
Task ':sdks:java:io:influxdb:integrationTest' is not up-to-date because:
  Task.upToDateWhen is false.
Starting process 'Gradle Test Executor 1'. Working directory: <https://ci-beam.apache.org/job/beam_PerformanceTests_InfluxDbIO_IT/ws/src/sdks/java/io/influxdb> Command: /usr/lib/jvm/java-8-openjdk-amd64/bin/java -DbeamTestPipelineOptions=["--influxDBURL=http://35.238.186.192:8086","--influxDBUserName=superadmin","--influxDBPassword=supersecretpassword","--databaseName=db1"] -Djava.security.manager=worker.org.gradle.process.internal.worker.child.BootstrapSecurityManager -Dorg.gradle.internal.worker.tmpdir=<https://ci-beam.apache.org/job/beam_PerformanceTests_InfluxDbIO_IT/ws/src/sdks/java/io/influxdb/build/tmp/integrationTest/work> -Dorg.gradle.native=false -Xmx2g -Dfile.encoding=UTF-8 -Duser.country=US -Duser.language=en -Duser.variant -ea -cp /home/jenkins/.gradle/caches/7.4/workerMain/gradle-worker.jar worker.org.gradle.process.internal.worker.GradleWorkerMain 'Gradle Test Executor 1'
Successfully started process 'Gradle Test Executor 1'

org.apache.beam.sdk.io.influxdb.InfluxDbIOIT > testWriteAndReadWithMultipleMetric FAILED
    org.influxdb.InfluxDBIOException: java.net.SocketTimeoutException: connect timed out
        at org.influxdb.impl.InfluxDBImpl.execute(InfluxDBImpl.java:836)
        at org.influxdb.impl.InfluxDBImpl.executeQuery(InfluxDBImpl.java:819)
        at org.influxdb.impl.InfluxDBImpl.query(InfluxDBImpl.java:554)
        at org.apache.beam.sdk.io.influxdb.InfluxDbIOIT.initTest(InfluxDbIOIT.java:99)

        Caused by:
        java.net.SocketTimeoutException: connect timed out
            at java.net.PlainSocketImpl.socketConnect(Native Method)
            at java.net.AbstractPlainSocketImpl.doConnect(AbstractPlainSocketImpl.java:350)
            at java.net.AbstractPlainSocketImpl.connectToAddress(AbstractPlainSocketImpl.java:206)
            at java.net.AbstractPlainSocketImpl.connect(AbstractPlainSocketImpl.java:188)
            at java.net.SocksSocketImpl.connect(SocksSocketImpl.java:392)
            at java.net.Socket.connect(Socket.java:607)
            at okhttp3.internal.platform.Platform.connectSocket(Platform.kt:119)
            at okhttp3.internal.connection.RealConnection.connectSocket(RealConnection.kt:283)
            at okhttp3.internal.connection.RealConnection.connect(RealConnection.kt:195)
            at okhttp3.internal.connection.ExchangeFinder.findConnection(ExchangeFinder.kt:249)
            at okhttp3.internal.connection.ExchangeFinder.findHealthyConnection(ExchangeFinder.kt:108)
            at okhttp3.internal.connection.ExchangeFinder.find(ExchangeFinder.kt:76)
            at okhttp3.internal.connection.RealCall.initExchange$okhttp(RealCall.kt:245)
            at okhttp3.internal.connection.ConnectInterceptor.intercept(ConnectInterceptor.kt:32)
            at okhttp3.internal.http.RealInterceptorChain.proceed(RealInterceptorChain.kt:100)
            at okhttp3.internal.cache.CacheInterceptor.intercept(CacheInterceptor.kt:82)
            at okhttp3.internal.http.RealInterceptorChain.proceed(RealInterceptorChain.kt:100)
            at okhttp3.internal.http.BridgeInterceptor.intercept(BridgeInterceptor.kt:83)
            at okhttp3.internal.http.RealInterceptorChain.proceed(RealInterceptorChain.kt:100)
            at okhttp3.internal.http.RetryAndFollowUpInterceptor.intercept(RetryAndFollowUpInterceptor.kt:76)
            at okhttp3.internal.http.RealInterceptorChain.proceed(RealInterceptorChain.kt:100)
            at org.influxdb.impl.BasicAuthInterceptor.intercept(BasicAuthInterceptor.java:22)
            at okhttp3.internal.http.RealInterceptorChain.proceed(RealInterceptorChain.kt:100)
            at org.influxdb.impl.GzipRequestInterceptor.intercept(GzipRequestInterceptor.java:42)
            at okhttp3.internal.http.RealInterceptorChain.proceed(RealInterceptorChain.kt:100)
            at okhttp3.logging.HttpLoggingInterceptor.intercept(HttpLoggingInterceptor.kt:152)
            at okhttp3.internal.http.RealInterceptorChain.proceed(RealInterceptorChain.kt:100)
            at okhttp3.internal.connection.RealCall.getResponseWithInterceptorChain$okhttp(RealCall.kt:197)
            at okhttp3.internal.connection.RealCall.execute(RealCall.kt:148)
            at retrofit2.OkHttpCall.execute(OkHttpCall.java:190)
            at org.influxdb.impl.InfluxDBImpl.execute(InfluxDBImpl.java:824)
            ... 3 more

Gradle Test Executor 1 finished executing tests.

> Task :sdks:java:io:influxdb:integrationTest

6 tests completed, 1 failed
Finished generating test XML results (0.018 secs) into: <https://ci-beam.apache.org/job/beam_PerformanceTests_InfluxDbIO_IT/ws/src/sdks/java/io/influxdb/build/test-results/integrationTest>
Generating HTML test report...
Finished generating test html results (0.025 secs) into: <https://ci-beam.apache.org/job/beam_PerformanceTests_InfluxDbIO_IT/ws/src/sdks/java/io/influxdb/build/reports/tests/integrationTest>

> Task :sdks:java:io:influxdb:integrationTest FAILED
:sdks:java:io:influxdb:integrationTest (Thread[Execution worker for ':' Thread 7,5,main]) completed. Took 18.864 secs.

FAILURE: Build failed with an exception.

* What went wrong:
Execution failed for task ':sdks:java:io:influxdb:integrationTest'.
> There were failing tests. See the report at: file://<https://ci-beam.apache.org/job/beam_PerformanceTests_InfluxDbIO_IT/ws/src/sdks/java/io/influxdb/build/reports/tests/integrationTest/index.html>

* Try:
> Run with --stacktrace option to get the stack trace.
> Run with --debug option to get more log output.
> Run with --scan to get full insights.

* Get more help at https://help.gradle.org

Deprecated Gradle features were used in this build, making it incompatible with Gradle 8.0.

You can use '--warning-mode all' to show the individual deprecation warnings and determine if they come from your own scripts or plugins.

See https://docs.gradle.org/7.4/userguide/command_line_interface.html#sec:command_line_warnings

BUILD FAILED in 44s
77 actionable tasks: 42 executed, 33 from cache, 2 up-to-date

Publishing build scan...
https://gradle.com/s/g6mme3f2umabm

Build step 'Invoke Gradle script' changed build result to FAILURE
Build step 'Invoke Gradle script' marked build as failure

---------------------------------------------------------------------
To unsubscribe, e-mail: builds-unsubscribe@beam.apache.org
For additional commands, e-mail: builds-help@beam.apache.org


Build failed in Jenkins: beam_PerformanceTests_InfluxDbIO_IT #2238

Posted by Apache Jenkins Server <je...@builds.apache.org>.
See <https://ci-beam.apache.org/job/beam_PerformanceTests_InfluxDbIO_IT/2238/display/redirect?page=changes>

Changes:

[noreply] Modify RunInference to return PipelineResult for the benchmark tests

[noreply] Fix lint issues (#22800)


------------------------------------------
[...truncated 146.92 KB...]

> Task :sdks:java:core:testClasses
Skipping task ':sdks:java:core:testClasses' as it has no actions.
:sdks:java:core:testClasses (Thread[Execution worker for ':' Thread 7,5,main]) completed. Took 0.0 secs.
:sdks:java:core:shadowTestJar (Thread[Execution worker for ':' Thread 7,5,main]) started.

> Task :runners:core-java:jar
Caching disabled for task ':runners:core-java:jar' because:
  Not worth caching
Task ':runners:core-java:jar' is not up-to-date because:
  No history is available.
file or directory '<https://ci-beam.apache.org/job/beam_PerformanceTests_InfluxDbIO_IT/ws/src/runners/core-java/build/resources/main',> not found
:runners:core-java:jar (Thread[Execution worker for ':' Thread 2,5,main]) completed. Took 0.065 secs.
:sdks:java:extensions:google-cloud-platform-core:compileJava (Thread[Execution worker for ':' Thread 2,5,main]) started.

> Task :sdks:java:core:shadowTestJar FROM-CACHE
Build cache key for task ':sdks:java:core:shadowTestJar' is 8b20d0725a7535a80613a640c910a5b4
Task ':sdks:java:core:shadowTestJar' is not up-to-date because:
  No history is available.
Loaded cache entry for task ':sdks:java:core:shadowTestJar' with cache key 8b20d0725a7535a80613a640c910a5b4
:sdks:java:core:shadowTestJar (Thread[Execution worker for ':' Thread 7,5,main]) completed. Took 0.102 secs.
:runners:core-java:compileTestJava (Thread[Execution worker for ':' Thread 7,5,main]) started.

> Task :sdks:java:extensions:google-cloud-platform-core:compileJava FROM-CACHE
Custom actions are attached to task ':sdks:java:extensions:google-cloud-platform-core:compileJava'.
Build cache key for task ':sdks:java:extensions:google-cloud-platform-core:compileJava' is 897457a1f7a9429b8144ed484ac69221
Task ':sdks:java:extensions:google-cloud-platform-core:compileJava' is not up-to-date because:
  No history is available.
Loaded cache entry for task ':sdks:java:extensions:google-cloud-platform-core:compileJava' with cache key 897457a1f7a9429b8144ed484ac69221
:sdks:java:extensions:google-cloud-platform-core:compileJava (Thread[Execution worker for ':' Thread 2,5,main]) completed. Took 0.084 secs.
:sdks:java:extensions:google-cloud-platform-core:classes (Thread[Execution worker for ':' Thread 2,5,main]) started.

> Task :sdks:java:extensions:google-cloud-platform-core:classes UP-TO-DATE
Skipping task ':sdks:java:extensions:google-cloud-platform-core:classes' as it has no actions.
:sdks:java:extensions:google-cloud-platform-core:classes (Thread[Execution worker for ':' Thread 2,5,main]) completed. Took 0.0 secs.
:sdks:java:extensions:google-cloud-platform-core:jar (Thread[Execution worker for ':' Thread 2,5,main]) started.

> Task :sdks:java:extensions:google-cloud-platform-core:jar
Caching disabled for task ':sdks:java:extensions:google-cloud-platform-core:jar' because:
  Not worth caching
Task ':sdks:java:extensions:google-cloud-platform-core:jar' is not up-to-date because:
  No history is available.
file or directory '<https://ci-beam.apache.org/job/beam_PerformanceTests_InfluxDbIO_IT/ws/src/sdks/java/extensions/google-cloud-platform-core/build/resources/main',> not found
:sdks:java:extensions:google-cloud-platform-core:jar (Thread[Execution worker for ':' Thread 2,5,main]) completed. Took 0.019 secs.
:sdks:java:harness:compileJava (Thread[Execution worker for ':' Thread 2,5,main]) started.

> Task :sdks:java:harness:compileJava FROM-CACHE
Custom actions are attached to task ':sdks:java:harness:compileJava'.
Build cache key for task ':sdks:java:harness:compileJava' is 95437ca8415749a06a04b9cc56246001
Task ':sdks:java:harness:compileJava' is not up-to-date because:
  No history is available.
Loaded cache entry for task ':sdks:java:harness:compileJava' with cache key 95437ca8415749a06a04b9cc56246001
:sdks:java:harness:compileJava (Thread[Execution worker for ':' Thread 2,5,main]) completed. Took 0.071 secs.
:sdks:java:harness:classes (Thread[Execution worker for ':' Thread 2,5,main]) started.

> Task :sdks:java:harness:classes UP-TO-DATE
Skipping task ':sdks:java:harness:classes' as it has no actions.
:sdks:java:harness:classes (Thread[Execution worker for ':' Thread 2,5,main]) completed. Took 0.0 secs.
:sdks:java:harness:jar (Thread[Execution worker for ':' Thread 2,5,main]) started.

> Task :sdks:java:harness:jar
Caching disabled for task ':sdks:java:harness:jar' because:
  Not worth caching
Task ':sdks:java:harness:jar' is not up-to-date because:
  No history is available.
file or directory '<https://ci-beam.apache.org/job/beam_PerformanceTests_InfluxDbIO_IT/ws/src/sdks/java/harness/build/resources/main',> not found
:sdks:java:harness:jar (Thread[Execution worker for ':' Thread 2,5,main]) completed. Took 0.059 secs.
:runners:java-fn-execution:compileJava (Thread[Execution worker for ':' Thread 2,5,main]) started.

> Task :runners:java-fn-execution:compileJava FROM-CACHE
Custom actions are attached to task ':runners:java-fn-execution:compileJava'.
Build cache key for task ':runners:java-fn-execution:compileJava' is 7fb04af66efc9114ef6ad42c69069994
Task ':runners:java-fn-execution:compileJava' is not up-to-date because:
  No history is available.
Loaded cache entry for task ':runners:java-fn-execution:compileJava' with cache key 7fb04af66efc9114ef6ad42c69069994
:runners:java-fn-execution:compileJava (Thread[Execution worker for ':' Thread 2,5,main]) completed. Took 0.075 secs.
:runners:java-fn-execution:classes (Thread[Execution worker for ':' Thread 2,5,main]) started.

> Task :runners:java-fn-execution:classes UP-TO-DATE
Skipping task ':runners:java-fn-execution:classes' as it has no actions.
:runners:java-fn-execution:classes (Thread[Execution worker for ':' Thread 2,5,main]) completed. Took 0.0 secs.
:runners:java-fn-execution:jar (Thread[Execution worker for ':' Thread 5,5,main]) started.

> Task :runners:java-fn-execution:jar
Caching disabled for task ':runners:java-fn-execution:jar' because:
  Not worth caching
Task ':runners:java-fn-execution:jar' is not up-to-date because:
  No history is available.
file or directory '<https://ci-beam.apache.org/job/beam_PerformanceTests_InfluxDbIO_IT/ws/src/runners/java-fn-execution/build/resources/main',> not found
:runners:java-fn-execution:jar (Thread[Execution worker for ':' Thread 5,5,main]) completed. Took 0.043 secs.
:runners:direct-java:compileJava (Thread[Execution worker for ':' Thread 5,5,main]) started.

> Task :runners:core-java:compileTestJava FROM-CACHE
Custom actions are attached to task ':runners:core-java:compileTestJava'.
Build cache key for task ':runners:core-java:compileTestJava' is 5a7cd8aacaa024ab4927923e36265f6d
Task ':runners:core-java:compileTestJava' is not up-to-date because:
  No history is available.
Loaded cache entry for task ':runners:core-java:compileTestJava' with cache key 5a7cd8aacaa024ab4927923e36265f6d
:runners:core-java:compileTestJava (Thread[Execution worker for ':' Thread 7,5,main]) completed. Took 0.315 secs.
:runners:core-java:testClasses (Thread[Execution worker for ':' Thread 7,5,main]) started.

> Task :runners:core-java:testClasses UP-TO-DATE
Skipping task ':runners:core-java:testClasses' as it has no actions.
:runners:core-java:testClasses (Thread[Execution worker for ':' Thread 7,5,main]) completed. Took 0.0 secs.
:runners:core-java:testJar (Thread[Execution worker for ':' Thread 7,5,main]) started.

> Task :runners:core-java:testJar
Caching disabled for task ':runners:core-java:testJar' because:
  Not worth caching
Task ':runners:core-java:testJar' is not up-to-date because:
  No history is available.
file or directory '<https://ci-beam.apache.org/job/beam_PerformanceTests_InfluxDbIO_IT/ws/src/runners/core-java/build/resources/test',> not found
:runners:core-java:testJar (Thread[Execution worker for ':' Thread 7,5,main]) completed. Took 0.038 secs.

> Task :runners:direct-java:compileJava FROM-CACHE
Custom actions are attached to task ':runners:direct-java:compileJava'.
Build cache key for task ':runners:direct-java:compileJava' is dc63821f0b4bd88ec502fe262bef132f
Task ':runners:direct-java:compileJava' is not up-to-date because:
  No history is available.
Loaded cache entry for task ':runners:direct-java:compileJava' with cache key dc63821f0b4bd88ec502fe262bef132f
:runners:direct-java:compileJava (Thread[Execution worker for ':' Thread 5,5,main]) completed. Took 0.085 secs.
:runners:direct-java:classes (Thread[Execution worker for ':' Thread 5,5,main]) started.

> Task :runners:direct-java:classes UP-TO-DATE
Skipping task ':runners:direct-java:classes' as it has no actions.
:runners:direct-java:classes (Thread[Execution worker for ':' Thread 5,5,main]) completed. Took 0.0 secs.
:runners:direct-java:shadowJar (Thread[Execution worker for ':' Thread 5,5,main]) started.

> Task :runners:direct-java:shadowJar FROM-CACHE
Custom actions are attached to task ':runners:direct-java:shadowJar'.
Build cache key for task ':runners:direct-java:shadowJar' is cc1952617c767d341797ba9787b1cbb7
Task ':runners:direct-java:shadowJar' is not up-to-date because:
  No history is available.
Loaded cache entry for task ':runners:direct-java:shadowJar' with cache key cc1952617c767d341797ba9787b1cbb7
:runners:direct-java:shadowJar (Thread[Execution worker for ':' Thread 5,5,main]) completed. Took 0.296 secs.
:runners:direct-java:compileTestJava (Thread[Execution worker for ':' Thread 5,5,main]) started.

> Task :runners:direct-java:compileTestJava FROM-CACHE
Custom actions are attached to task ':runners:direct-java:compileTestJava'.
Build cache key for task ':runners:direct-java:compileTestJava' is 9b7c26f059e0896e2b9eceb336a07426
Task ':runners:direct-java:compileTestJava' is not up-to-date because:
  No history is available.
Loaded cache entry for task ':runners:direct-java:compileTestJava' with cache key 9b7c26f059e0896e2b9eceb336a07426
:runners:direct-java:compileTestJava (Thread[Execution worker for ':' Thread 5,5,main]) completed. Took 0.095 secs.
:runners:direct-java:testClasses (Thread[Execution worker for ':' Thread 5,5,main]) started.

> Task :runners:direct-java:testClasses UP-TO-DATE
Skipping task ':runners:direct-java:testClasses' as it has no actions.
:runners:direct-java:testClasses (Thread[Execution worker for ':' Thread 5,5,main]) completed. Took 0.0 secs.
:runners:direct-java:shadowTestJar (Thread[Execution worker for ':' Thread 5,5,main]) started.

> Task :runners:direct-java:shadowTestJar FROM-CACHE
Build cache key for task ':runners:direct-java:shadowTestJar' is d2125362120d6450cf7921e8a8874590
Task ':runners:direct-java:shadowTestJar' is not up-to-date because:
  No history is available.
Loaded cache entry for task ':runners:direct-java:shadowTestJar' with cache key d2125362120d6450cf7921e8a8874590
:runners:direct-java:shadowTestJar (Thread[Execution worker for ':' Thread 5,5,main]) completed. Took 0.196 secs.
:sdks:java:io:influxdb:integrationTest (Thread[Execution worker for ':' Thread 5,5,main]) started.
producer locations for task group 0 (Thread[Execution worker for ':' Thread 3,5,main]) started.
producer locations for task group 0 (Thread[Execution worker for ':' Thread 3,5,main]) completed. Took 0.0 secs.
Gradle Test Executor 187 started executing tests.

> Task :sdks:java:io:influxdb:integrationTest
Custom actions are attached to task ':sdks:java:io:influxdb:integrationTest'.
Build cache key for task ':sdks:java:io:influxdb:integrationTest' is bbffa730c5ccab7b3096075b8c1b5f16
Task ':sdks:java:io:influxdb:integrationTest' is not up-to-date because:
  Task.upToDateWhen is false.
Starting process 'Gradle Test Executor 187'. Working directory: <https://ci-beam.apache.org/job/beam_PerformanceTests_InfluxDbIO_IT/ws/src/sdks/java/io/influxdb> Command: /usr/lib/jvm/java-8-openjdk-amd64/bin/java -DbeamTestPipelineOptions=["--influxDBURL=http://35.188.98.0:8086","--influxDBUserName=superadmin","--influxDBPassword=supersecretpassword","--databaseName=db1"] -Djava.security.manager=worker.org.gradle.process.internal.worker.child.BootstrapSecurityManager -Dorg.gradle.internal.worker.tmpdir=<https://ci-beam.apache.org/job/beam_PerformanceTests_InfluxDbIO_IT/ws/src/sdks/java/io/influxdb/build/tmp/integrationTest/work> -Dorg.gradle.native=false -Xmx2g -Dfile.encoding=UTF-8 -Duser.country=US -Duser.language=en -Duser.variant -ea -cp /home/jenkins/.gradle/caches/7.4/workerMain/gradle-worker.jar worker.org.gradle.process.internal.worker.GradleWorkerMain 'Gradle Test Executor 187'
Successfully started process 'Gradle Test Executor 187'

org.apache.beam.sdk.io.influxdb.InfluxDbIOIT > testWriteAndReadWithMultipleMetric FAILED
    org.influxdb.InfluxDBIOException: java.net.SocketTimeoutException: connect timed out
        at org.influxdb.impl.InfluxDBImpl.execute(InfluxDBImpl.java:836)
        at org.influxdb.impl.InfluxDBImpl.executeQuery(InfluxDBImpl.java:819)
        at org.influxdb.impl.InfluxDBImpl.query(InfluxDBImpl.java:554)
        at org.apache.beam.sdk.io.influxdb.InfluxDbIOIT.initTest(InfluxDbIOIT.java:99)

        Caused by:
        java.net.SocketTimeoutException: connect timed out
            at java.net.PlainSocketImpl.socketConnect(Native Method)
            at java.net.AbstractPlainSocketImpl.doConnect(AbstractPlainSocketImpl.java:350)
            at java.net.AbstractPlainSocketImpl.connectToAddress(AbstractPlainSocketImpl.java:206)
            at java.net.AbstractPlainSocketImpl.connect(AbstractPlainSocketImpl.java:188)
            at java.net.SocksSocketImpl.connect(SocksSocketImpl.java:392)
            at java.net.Socket.connect(Socket.java:607)
            at okhttp3.internal.platform.Platform.connectSocket(Platform.kt:119)
            at okhttp3.internal.connection.RealConnection.connectSocket(RealConnection.kt:283)
            at okhttp3.internal.connection.RealConnection.connect(RealConnection.kt:195)
            at okhttp3.internal.connection.ExchangeFinder.findConnection(ExchangeFinder.kt:249)
            at okhttp3.internal.connection.ExchangeFinder.findHealthyConnection(ExchangeFinder.kt:108)
            at okhttp3.internal.connection.ExchangeFinder.find(ExchangeFinder.kt:76)
            at okhttp3.internal.connection.RealCall.initExchange$okhttp(RealCall.kt:245)
            at okhttp3.internal.connection.ConnectInterceptor.intercept(ConnectInterceptor.kt:32)
            at okhttp3.internal.http.RealInterceptorChain.proceed(RealInterceptorChain.kt:100)
            at okhttp3.internal.cache.CacheInterceptor.intercept(CacheInterceptor.kt:82)
            at okhttp3.internal.http.RealInterceptorChain.proceed(RealInterceptorChain.kt:100)
            at okhttp3.internal.http.BridgeInterceptor.intercept(BridgeInterceptor.kt:83)
            at okhttp3.internal.http.RealInterceptorChain.proceed(RealInterceptorChain.kt:100)
            at okhttp3.internal.http.RetryAndFollowUpInterceptor.intercept(RetryAndFollowUpInterceptor.kt:76)
            at okhttp3.internal.http.RealInterceptorChain.proceed(RealInterceptorChain.kt:100)
            at org.influxdb.impl.BasicAuthInterceptor.intercept(BasicAuthInterceptor.java:22)
            at okhttp3.internal.http.RealInterceptorChain.proceed(RealInterceptorChain.kt:100)
            at org.influxdb.impl.GzipRequestInterceptor.intercept(GzipRequestInterceptor.java:42)
            at okhttp3.internal.http.RealInterceptorChain.proceed(RealInterceptorChain.kt:100)
            at okhttp3.logging.HttpLoggingInterceptor.intercept(HttpLoggingInterceptor.kt:152)
            at okhttp3.internal.http.RealInterceptorChain.proceed(RealInterceptorChain.kt:100)
            at okhttp3.internal.connection.RealCall.getResponseWithInterceptorChain$okhttp(RealCall.kt:197)
            at okhttp3.internal.connection.RealCall.execute(RealCall.kt:148)
            at retrofit2.OkHttpCall.execute(OkHttpCall.java:190)
            at org.influxdb.impl.InfluxDBImpl.execute(InfluxDBImpl.java:824)
            ... 3 more

Gradle Test Executor 187 finished executing tests.

> Task :sdks:java:io:influxdb:integrationTest FAILED

6 tests completed, 1 failed
Finished generating test XML results (0.0 secs) into: <https://ci-beam.apache.org/job/beam_PerformanceTests_InfluxDbIO_IT/ws/src/sdks/java/io/influxdb/build/test-results/integrationTest>
Generating HTML test report...
Finished generating test html results (0.001 secs) into: <https://ci-beam.apache.org/job/beam_PerformanceTests_InfluxDbIO_IT/ws/src/sdks/java/io/influxdb/build/reports/tests/integrationTest>
:sdks:java:io:influxdb:integrationTest (Thread[Execution worker for ':' Thread 5,5,main]) completed. Took 19.545 secs.

FAILURE: Build failed with an exception.

* What went wrong:
Execution failed for task ':sdks:java:io:influxdb:integrationTest'.
> There were failing tests. See the report at: file://<https://ci-beam.apache.org/job/beam_PerformanceTests_InfluxDbIO_IT/ws/src/sdks/java/io/influxdb/build/reports/tests/integrationTest/index.html>

* Try:
> Run with --stacktrace option to get the stack trace.
> Run with --debug option to get more log output.
> Run with --scan to get full insights.

* Get more help at https://help.gradle.org

Deprecated Gradle features were used in this build, making it incompatible with Gradle 8.0.

You can use '--warning-mode all' to show the individual deprecation warnings and determine if they come from your own scripts or plugins.

See https://docs.gradle.org/7.4/userguide/command_line_interface.html#sec:command_line_warnings

BUILD FAILED in 28s
77 actionable tasks: 42 executed, 33 from cache, 2 up-to-date

Publishing build scan...
https://gradle.com/s/v34cgfu4g6tho

Build step 'Invoke Gradle script' changed build result to FAILURE
Build step 'Invoke Gradle script' marked build as failure

---------------------------------------------------------------------
To unsubscribe, e-mail: builds-unsubscribe@beam.apache.org
For additional commands, e-mail: builds-help@beam.apache.org


Build failed in Jenkins: beam_PerformanceTests_InfluxDbIO_IT #2237

Posted by Apache Jenkins Server <je...@builds.apache.org>.
See <https://ci-beam.apache.org/job/beam_PerformanceTests_InfluxDbIO_IT/2237/display/redirect?page=changes>

Changes:

[randomstep] [BEAM-8701] bump commons-io to 2.7

[noreply] [Go SDK] Fix go lint errors (#22796)


------------------------------------------
[...truncated 152.44 KB...]

> Task :sdks:java:harness:classes UP-TO-DATE
Skipping task ':sdks:java:harness:classes' as it has no actions.
:sdks:java:harness:classes (Thread[Execution worker for ':' Thread 5,5,main]) completed. Took 0.0 secs.
:sdks:java:harness:jar (Thread[Execution worker for ':' Thread 5,5,main]) started.

> Task :sdks:java:harness:jar
Caching disabled for task ':sdks:java:harness:jar' because:
  Not worth caching
Task ':sdks:java:harness:jar' is not up-to-date because:
  No history is available.
file or directory '<https://ci-beam.apache.org/job/beam_PerformanceTests_InfluxDbIO_IT/ws/src/sdks/java/harness/build/resources/main',> not found
:sdks:java:harness:jar (Thread[Execution worker for ':' Thread 5,5,main]) completed. Took 0.062 secs.
:runners:java-fn-execution:compileJava (Thread[Execution worker for ':' Thread 5,5,main]) started.

> Task :runners:java-fn-execution:compileJava FROM-CACHE
Custom actions are attached to task ':runners:java-fn-execution:compileJava'.
Build cache key for task ':runners:java-fn-execution:compileJava' is 7fb04af66efc9114ef6ad42c69069994
Task ':runners:java-fn-execution:compileJava' is not up-to-date because:
  No history is available.
Loaded cache entry for task ':runners:java-fn-execution:compileJava' with cache key 7fb04af66efc9114ef6ad42c69069994
:runners:java-fn-execution:compileJava (Thread[Execution worker for ':' Thread 5,5,main]) completed. Took 0.088 secs.
:runners:java-fn-execution:classes (Thread[Execution worker for ':' Thread 5,5,main]) started.

> Task :runners:java-fn-execution:classes UP-TO-DATE
Skipping task ':runners:java-fn-execution:classes' as it has no actions.
:runners:java-fn-execution:classes (Thread[Execution worker for ':' Thread 5,5,main]) completed. Took 0.0 secs.
:runners:java-fn-execution:jar (Thread[Execution worker for ':' Thread 5,5,main]) started.
This JVM does not support getting OS memory, so no OS memory status updates will be broadcast

> Task :runners:java-fn-execution:jar
Caching disabled for task ':runners:java-fn-execution:jar' because:
  Not worth caching
Task ':runners:java-fn-execution:jar' is not up-to-date because:
  No history is available.
file or directory '<https://ci-beam.apache.org/job/beam_PerformanceTests_InfluxDbIO_IT/ws/src/runners/java-fn-execution/build/resources/main',> not found
:runners:java-fn-execution:jar (Thread[Execution worker for ':' Thread 5,5,main]) completed. Took 0.042 secs.
:runners:direct-java:compileJava (Thread[Execution worker for ':' Thread 5,5,main]) started.

> Task :runners:core-java:compileTestJava FROM-CACHE
Custom actions are attached to task ':runners:core-java:compileTestJava'.
Build cache key for task ':runners:core-java:compileTestJava' is 5a7cd8aacaa024ab4927923e36265f6d
Task ':runners:core-java:compileTestJava' is not up-to-date because:
  No history is available.
Loaded cache entry for task ':runners:core-java:compileTestJava' with cache key 5a7cd8aacaa024ab4927923e36265f6d
:runners:core-java:compileTestJava (Thread[included builds,5,main]) completed. Took 0.364 secs.
:runners:core-java:testClasses (Thread[included builds,5,main]) started.

> Task :runners:core-java:testClasses UP-TO-DATE
Skipping task ':runners:core-java:testClasses' as it has no actions.
:runners:core-java:testClasses (Thread[included builds,5,main]) completed. Took 0.0 secs.
:runners:core-java:testJar (Thread[included builds,5,main]) started.

> Task :runners:direct-java:compileJava FROM-CACHE
Custom actions are attached to task ':runners:direct-java:compileJava'.
Build cache key for task ':runners:direct-java:compileJava' is dc63821f0b4bd88ec502fe262bef132f
Task ':runners:direct-java:compileJava' is not up-to-date because:
  No history is available.
Loaded cache entry for task ':runners:direct-java:compileJava' with cache key dc63821f0b4bd88ec502fe262bef132f
:runners:direct-java:compileJava (Thread[Execution worker for ':' Thread 5,5,main]) completed. Took 0.153 secs.
:runners:direct-java:classes (Thread[Execution worker for ':' Thread 5,5,main]) started.

> Task :runners:direct-java:classes UP-TO-DATE
Skipping task ':runners:direct-java:classes' as it has no actions.
:runners:direct-java:classes (Thread[Execution worker for ':' Thread 5,5,main]) completed. Took 0.0 secs.
:runners:direct-java:shadowJar (Thread[Execution worker for ':' Thread 5,5,main]) started.

> Task :runners:core-java:testJar
Caching disabled for task ':runners:core-java:testJar' because:
  Not worth caching
Task ':runners:core-java:testJar' is not up-to-date because:
  No history is available.
file or directory '<https://ci-beam.apache.org/job/beam_PerformanceTests_InfluxDbIO_IT/ws/src/runners/core-java/build/resources/test',> not found
:runners:core-java:testJar (Thread[included builds,5,main]) completed. Took 0.045 secs.

> Task :runners:direct-java:shadowJar FROM-CACHE
Custom actions are attached to task ':runners:direct-java:shadowJar'.
Build cache key for task ':runners:direct-java:shadowJar' is cc1952617c767d341797ba9787b1cbb7
Task ':runners:direct-java:shadowJar' is not up-to-date because:
  No history is available.
Loaded cache entry for task ':runners:direct-java:shadowJar' with cache key cc1952617c767d341797ba9787b1cbb7
:runners:direct-java:shadowJar (Thread[Execution worker for ':' Thread 5,5,main]) completed. Took 0.406 secs.
:runners:direct-java:compileTestJava (Thread[Execution worker for ':' Thread 5,5,main]) started.

> Task :runners:direct-java:compileTestJava FROM-CACHE
Custom actions are attached to task ':runners:direct-java:compileTestJava'.
Build cache key for task ':runners:direct-java:compileTestJava' is 9b7c26f059e0896e2b9eceb336a07426
Task ':runners:direct-java:compileTestJava' is not up-to-date because:
  No history is available.
Loaded cache entry for task ':runners:direct-java:compileTestJava' with cache key 9b7c26f059e0896e2b9eceb336a07426
:runners:direct-java:compileTestJava (Thread[Execution worker for ':' Thread 5,5,main]) completed. Took 0.097 secs.
:runners:direct-java:testClasses (Thread[Execution worker for ':' Thread 5,5,main]) started.

> Task :runners:direct-java:testClasses UP-TO-DATE
Skipping task ':runners:direct-java:testClasses' as it has no actions.
:runners:direct-java:testClasses (Thread[Execution worker for ':' Thread 5,5,main]) completed. Took 0.0 secs.
:runners:direct-java:shadowTestJar (Thread[Execution worker for ':',5,main]) started.

> Task :sdks:java:io:influxdb:compileJava
Custom actions are attached to task ':sdks:java:io:influxdb:compileJava'.
Build cache key for task ':sdks:java:io:influxdb:compileJava' is ef7e95c22d77baf5768f39c651138d79
Task ':sdks:java:io:influxdb:compileJava' is not up-to-date because:
  No history is available.
The input changes require a full rebuild for incremental task ':sdks:java:io:influxdb:compileJava'.
Full recompilation is required because no incremental change information is available. This is usually caused by clean builds or changing compiler arguments.
Compiling with toolchain '/usr/lib/jvm/java-8-openjdk-amd64'.
Invalidating in-memory cache of /home/jenkins/.gradle/caches/7.4/fileContent/java-modules.bin
Invalidating in-memory cache of /home/jenkins/.gradle/caches/7.4/fileContent/annotation-processors.bin
Starting process 'Gradle Worker Daemon 174'. Working directory: /home/jenkins/.gradle/workers Command: /usr/lib/jvm/java-8-openjdk-amd64/bin/java -Djava.security.manager=worker.org.gradle.process.internal.worker.child.BootstrapSecurityManager -Xbootclasspath/p:/home/jenkins/.gradle/caches/modules-2/files-2.1/com.google.errorprone/javac/9+181-r4173-1/bdf4c0aa7d540ee1f7bf14d47447aea4bbf450c5/javac-9+181-r4173-1.jar -Xbootclasspath/p:/home/jenkins/.gradle/caches/modules-2/files-2.1/com.google.errorprone/javac/9+181-r4173-1/bdf4c0aa7d540ee1f7bf14d47447aea4bbf450c5/javac-9+181-r4173-1.jar -Xmx512m -Dfile.encoding=UTF-8 -Duser.country=US -Duser.language=en -Duser.variant -cp /home/jenkins/.gradle/caches/7.4/workerMain/gradle-worker.jar worker.org.gradle.process.internal.worker.GradleWorkerMain 'Gradle Worker Daemon 174'
Successfully started process 'Gradle Worker Daemon 174'
Started Gradle worker daemon (0.491 secs) with fork options DaemonForkOptions{executable=/usr/lib/jvm/java-8-openjdk-amd64/bin/java, minHeapSize=null, maxHeapSize=null, jvmArgs=[-Xbootclasspath/p:/home/jenkins/.gradle/caches/modules-2/files-2.1/com.google.errorprone/javac/9+181-r4173-1/bdf4c0aa7d540ee1f7bf14d47447aea4bbf450c5/javac-9+181-r4173-1.jar, -Xbootclasspath/p:/home/jenkins/.gradle/caches/modules-2/files-2.1/com.google.errorprone/javac/9+181-r4173-1/bdf4c0aa7d540ee1f7bf14d47447aea4bbf450c5/javac-9+181-r4173-1.jar], keepAliveMode=SESSION}.
Compiling with JDK Java compiler API.

> Task :runners:direct-java:shadowTestJar FROM-CACHE
Build cache key for task ':runners:direct-java:shadowTestJar' is d2125362120d6450cf7921e8a8874590
Task ':runners:direct-java:shadowTestJar' is not up-to-date because:
  No history is available.
Loaded cache entry for task ':runners:direct-java:shadowTestJar' with cache key d2125362120d6450cf7921e8a8874590
:runners:direct-java:shadowTestJar (Thread[Execution worker for ':',5,main]) completed. Took 0.199 secs.

> Task :sdks:java:io:influxdb:compileJava
Note: <https://ci-beam.apache.org/job/beam_PerformanceTests_InfluxDbIO_IT/ws/src/sdks/java/io/influxdb/src/main/java/org/apache/beam/sdk/io/influxdb/InfluxDbIO.java> uses unchecked or unsafe operations.
Note: Recompile with -Xlint:unchecked for details.
Invalidating in-memory cache of /home/jenkins/.gradle/caches/7.4/javaCompile/jarAnalysis.bin
Invalidating in-memory cache of /home/jenkins/.gradle/caches/7.4/javaCompile/classAnalysis.bin
Class dependency analysis for incremental compilation took 0.009 secs.
Created classpath snapshot for incremental compilation in 0.119 secs.
Stored cache entry for task ':sdks:java:io:influxdb:compileJava' with cache key ef7e95c22d77baf5768f39c651138d79
:sdks:java:io:influxdb:compileJava (Thread[Execution worker for ':' Thread 6,5,main]) completed. Took 7.915 secs.
:sdks:java:io:influxdb:classes (Thread[Execution worker for ':' Thread 6,5,main]) started.

> Task :sdks:java:io:influxdb:classes
Skipping task ':sdks:java:io:influxdb:classes' as it has no actions.
:sdks:java:io:influxdb:classes (Thread[Execution worker for ':' Thread 6,5,main]) completed. Took 0.0 secs.
:sdks:java:io:influxdb:compileTestJava (Thread[Execution worker for ':' Thread 6,5,main]) started.

> Task :sdks:java:io:influxdb:compileTestJava
Custom actions are attached to task ':sdks:java:io:influxdb:compileTestJava'.
Build cache key for task ':sdks:java:io:influxdb:compileTestJava' is 0ac78f85b9f9660f144875a56a30e9ea
Task ':sdks:java:io:influxdb:compileTestJava' is not up-to-date because:
  No history is available.
The input changes require a full rebuild for incremental task ':sdks:java:io:influxdb:compileTestJava'.
Full recompilation is required because no incremental change information is available. This is usually caused by clean builds or changing compiler arguments.
Compiling with toolchain '/usr/lib/jvm/java-8-openjdk-amd64'.
Compiling with JDK Java compiler API.
Note: <https://ci-beam.apache.org/job/beam_PerformanceTests_InfluxDbIO_IT/ws/src/sdks/java/io/influxdb/src/test/java/org/apache/beam/sdk/io/influxdb/InfluxDbIOTest.java> uses unchecked or unsafe operations.
Note: Recompile with -Xlint:unchecked for details.
Class dependency analysis for incremental compilation took 0.001 secs.
Created classpath snapshot for incremental compilation in 0.063 secs.
Stored cache entry for task ':sdks:java:io:influxdb:compileTestJava' with cache key 0ac78f85b9f9660f144875a56a30e9ea
:sdks:java:io:influxdb:compileTestJava (Thread[Execution worker for ':' Thread 6,5,main]) completed. Took 1.785 secs.
:sdks:java:io:influxdb:testClasses (Thread[Execution worker for ':' Thread 6,5,main]) started.

> Task :sdks:java:io:influxdb:testClasses
Skipping task ':sdks:java:io:influxdb:testClasses' as it has no actions.
:sdks:java:io:influxdb:testClasses (Thread[Execution worker for ':' Thread 6,5,main]) completed. Took 0.0 secs.
:sdks:java:io:influxdb:integrationTest (Thread[Execution worker for ':' Thread 6,5,main]) started.
producer locations for task group 0 (Thread[Execution worker for ':' Thread 5,5,main]) started.
producer locations for task group 0 (Thread[Execution worker for ':' Thread 5,5,main]) completed. Took 0.0 secs.
Gradle Test Executor 175 started executing tests.

> Task :sdks:java:io:influxdb:integrationTest
Custom actions are attached to task ':sdks:java:io:influxdb:integrationTest'.
Build cache key for task ':sdks:java:io:influxdb:integrationTest' is bbffa730c5ccab7b3096075b8c1b5f16
Task ':sdks:java:io:influxdb:integrationTest' is not up-to-date because:
  Task.upToDateWhen is false.
Starting process 'Gradle Test Executor 175'. Working directory: <https://ci-beam.apache.org/job/beam_PerformanceTests_InfluxDbIO_IT/ws/src/sdks/java/io/influxdb> Command: /usr/lib/jvm/java-8-openjdk-amd64/bin/java -DbeamTestPipelineOptions=["--influxDBURL=http://34.122.188.82:8086","--influxDBUserName=superadmin","--influxDBPassword=supersecretpassword","--databaseName=db1"] -Djava.security.manager=worker.org.gradle.process.internal.worker.child.BootstrapSecurityManager -Dorg.gradle.internal.worker.tmpdir=<https://ci-beam.apache.org/job/beam_PerformanceTests_InfluxDbIO_IT/ws/src/sdks/java/io/influxdb/build/tmp/integrationTest/work> -Dorg.gradle.native=false -Xmx2g -Dfile.encoding=UTF-8 -Duser.country=US -Duser.language=en -Duser.variant -ea -cp /home/jenkins/.gradle/caches/7.4/workerMain/gradle-worker.jar worker.org.gradle.process.internal.worker.GradleWorkerMain 'Gradle Test Executor 175'
Successfully started process 'Gradle Test Executor 175'

org.apache.beam.sdk.io.influxdb.InfluxDbIOIT > testWriteAndReadWithMultipleMetric FAILED
    org.influxdb.InfluxDBIOException: java.net.SocketTimeoutException: connect timed out
        at org.influxdb.impl.InfluxDBImpl.execute(InfluxDBImpl.java:836)
        at org.influxdb.impl.InfluxDBImpl.executeQuery(InfluxDBImpl.java:819)
        at org.influxdb.impl.InfluxDBImpl.query(InfluxDBImpl.java:554)
        at org.apache.beam.sdk.io.influxdb.InfluxDbIOIT.initTest(InfluxDbIOIT.java:99)

        Caused by:
        java.net.SocketTimeoutException: connect timed out
            at java.net.PlainSocketImpl.socketConnect(Native Method)
            at java.net.AbstractPlainSocketImpl.doConnect(AbstractPlainSocketImpl.java:350)
            at java.net.AbstractPlainSocketImpl.connectToAddress(AbstractPlainSocketImpl.java:206)
            at java.net.AbstractPlainSocketImpl.connect(AbstractPlainSocketImpl.java:188)
            at java.net.SocksSocketImpl.connect(SocksSocketImpl.java:392)
            at java.net.Socket.connect(Socket.java:607)
            at okhttp3.internal.platform.Platform.connectSocket(Platform.kt:119)
            at okhttp3.internal.connection.RealConnection.connectSocket(RealConnection.kt:283)
            at okhttp3.internal.connection.RealConnection.connect(RealConnection.kt:195)
            at okhttp3.internal.connection.ExchangeFinder.findConnection(ExchangeFinder.kt:249)
            at okhttp3.internal.connection.ExchangeFinder.findHealthyConnection(ExchangeFinder.kt:108)
            at okhttp3.internal.connection.ExchangeFinder.find(ExchangeFinder.kt:76)
            at okhttp3.internal.connection.RealCall.initExchange$okhttp(RealCall.kt:245)
            at okhttp3.internal.connection.ConnectInterceptor.intercept(ConnectInterceptor.kt:32)
            at okhttp3.internal.http.RealInterceptorChain.proceed(RealInterceptorChain.kt:100)
            at okhttp3.internal.cache.CacheInterceptor.intercept(CacheInterceptor.kt:82)
            at okhttp3.internal.http.RealInterceptorChain.proceed(RealInterceptorChain.kt:100)
            at okhttp3.internal.http.BridgeInterceptor.intercept(BridgeInterceptor.kt:83)
            at okhttp3.internal.http.RealInterceptorChain.proceed(RealInterceptorChain.kt:100)
            at okhttp3.internal.http.RetryAndFollowUpInterceptor.intercept(RetryAndFollowUpInterceptor.kt:76)
            at okhttp3.internal.http.RealInterceptorChain.proceed(RealInterceptorChain.kt:100)
            at org.influxdb.impl.BasicAuthInterceptor.intercept(BasicAuthInterceptor.java:22)
            at okhttp3.internal.http.RealInterceptorChain.proceed(RealInterceptorChain.kt:100)
            at org.influxdb.impl.GzipRequestInterceptor.intercept(GzipRequestInterceptor.java:42)
            at okhttp3.internal.http.RealInterceptorChain.proceed(RealInterceptorChain.kt:100)
            at okhttp3.logging.HttpLoggingInterceptor.intercept(HttpLoggingInterceptor.kt:152)
            at okhttp3.internal.http.RealInterceptorChain.proceed(RealInterceptorChain.kt:100)
            at okhttp3.internal.connection.RealCall.getResponseWithInterceptorChain$okhttp(RealCall.kt:197)
            at okhttp3.internal.connection.RealCall.execute(RealCall.kt:148)
            at retrofit2.OkHttpCall.execute(OkHttpCall.java:190)
            at org.influxdb.impl.InfluxDBImpl.execute(InfluxDBImpl.java:824)
            ... 3 more

Gradle Test Executor 175 finished executing tests.

> Task :sdks:java:io:influxdb:integrationTest FAILED

6 tests completed, 1 failed
Finished generating test XML results (0.0 secs) into: <https://ci-beam.apache.org/job/beam_PerformanceTests_InfluxDbIO_IT/ws/src/sdks/java/io/influxdb/build/test-results/integrationTest>
Generating HTML test report...
Finished generating test html results (0.002 secs) into: <https://ci-beam.apache.org/job/beam_PerformanceTests_InfluxDbIO_IT/ws/src/sdks/java/io/influxdb/build/reports/tests/integrationTest>
:sdks:java:io:influxdb:integrationTest (Thread[Execution worker for ':' Thread 6,5,main]) completed. Took 16.474 secs.

FAILURE: Build failed with an exception.

* What went wrong:
Execution failed for task ':sdks:java:io:influxdb:integrationTest'.
> There were failing tests. See the report at: file://<https://ci-beam.apache.org/job/beam_PerformanceTests_InfluxDbIO_IT/ws/src/sdks/java/io/influxdb/build/reports/tests/integrationTest/index.html>

* Try:
> Run with --stacktrace option to get the stack trace.
> Run with --debug option to get more log output.
> Run with --scan to get full insights.

* Get more help at https://help.gradle.org

Deprecated Gradle features were used in this build, making it incompatible with Gradle 8.0.

You can use '--warning-mode all' to show the individual deprecation warnings and determine if they come from your own scripts or plugins.

See https://docs.gradle.org/7.4/userguide/command_line_interface.html#sec:command_line_warnings

BUILD FAILED in 32s
77 actionable tasks: 44 executed, 31 from cache, 2 up-to-date

Publishing build scan...
https://gradle.com/s/wmnkwioebu5no

Stopped 1 worker daemon(s).
Build step 'Invoke Gradle script' changed build result to FAILURE
Build step 'Invoke Gradle script' marked build as failure

---------------------------------------------------------------------
To unsubscribe, e-mail: builds-unsubscribe@beam.apache.org
For additional commands, e-mail: builds-help@beam.apache.org


Build failed in Jenkins: beam_PerformanceTests_InfluxDbIO_IT #2236

Posted by Apache Jenkins Server <je...@builds.apache.org>.
See <https://ci-beam.apache.org/job/beam_PerformanceTests_InfluxDbIO_IT/2236/display/redirect?page=changes>

Changes:

[bulat.safiullin] [Website] add scroll to new position if anchor is present #22699

[bulat.safiullin] [Website] remove text from Available contact channels table #22696

[bulat.safiullin] [Website] update commits link #22520


------------------------------------------
[...truncated 155.04 KB...]
  No history is available.
file or directory '<https://ci-beam.apache.org/job/beam_PerformanceTests_InfluxDbIO_IT/ws/src/sdks/java/extensions/google-cloud-platform-core/build/resources/main',> not found
:sdks:java:extensions:google-cloud-platform-core:jar (Thread[Execution worker for ':' Thread 7,5,main]) completed. Took 0.022 secs.
:sdks:java:harness:compileJava (Thread[Execution worker for ':' Thread 7,5,main]) started.

> Task :sdks:java:harness:compileJava FROM-CACHE
Custom actions are attached to task ':sdks:java:harness:compileJava'.
Build cache key for task ':sdks:java:harness:compileJava' is 5170e054f2287e5973f5b67df8a496f0
Task ':sdks:java:harness:compileJava' is not up-to-date because:
  No history is available.
Loaded cache entry for task ':sdks:java:harness:compileJava' with cache key 5170e054f2287e5973f5b67df8a496f0
:sdks:java:harness:compileJava (Thread[Execution worker for ':' Thread 7,5,main]) completed. Took 0.07 secs.
:sdks:java:harness:classes (Thread[Execution worker for ':' Thread 7,5,main]) started.

> Task :sdks:java:harness:classes UP-TO-DATE
Skipping task ':sdks:java:harness:classes' as it has no actions.
:sdks:java:harness:classes (Thread[Execution worker for ':' Thread 7,5,main]) completed. Took 0.0 secs.
:sdks:java:harness:jar (Thread[Execution worker for ':' Thread 7,5,main]) started.

> Task :sdks:java:harness:jar
Caching disabled for task ':sdks:java:harness:jar' because:
  Not worth caching
Task ':sdks:java:harness:jar' is not up-to-date because:
  No history is available.
file or directory '<https://ci-beam.apache.org/job/beam_PerformanceTests_InfluxDbIO_IT/ws/src/sdks/java/harness/build/resources/main',> not found
:sdks:java:harness:jar (Thread[Execution worker for ':' Thread 7,5,main]) completed. Took 0.058 secs.
:runners:java-fn-execution:compileJava (Thread[Execution worker for ':' Thread 7,5,main]) started.

> Task :runners:java-fn-execution:compileJava FROM-CACHE
Custom actions are attached to task ':runners:java-fn-execution:compileJava'.
Build cache key for task ':runners:java-fn-execution:compileJava' is 2d0a8e639d9c06e20ec3c61675899f73
Task ':runners:java-fn-execution:compileJava' is not up-to-date because:
  No history is available.
Loaded cache entry for task ':runners:java-fn-execution:compileJava' with cache key 2d0a8e639d9c06e20ec3c61675899f73
:runners:java-fn-execution:compileJava (Thread[Execution worker for ':' Thread 7,5,main]) completed. Took 0.075 secs.
:runners:java-fn-execution:classes (Thread[Execution worker for ':' Thread 7,5,main]) started.

> Task :runners:java-fn-execution:classes UP-TO-DATE
Skipping task ':runners:java-fn-execution:classes' as it has no actions.
:runners:java-fn-execution:classes (Thread[Execution worker for ':' Thread 7,5,main]) completed. Took 0.0 secs.
:runners:java-fn-execution:jar (Thread[Execution worker for ':' Thread 7,5,main]) started.

> Task :runners:java-fn-execution:jar
Caching disabled for task ':runners:java-fn-execution:jar' because:
  Not worth caching
Task ':runners:java-fn-execution:jar' is not up-to-date because:
  No history is available.
file or directory '<https://ci-beam.apache.org/job/beam_PerformanceTests_InfluxDbIO_IT/ws/src/runners/java-fn-execution/build/resources/main',> not found
:runners:java-fn-execution:jar (Thread[Execution worker for ':' Thread 7,5,main]) completed. Took 0.039 secs.
:runners:direct-java:compileJava (Thread[Execution worker for ':' Thread 7,5,main]) started.

> Task :runners:core-java:compileTestJava FROM-CACHE
Custom actions are attached to task ':runners:core-java:compileTestJava'.
Build cache key for task ':runners:core-java:compileTestJava' is 54b5c1c57b697073b837a72db0d69de1
Task ':runners:core-java:compileTestJava' is not up-to-date because:
  No history is available.
Loaded cache entry for task ':runners:core-java:compileTestJava' with cache key 54b5c1c57b697073b837a72db0d69de1
:runners:core-java:compileTestJava (Thread[included builds,5,main]) completed. Took 0.315 secs.
:runners:core-java:testClasses (Thread[included builds,5,main]) started.

> Task :runners:core-java:testClasses UP-TO-DATE
Skipping task ':runners:core-java:testClasses' as it has no actions.
:runners:core-java:testClasses (Thread[included builds,5,main]) completed. Took 0.0 secs.
:runners:core-java:testJar (Thread[included builds,5,main]) started.

> Task :runners:direct-java:compileJava FROM-CACHE
Custom actions are attached to task ':runners:direct-java:compileJava'.
Build cache key for task ':runners:direct-java:compileJava' is cc69bda8a4657eb86fbe7adede0c6bfc
Task ':runners:direct-java:compileJava' is not up-to-date because:
  No history is available.
Loaded cache entry for task ':runners:direct-java:compileJava' with cache key cc69bda8a4657eb86fbe7adede0c6bfc
:runners:direct-java:compileJava (Thread[Execution worker for ':' Thread 7,5,main]) completed. Took 0.082 secs.
:runners:direct-java:classes (Thread[Execution worker for ':' Thread 7,5,main]) started.

> Task :runners:core-java:testJar
Caching disabled for task ':runners:core-java:testJar' because:
  Not worth caching
Task ':runners:core-java:testJar' is not up-to-date because:
  No history is available.
file or directory '<https://ci-beam.apache.org/job/beam_PerformanceTests_InfluxDbIO_IT/ws/src/runners/core-java/build/resources/test',> not found
:runners:core-java:testJar (Thread[included builds,5,main]) completed. Took 0.036 secs.

> Task :runners:direct-java:classes UP-TO-DATE
Skipping task ':runners:direct-java:classes' as it has no actions.
:runners:direct-java:classes (Thread[Execution worker for ':' Thread 7,5,main]) completed. Took 0.0 secs.
:runners:direct-java:shadowJar (Thread[Execution worker for ':' Thread 7,5,main]) started.

> Task :runners:direct-java:shadowJar FROM-CACHE
Custom actions are attached to task ':runners:direct-java:shadowJar'.
Build cache key for task ':runners:direct-java:shadowJar' is 4f98c1231921a8bd82bafc94bba8b599
Task ':runners:direct-java:shadowJar' is not up-to-date because:
  No history is available.
Loaded cache entry for task ':runners:direct-java:shadowJar' with cache key 4f98c1231921a8bd82bafc94bba8b599
:runners:direct-java:shadowJar (Thread[Execution worker for ':' Thread 7,5,main]) completed. Took 0.29 secs.
:runners:direct-java:compileTestJava (Thread[Execution worker for ':' Thread 7,5,main]) started.

> Task :runners:direct-java:compileTestJava FROM-CACHE
Custom actions are attached to task ':runners:direct-java:compileTestJava'.
Build cache key for task ':runners:direct-java:compileTestJava' is 8e3905f6fff1d77fb11ffd70f152bbbc
Task ':runners:direct-java:compileTestJava' is not up-to-date because:
  No history is available.
Loaded cache entry for task ':runners:direct-java:compileTestJava' with cache key 8e3905f6fff1d77fb11ffd70f152bbbc
:runners:direct-java:compileTestJava (Thread[Execution worker for ':' Thread 7,5,main]) completed. Took 0.095 secs.
:runners:direct-java:testClasses (Thread[Execution worker for ':' Thread 7,5,main]) started.

> Task :runners:direct-java:testClasses UP-TO-DATE
Skipping task ':runners:direct-java:testClasses' as it has no actions.
:runners:direct-java:testClasses (Thread[Execution worker for ':' Thread 7,5,main]) completed. Took 0.0 secs.
:runners:direct-java:shadowTestJar (Thread[Execution worker for ':' Thread 7,5,main]) started.

> Task :runners:direct-java:shadowTestJar FROM-CACHE
Build cache key for task ':runners:direct-java:shadowTestJar' is 874bc6cbbf029bbd3c3c84cf7246ec47
Task ':runners:direct-java:shadowTestJar' is not up-to-date because:
  No history is available.
Loaded cache entry for task ':runners:direct-java:shadowTestJar' with cache key 874bc6cbbf029bbd3c3c84cf7246ec47
:runners:direct-java:shadowTestJar (Thread[Execution worker for ':' Thread 7,5,main]) completed. Took 0.196 secs.
:sdks:java:io:influxdb:integrationTest (Thread[Execution worker for ':' Thread 7,5,main]) started.
producer locations for task group 0 (Thread[included builds,5,main]) started.
producer locations for task group 0 (Thread[included builds,5,main]) completed. Took 0.0 secs.
Gradle Test Executor 153 started executing tests.

> Task :sdks:java:io:influxdb:integrationTest
Custom actions are attached to task ':sdks:java:io:influxdb:integrationTest'.
Build cache key for task ':sdks:java:io:influxdb:integrationTest' is 0e7e41c9305bd1e8f1ba69635ff0c204
Task ':sdks:java:io:influxdb:integrationTest' is not up-to-date because:
  Task.upToDateWhen is false.
Starting process 'Gradle Test Executor 153'. Working directory: <https://ci-beam.apache.org/job/beam_PerformanceTests_InfluxDbIO_IT/ws/src/sdks/java/io/influxdb> Command: /usr/lib/jvm/java-8-openjdk-amd64/bin/java -DbeamTestPipelineOptions=["--influxDBURL=http://104.154.109.134:8086","--influxDBUserName=superadmin","--influxDBPassword=supersecretpassword","--databaseName=db1"] -Djava.security.manager=worker.org.gradle.process.internal.worker.child.BootstrapSecurityManager -Dorg.gradle.internal.worker.tmpdir=<https://ci-beam.apache.org/job/beam_PerformanceTests_InfluxDbIO_IT/ws/src/sdks/java/io/influxdb/build/tmp/integrationTest/work> -Dorg.gradle.native=false -Xmx2g -Dfile.encoding=UTF-8 -Duser.country=US -Duser.language=en -Duser.variant -ea -cp /home/jenkins/.gradle/caches/7.4/workerMain/gradle-worker.jar worker.org.gradle.process.internal.worker.GradleWorkerMain 'Gradle Test Executor 153'
Successfully started process 'Gradle Test Executor 153'

org.apache.beam.sdk.io.influxdb.InfluxDbIOIT > testWriteAndReadWithMultipleMetric FAILED
    org.influxdb.InfluxDBIOException: java.net.SocketTimeoutException: connect timed out
        at org.influxdb.impl.InfluxDBImpl.execute(InfluxDBImpl.java:836)
        at org.influxdb.impl.InfluxDBImpl.executeQuery(InfluxDBImpl.java:819)
        at org.influxdb.impl.InfluxDBImpl.query(InfluxDBImpl.java:554)
        at org.apache.beam.sdk.io.influxdb.InfluxDbIOIT.initTest(InfluxDbIOIT.java:99)

        Caused by:
        java.net.SocketTimeoutException: connect timed out
            at java.net.PlainSocketImpl.socketConnect(Native Method)
            at java.net.AbstractPlainSocketImpl.doConnect(AbstractPlainSocketImpl.java:350)
            at java.net.AbstractPlainSocketImpl.connectToAddress(AbstractPlainSocketImpl.java:206)
            at java.net.AbstractPlainSocketImpl.connect(AbstractPlainSocketImpl.java:188)
            at java.net.SocksSocketImpl.connect(SocksSocketImpl.java:392)
            at java.net.Socket.connect(Socket.java:607)
            at okhttp3.internal.platform.Platform.connectSocket(Platform.kt:119)
            at okhttp3.internal.connection.RealConnection.connectSocket(RealConnection.kt:283)
            at okhttp3.internal.connection.RealConnection.connect(RealConnection.kt:195)
            at okhttp3.internal.connection.ExchangeFinder.findConnection(ExchangeFinder.kt:249)
            at okhttp3.internal.connection.ExchangeFinder.findHealthyConnection(ExchangeFinder.kt:108)
            at okhttp3.internal.connection.ExchangeFinder.find(ExchangeFinder.kt:76)
            at okhttp3.internal.connection.RealCall.initExchange$okhttp(RealCall.kt:245)
            at okhttp3.internal.connection.ConnectInterceptor.intercept(ConnectInterceptor.kt:32)
            at okhttp3.internal.http.RealInterceptorChain.proceed(RealInterceptorChain.kt:100)
            at okhttp3.internal.cache.CacheInterceptor.intercept(CacheInterceptor.kt:82)
            at okhttp3.internal.http.RealInterceptorChain.proceed(RealInterceptorChain.kt:100)
            at okhttp3.internal.http.BridgeInterceptor.intercept(BridgeInterceptor.kt:83)
            at okhttp3.internal.http.RealInterceptorChain.proceed(RealInterceptorChain.kt:100)
            at okhttp3.internal.http.RetryAndFollowUpInterceptor.intercept(RetryAndFollowUpInterceptor.kt:76)
            at okhttp3.internal.http.RealInterceptorChain.proceed(RealInterceptorChain.kt:100)
            at org.influxdb.impl.BasicAuthInterceptor.intercept(BasicAuthInterceptor.java:22)
            at okhttp3.internal.http.RealInterceptorChain.proceed(RealInterceptorChain.kt:100)
            at org.influxdb.impl.GzipRequestInterceptor.intercept(GzipRequestInterceptor.java:42)
            at okhttp3.internal.http.RealInterceptorChain.proceed(RealInterceptorChain.kt:100)
            at okhttp3.logging.HttpLoggingInterceptor.intercept(HttpLoggingInterceptor.kt:152)
            at okhttp3.internal.http.RealInterceptorChain.proceed(RealInterceptorChain.kt:100)
            at okhttp3.internal.connection.RealCall.getResponseWithInterceptorChain$okhttp(RealCall.kt:197)
            at okhttp3.internal.connection.RealCall.execute(RealCall.kt:148)
            at retrofit2.OkHttpCall.execute(OkHttpCall.java:190)
            at org.influxdb.impl.InfluxDBImpl.execute(InfluxDBImpl.java:824)
            ... 3 more

    org.influxdb.InfluxDBIOException: java.net.SocketTimeoutException: connect timed out
        at org.influxdb.impl.InfluxDBImpl.execute(InfluxDBImpl.java:836)
        at org.influxdb.impl.InfluxDBImpl.executeQuery(InfluxDBImpl.java:819)
        at org.influxdb.impl.InfluxDBImpl.query(InfluxDBImpl.java:554)
        at org.apache.beam.sdk.io.influxdb.InfluxDbIOIT.clear(InfluxDbIOIT.java:88)

        Caused by:
        java.net.SocketTimeoutException: connect timed out
            at java.net.PlainSocketImpl.socketConnect(Native Method)
            at java.net.AbstractPlainSocketImpl.doConnect(AbstractPlainSocketImpl.java:350)
            at java.net.AbstractPlainSocketImpl.connectToAddress(AbstractPlainSocketImpl.java:206)
            at java.net.AbstractPlainSocketImpl.connect(AbstractPlainSocketImpl.java:188)
            at java.net.SocksSocketImpl.connect(SocksSocketImpl.java:392)
            at java.net.Socket.connect(Socket.java:607)
            at okhttp3.internal.platform.Platform.connectSocket(Platform.kt:119)
            at okhttp3.internal.connection.RealConnection.connectSocket(RealConnection.kt:283)
            at okhttp3.internal.connection.RealConnection.connect(RealConnection.kt:195)
            at okhttp3.internal.connection.ExchangeFinder.findConnection(ExchangeFinder.kt:249)
            at okhttp3.internal.connection.ExchangeFinder.findHealthyConnection(ExchangeFinder.kt:108)
            at okhttp3.internal.connection.ExchangeFinder.find(ExchangeFinder.kt:76)
            at okhttp3.internal.connection.RealCall.initExchange$okhttp(RealCall.kt:245)
            at okhttp3.internal.connection.ConnectInterceptor.intercept(ConnectInterceptor.kt:32)
            at okhttp3.internal.http.RealInterceptorChain.proceed(RealInterceptorChain.kt:100)
            at okhttp3.internal.cache.CacheInterceptor.intercept(CacheInterceptor.kt:82)
            at okhttp3.internal.http.RealInterceptorChain.proceed(RealInterceptorChain.kt:100)
            at okhttp3.internal.http.BridgeInterceptor.intercept(BridgeInterceptor.kt:83)
            at okhttp3.internal.http.RealInterceptorChain.proceed(RealInterceptorChain.kt:100)
            at okhttp3.internal.http.RetryAndFollowUpInterceptor.intercept(RetryAndFollowUpInterceptor.kt:76)
            at okhttp3.internal.http.RealInterceptorChain.proceed(RealInterceptorChain.kt:100)
            at org.influxdb.impl.BasicAuthInterceptor.intercept(BasicAuthInterceptor.java:22)
            at okhttp3.internal.http.RealInterceptorChain.proceed(RealInterceptorChain.kt:100)
            at org.influxdb.impl.GzipRequestInterceptor.intercept(GzipRequestInterceptor.java:42)
            at okhttp3.internal.http.RealInterceptorChain.proceed(RealInterceptorChain.kt:100)
            at okhttp3.logging.HttpLoggingInterceptor.intercept(HttpLoggingInterceptor.kt:152)
            at okhttp3.internal.http.RealInterceptorChain.proceed(RealInterceptorChain.kt:100)
            at okhttp3.internal.connection.RealCall.getResponseWithInterceptorChain$okhttp(RealCall.kt:197)
            at okhttp3.internal.connection.RealCall.execute(RealCall.kt:148)
            at retrofit2.OkHttpCall.execute(OkHttpCall.java:190)
            at org.influxdb.impl.InfluxDBImpl.execute(InfluxDBImpl.java:824)
            ... 3 more

Gradle Test Executor 153 finished executing tests.

> Task :sdks:java:io:influxdb:integrationTest FAILED

6 tests completed, 1 failed
Finished generating test XML results (0.001 secs) into: <https://ci-beam.apache.org/job/beam_PerformanceTests_InfluxDbIO_IT/ws/src/sdks/java/io/influxdb/build/test-results/integrationTest>
Generating HTML test report...
Finished generating test html results (0.002 secs) into: <https://ci-beam.apache.org/job/beam_PerformanceTests_InfluxDbIO_IT/ws/src/sdks/java/io/influxdb/build/reports/tests/integrationTest>
:sdks:java:io:influxdb:integrationTest (Thread[Execution worker for ':' Thread 7,5,main]) completed. Took 33.718 secs.

FAILURE: Build failed with an exception.

* What went wrong:
Execution failed for task ':sdks:java:io:influxdb:integrationTest'.
> There were failing tests. See the report at: file://<https://ci-beam.apache.org/job/beam_PerformanceTests_InfluxDbIO_IT/ws/src/sdks/java/io/influxdb/build/reports/tests/integrationTest/index.html>

* Try:
> Run with --stacktrace option to get the stack trace.
> Run with --debug option to get more log output.
> Run with --scan to get full insights.

* Get more help at https://help.gradle.org

Deprecated Gradle features were used in this build, making it incompatible with Gradle 8.0.

You can use '--warning-mode all' to show the individual deprecation warnings and determine if they come from your own scripts or plugins.

See https://docs.gradle.org/7.4/userguide/command_line_interface.html#sec:command_line_warnings

BUILD FAILED in 41s
77 actionable tasks: 42 executed, 33 from cache, 2 up-to-date

Publishing build scan...
https://gradle.com/s/i7gvukbbxxmbe

Build step 'Invoke Gradle script' changed build result to FAILURE
Build step 'Invoke Gradle script' marked build as failure

---------------------------------------------------------------------
To unsubscribe, e-mail: builds-unsubscribe@beam.apache.org
For additional commands, e-mail: builds-help@beam.apache.org