You are viewing a plain text version of this content. The canonical link for it is here.
Posted to dev@lucene.apache.org by Policeman Jenkins Server <je...@thetaphi.de> on 2014/06/18 19:19:00 UTC

[JENKINS] Lucene-Solr-4.x-Linux (32bit/jdk1.7.0_60) - Build # 10475 - Still Failing!

Build: http://jenkins.thetaphi.de/job/Lucene-Solr-4.x-Linux/10475/
Java: 32bit/jdk1.7.0_60 -server -XX:+UseParallelGC

1 tests failed.
FAILED:  org.apache.lucene.codecs.lucene3x.TestLucene3xPostingsFormat.testRamBytesUsed

Error Message:
Actual RAM usage 2236, but got 1096, 0.5098389982110912% error

Stack Trace:
java.lang.AssertionError: Actual RAM usage 2236, but got 1096, 0.5098389982110912% error
	at __randomizedtesting.SeedInfo.seed([B22949CBF6C565BE:408A5B8B3CBA7AE8]:0)
	at org.junit.Assert.fail(Assert.java:93)
	at org.junit.Assert.assertTrue(Assert.java:43)
	at org.apache.lucene.index.BaseIndexFileFormatTestCase.testRamBytesUsed(BaseIndexFileFormatTestCase.java:235)
	at org.apache.lucene.index.BasePostingsFormatTestCase.testRamBytesUsed(BasePostingsFormatTestCase.java:81)
	at sun.reflect.NativeMethodAccessorImpl.invoke0(Native Method)
	at sun.reflect.NativeMethodAccessorImpl.invoke(NativeMethodAccessorImpl.java:57)
	at sun.reflect.DelegatingMethodAccessorImpl.invoke(DelegatingMethodAccessorImpl.java:43)
	at java.lang.reflect.Method.invoke(Method.java:606)
	at com.carrotsearch.randomizedtesting.RandomizedRunner.invoke(RandomizedRunner.java:1618)
	at com.carrotsearch.randomizedtesting.RandomizedRunner$6.evaluate(RandomizedRunner.java:827)
	at com.carrotsearch.randomizedtesting.RandomizedRunner$7.evaluate(RandomizedRunner.java:863)
	at com.carrotsearch.randomizedtesting.RandomizedRunner$8.evaluate(RandomizedRunner.java:877)
	at org.apache.lucene.util.TestRuleSetupTeardownChained$1.evaluate(TestRuleSetupTeardownChained.java:50)
	at org.apache.lucene.util.TestRuleFieldCacheSanity$1.evaluate(TestRuleFieldCacheSanity.java:51)
	at org.apache.lucene.util.AbstractBeforeAfterRule$1.evaluate(AbstractBeforeAfterRule.java:46)
	at com.carrotsearch.randomizedtesting.rules.SystemPropertiesInvariantRule$1.evaluate(SystemPropertiesInvariantRule.java:55)
	at org.apache.lucene.util.TestRuleThreadAndTestName$1.evaluate(TestRuleThreadAndTestName.java:49)
	at org.apache.lucene.util.TestRuleIgnoreAfterMaxFailures$1.evaluate(TestRuleIgnoreAfterMaxFailures.java:65)
	at org.apache.lucene.util.TestRuleMarkFailure$1.evaluate(TestRuleMarkFailure.java:48)
	at com.carrotsearch.randomizedtesting.rules.StatementAdapter.evaluate(StatementAdapter.java:36)
	at com.carrotsearch.randomizedtesting.ThreadLeakControl$StatementRunner.run(ThreadLeakControl.java:360)
	at com.carrotsearch.randomizedtesting.ThreadLeakControl.forkTimeoutingTask(ThreadLeakControl.java:793)
	at com.carrotsearch.randomizedtesting.ThreadLeakControl$3.evaluate(ThreadLeakControl.java:453)
	at com.carrotsearch.randomizedtesting.RandomizedRunner.runSingleTest(RandomizedRunner.java:836)
	at com.carrotsearch.randomizedtesting.RandomizedRunner$3.evaluate(RandomizedRunner.java:738)
	at com.carrotsearch.randomizedtesting.RandomizedRunner$4.evaluate(RandomizedRunner.java:772)
	at com.carrotsearch.randomizedtesting.RandomizedRunner$5.evaluate(RandomizedRunner.java:783)
	at org.apache.lucene.util.AbstractBeforeAfterRule$1.evaluate(AbstractBeforeAfterRule.java:46)
	at org.apache.lucene.util.TestRuleStoreClassName$1.evaluate(TestRuleStoreClassName.java:42)
	at com.carrotsearch.randomizedtesting.rules.SystemPropertiesInvariantRule$1.evaluate(SystemPropertiesInvariantRule.java:55)
	at com.carrotsearch.randomizedtesting.rules.NoShadowingOrOverridesOnMethodsRule$1.evaluate(NoShadowingOrOverridesOnMethodsRule.java:39)
	at com.carrotsearch.randomizedtesting.rules.NoShadowingOrOverridesOnMethodsRule$1.evaluate(NoShadowingOrOverridesOnMethodsRule.java:39)
	at com.carrotsearch.randomizedtesting.rules.StatementAdapter.evaluate(StatementAdapter.java:36)
	at com.carrotsearch.randomizedtesting.rules.StatementAdapter.evaluate(StatementAdapter.java:36)
	at com.carrotsearch.randomizedtesting.rules.StatementAdapter.evaluate(StatementAdapter.java:36)
	at org.apache.lucene.util.TestRuleAssertionsRequired$1.evaluate(TestRuleAssertionsRequired.java:43)
	at org.apache.lucene.util.TestRuleMarkFailure$1.evaluate(TestRuleMarkFailure.java:48)
	at org.apache.lucene.util.TestRuleIgnoreAfterMaxFailures$1.evaluate(TestRuleIgnoreAfterMaxFailures.java:65)
	at org.apache.lucene.util.TestRuleIgnoreTestSuites$1.evaluate(TestRuleIgnoreTestSuites.java:55)
	at com.carrotsearch.randomizedtesting.rules.StatementAdapter.evaluate(StatementAdapter.java:36)
	at com.carrotsearch.randomizedtesting.ThreadLeakControl$StatementRunner.run(ThreadLeakControl.java:360)
	at java.lang.Thread.run(Thread.java:745)




Build Log:
[...truncated 566 lines...]
   [junit4] Suite: org.apache.lucene.codecs.lucene3x.TestLucene3xPostingsFormat
   [junit4]   2> NOTE: reproduce with: ant test  -Dtestcase=TestLucene3xPostingsFormat -Dtests.method=testRamBytesUsed -Dtests.seed=B22949CBF6C565BE -Dtests.multiplier=3 -Dtests.slow=true -Dtests.locale=ru -Dtests.timezone=SST -Dtests.file.encoding=UTF-8
   [junit4] FAILURE 1.82s J0 | TestLucene3xPostingsFormat.testRamBytesUsed <<<
   [junit4]    > Throwable #1: java.lang.AssertionError: Actual RAM usage 2236, but got 1096, 0.5098389982110912% error
   [junit4]    > 	at __randomizedtesting.SeedInfo.seed([B22949CBF6C565BE:408A5B8B3CBA7AE8]:0)
   [junit4]    > 	at org.apache.lucene.index.BaseIndexFileFormatTestCase.testRamBytesUsed(BaseIndexFileFormatTestCase.java:235)
   [junit4]    > 	at org.apache.lucene.index.BasePostingsFormatTestCase.testRamBytesUsed(BasePostingsFormatTestCase.java:81)
   [junit4]    > 	at java.lang.Thread.run(Thread.java:745)
   [junit4]   2> NOTE: leaving temporary files on disk at: /mnt/ssd/jenkins/workspace/Lucene-Solr-4.x-Linux/lucene/build/core/test/J0/./lucene.codecs.lucene3x.TestLucene3xPostingsFormat-B22949CBF6C565BE-001
   [junit4]   2> NOTE: test params are: codec=CheapBastard, sim=DefaultSimilarity, locale=ru, timezone=SST
   [junit4]   2> NOTE: Linux 3.8.0-41-generic i386/Oracle Corporation 1.7.0_60 (32-bit)/cpus=8,threads=1,free=124454144,total=213385216
   [junit4]   2> NOTE: All tests run in this JVM: [TestDirectory, TestTermdocPerf, TestBagOfPositions, Test2BSortedDocValues, TestCompoundFile, TestLucene40PostingsReader, TestIntroSorter, TestAutomatonQueryUnicode, TestDocBoost, TestLock, TestBlockPostingsFormat3, TestBooleanCoord, TestSimilarity, TestVersion, TestNot, TestMathUtil, TestIndexWriterMerging, TestIntBlockPool, TestMatchAllDocsQuery, TestCachingTokenFilter, TestRamUsageEstimator, Test2BPostingsBytes, TestNRTReaderWithThreads, TestFilterDirectory, TestBytesStore, TestRollback, TestLucene49NormsFormat, TestExceedMaxTermLength, TestLucene40StoredFieldsFormat, TestSpanFirstQuery, TestCharTermAttributeImpl, TestDocTermOrds, TestSort, TestLucene41StoredFieldsFormat, TestBufferedChecksum, TestLucene3xPostingsFormat]
   [junit4] Completed on J0 in 4.11s, 9 tests, 1 failure <<< FAILURES!

[...truncated 1229 lines...]
BUILD FAILED
/mnt/ssd/jenkins/workspace/Lucene-Solr-4.x-Linux/build.xml:467: The following error occurred while executing this line:
/mnt/ssd/jenkins/workspace/Lucene-Solr-4.x-Linux/build.xml:447: The following error occurred while executing this line:
/mnt/ssd/jenkins/workspace/Lucene-Solr-4.x-Linux/build.xml:45: The following error occurred while executing this line:
/mnt/ssd/jenkins/workspace/Lucene-Solr-4.x-Linux/extra-targets.xml:37: The following error occurred while executing this line:
/mnt/ssd/jenkins/workspace/Lucene-Solr-4.x-Linux/lucene/build.xml:49: The following error occurred while executing this line:
/mnt/ssd/jenkins/workspace/Lucene-Solr-4.x-Linux/lucene/common-build.xml:1297: The following error occurred while executing this line:
/mnt/ssd/jenkins/workspace/Lucene-Solr-4.x-Linux/lucene/common-build.xml:921: There were test failures: 413 suites, 3445 tests, 1 failure, 132 ignored (121 assumptions)

Total time: 24 minutes 2 seconds
Build step 'Invoke Ant' marked build as failure
Description set: Java: 32bit/jdk1.7.0_60 -server -XX:+UseParallelGC
Archiving artifacts
Recording test results
Email was triggered for: Failure - Any
Sending email for trigger: Failure - Any