You are viewing a plain text version of this content. The canonical link for it is here.
Posted to issues@tajo.apache.org by Apache Jenkins Server <je...@builds.apache.org> on 2015/11/24 07:35:28 UTC
Build failed in Jenkins: Tajo-0.11.1-build #110
See <https://builds.apache.org/job/Tajo-0.11.1-build/110/>
------------------------------------------
[...truncated 11991 lines...]
2015-11-24 06:35:25,771 INFO: org.apache.tajo.TajoTestingCluster (startMiniTajoCluster(402)) - Mini Tajo cluster is up
2015-11-24 06:35:25,771 INFO: org.apache.tajo.TajoTestingCluster (startMiniTajoCluster(403)) - ====================================================================================
2015-11-24 06:35:25,772 INFO: org.apache.tajo.TajoTestingCluster (startMiniTajoCluster(404)) - = MiniTajoCluster starts up =
2015-11-24 06:35:25,772 INFO: org.apache.tajo.TajoTestingCluster (startMiniTajoCluster(405)) - ====================================================================================
2015-11-24 06:35:25,769 INFO: org.apache.tajo.util.history.HistoryCleaner (run(62)) - History cleaner started: expiry day=7
2015-11-24 06:35:25,772 INFO: org.apache.tajo.TajoTestingCluster (startMiniTajoCluster(406)) - = * Master Address: 127.0.0.1:16313
2015-11-24 06:35:25,772 INFO: org.apache.tajo.TajoTestingCluster (startMiniTajoCluster(407)) - = * CatalogStore: org.apache.tajo.catalog.store.DerbyStore
2015-11-24 06:35:25,772 INFO: org.apache.tajo.TajoTestingCluster (startMiniTajoCluster(408)) - ------------------------------------------------------------------------------------
2015-11-24 06:35:25,773 INFO: org.apache.tajo.TajoTestingCluster (startMiniTajoCluster(409)) - = * Warehouse Dir: hdfs://localhost:58093/tajo/warehouse
2015-11-24 06:35:25,773 INFO: org.apache.tajo.TajoTestingCluster (startMiniTajoCluster(410)) - = * Worker Tmp Dir: file://<https://builds.apache.org/job/Tajo-0.11.1-build/ws/tajo-storage/tajo-storage-pgsql/target/test-data/fa491abf-7c96-4b0b-be1f-d2d8a171ad6f/tajo-localdir>
2015-11-24 06:35:25,773 INFO: org.apache.tajo.TajoTestingCluster (startMiniTajoCluster(411)) - ====================================================================================
2015-11-24 06:35:25,914 INFO: org.apache.tajo.session.SessionManager (createSession(79)) - Session 47bde7fd-4bc0-4b70-adca-ef406099c3fa is created.
2015-11-24 06:35:25,944 INFO: org.apache.tajo.master.rm.NodeStatus (transition(220)) - Node with (Memory:2000, Disks:3, vCores:4) is joined to Tajo cluster
2015-11-24 06:35:25,944 INFO: org.apache.tajo.master.rm.NodeStatus (handle(292)) - -573007882 Node Transitioned from NEW to RUNNING
2015-11-24 06:35:25,995 INFO: BlockStateChange (logAddStoredBlock(2624)) - BLOCK* addStoredBlock: blockMap updated: 127.0.0.1:40011 is added to blk_1073741826_1002{UCState=UNDER_CONSTRUCTION, truncateBlock=null, primaryNodeIndex=-1, replicas=[ReplicaUC[[DISK]DS-a4fd0291-87cf-4aa2-b7ea-e9661416180d:NORMAL:127.0.0.1:40011|RBW]]} size 0
2015-11-24 06:35:26,109 INFO: org.apache.tajo.catalog.CatalogServer (createTable(694)) - relation "default.customer" is added to the catalog (127.0.0.1:16311)
2015-11-24 06:35:26,140 INFO: BlockStateChange (logAddStoredBlock(2624)) - BLOCK* addStoredBlock: blockMap updated: 127.0.0.1:40011 is added to blk_1073741827_1003{UCState=UNDER_CONSTRUCTION, truncateBlock=null, primaryNodeIndex=-1, replicas=[ReplicaUC[[DISK]DS-be0ff925-5523-49c9-9a26-0b0be8455b68:NORMAL:127.0.0.1:40011|RBW]]} size 0
2015-11-24 06:35:26,163 INFO: org.apache.tajo.catalog.CatalogServer (createTable(694)) - relation "default.lineitem" is added to the catalog (127.0.0.1:16311)
2015-11-24 06:35:26,195 INFO: BlockStateChange (logAddStoredBlock(2624)) - BLOCK* addStoredBlock: blockMap updated: 127.0.0.1:40011 is added to blk_1073741828_1004{UCState=UNDER_CONSTRUCTION, truncateBlock=null, primaryNodeIndex=-1, replicas=[ReplicaUC[[DISK]DS-a4fd0291-87cf-4aa2-b7ea-e9661416180d:NORMAL:127.0.0.1:40011|FINALIZED]]} size 0
2015-11-24 06:35:26,208 INFO: org.apache.tajo.catalog.CatalogServer (createTable(694)) - relation "default.nation" is added to the catalog (127.0.0.1:16311)
2015-11-24 06:35:26,227 INFO: BlockStateChange (logAddStoredBlock(2624)) - BLOCK* addStoredBlock: blockMap updated: 127.0.0.1:40011 is added to blk_1073741829_1005{UCState=UNDER_CONSTRUCTION, truncateBlock=null, primaryNodeIndex=-1, replicas=[ReplicaUC[[DISK]DS-be0ff925-5523-49c9-9a26-0b0be8455b68:NORMAL:127.0.0.1:40011|FINALIZED]]} size 0
2015-11-24 06:35:26,237 INFO: org.apache.tajo.catalog.CatalogServer (createTable(694)) - relation "default.orders" is added to the catalog (127.0.0.1:16311)
2015-11-24 06:35:26,252 INFO: BlockStateChange (logAddStoredBlock(2624)) - BLOCK* addStoredBlock: blockMap updated: 127.0.0.1:40011 is added to blk_1073741830_1006{UCState=UNDER_CONSTRUCTION, truncateBlock=null, primaryNodeIndex=-1, replicas=[ReplicaUC[[DISK]DS-a4fd0291-87cf-4aa2-b7ea-e9661416180d:NORMAL:127.0.0.1:40011|FINALIZED]]} size 0
2015-11-24 06:35:26,269 INFO: org.apache.tajo.catalog.CatalogServer (createTable(694)) - relation "default.part" is added to the catalog (127.0.0.1:16311)
2015-11-24 06:35:26,287 INFO: BlockStateChange (logAddStoredBlock(2624)) - BLOCK* addStoredBlock: blockMap updated: 127.0.0.1:40011 is added to blk_1073741831_1007{UCState=UNDER_CONSTRUCTION, truncateBlock=null, primaryNodeIndex=-1, replicas=[ReplicaUC[[DISK]DS-be0ff925-5523-49c9-9a26-0b0be8455b68:NORMAL:127.0.0.1:40011|FINALIZED]]} size 0
2015-11-24 06:35:26,300 INFO: org.apache.tajo.catalog.CatalogServer (createTable(694)) - relation "default.partsupp" is added to the catalog (127.0.0.1:16311)
2015-11-24 06:35:26,325 INFO: BlockStateChange (logAddStoredBlock(2624)) - BLOCK* addStoredBlock: blockMap updated: 127.0.0.1:40011 is added to blk_1073741832_1008{UCState=COMMITTED, truncateBlock=null, primaryNodeIndex=-1, replicas=[ReplicaUC[[DISK]DS-a4fd0291-87cf-4aa2-b7ea-e9661416180d:NORMAL:127.0.0.1:40011|RBW]]} size 389
2015-11-24 06:35:26,734 INFO: org.apache.tajo.catalog.CatalogServer (createTable(694)) - relation "default.region" is added to the catalog (127.0.0.1:16311)
2015-11-24 06:35:26,757 INFO: BlockStateChange (logAddStoredBlock(2624)) - BLOCK* addStoredBlock: blockMap updated: 127.0.0.1:40011 is added to blk_1073741833_1009{UCState=UNDER_CONSTRUCTION, truncateBlock=null, primaryNodeIndex=-1, replicas=[ReplicaUC[[DISK]DS-be0ff925-5523-49c9-9a26-0b0be8455b68:NORMAL:127.0.0.1:40011|FINALIZED]]} size 0
2015-11-24 06:35:26,766 INFO: org.apache.tajo.catalog.CatalogServer (createTable(694)) - relation "default.supplier" is added to the catalog (127.0.0.1:16311)
2015-11-24 06:35:26,886 INFO: org.apache.tajo.catalog.CatalogServer (createTable(694)) - relation "default.empty_orders" is added to the catalog (127.0.0.1:16311)
2015-11-24 06:35:26,887 INFO: org.apache.tajo.LocalTajoTestingUtility (setup(131)) - ===================================================
2015-11-24 06:35:26,887 INFO: org.apache.tajo.LocalTajoTestingUtility (setup(132)) - Test Cluster ready and test table created.
2015-11-24 06:35:26,888 INFO: org.apache.tajo.LocalTajoTestingUtility (setup(133)) - ===================================================
2015-11-24 06:35:26,895 INFO: org.apache.tajo.session.SessionManager (createSession(79)) - Session b36e8511-d835-4f0a-b38c-0d1756a1d20a is created.
Tests run: 2, Failures: 0, Errors: 2, Skipped: 0, Time elapsed: 15.119 sec <<< FAILURE! - in org.apache.tajo.storage.pgsql.TestPgSQLSimpleQueryTests
org.apache.tajo.storage.pgsql.TestPgSQLSimpleQueryTests Time elapsed: 15.118 sec <<< ERROR!
java.lang.NoClassDefFoundError: Could not initialize class org.apache.tajo.storage.pgsql.PgSQLTestServer
at org.apache.tajo.storage.pgsql.TestPgSQLSimpleQueryTests.<clinit>(TestPgSQLSimpleQueryTests.java:26)
org.apache.tajo.storage.pgsql.TestPgSQLSimpleQueryTests Time elapsed: 15.119 sec <<< ERROR!
java.lang.NullPointerException: null
at org.apache.tajo.QueryTestCaseBase.tearDownClass(QueryTestCaseBase.java:231)
at sun.reflect.NativeMethodAccessorImpl.invoke0(Native Method)
at sun.reflect.NativeMethodAccessorImpl.invoke(NativeMethodAccessorImpl.java:57)
at sun.reflect.DelegatingMethodAccessorImpl.invoke(DelegatingMethodAccessorImpl.java:43)
at java.lang.reflect.Method.invoke(Method.java:606)
at org.junit.runners.model.FrameworkMethod$1.runReflectiveCall(FrameworkMethod.java:47)
at org.junit.internal.runners.model.ReflectiveCallable.run(ReflectiveCallable.java:12)
at org.junit.runners.model.FrameworkMethod.invokeExplosively(FrameworkMethod.java:44)
at org.junit.internal.runners.statements.RunAfters.evaluate(RunAfters.java:33)
at org.junit.runners.ParentRunner.run(ParentRunner.java:309)
at org.apache.maven.surefire.junit4.JUnit4Provider.execute(JUnit4Provider.java:264)
at org.apache.maven.surefire.junit4.JUnit4Provider.executeTestSet(JUnit4Provider.java:153)
at org.apache.maven.surefire.junit4.JUnit4Provider.invoke(JUnit4Provider.java:124)
at org.apache.maven.surefire.booter.ForkedBooter.invokeProviderInSameClassLoader(ForkedBooter.java:200)
at org.apache.maven.surefire.booter.ForkedBooter.runSuitesInProcess(ForkedBooter.java:153)
at org.apache.maven.surefire.booter.ForkedBooter.main(ForkedBooter.java:103)
Running org.apache.tajo.storage.pgsql.TestPgSQLEndPointTests
2015-11-24 06:35:26,913 INFO: org.apache.tajo.session.SessionManager (createSession(79)) - Session 31d8d4b8-753a-4c6c-8d64-e7170d6ad907 is created.
Tests run: 3, Failures: 0, Errors: 3, Skipped: 0, Time elapsed: 0 sec <<< FAILURE! - in org.apache.tajo.storage.pgsql.TestPgSQLEndPointTests
org.apache.tajo.storage.pgsql.TestPgSQLEndPointTests Time elapsed: 0 sec <<< ERROR!
java.lang.NoClassDefFoundError: Could not initialize class org.apache.tajo.storage.pgsql.PgSQLTestServer
at org.apache.tajo.storage.pgsql.TestPgSQLEndPointTests.<clinit>(TestPgSQLEndPointTests.java:36)
org.apache.tajo.storage.pgsql.TestPgSQLEndPointTests Time elapsed: 0 sec <<< ERROR!
java.lang.NoClassDefFoundError: Could not initialize class org.apache.tajo.storage.pgsql.TestPgSQLEndPointTests
at sun.reflect.NativeMethodAccessorImpl.invoke0(Native Method)
at sun.reflect.NativeMethodAccessorImpl.invoke(NativeMethodAccessorImpl.java:57)
at sun.reflect.DelegatingMethodAccessorImpl.invoke(DelegatingMethodAccessorImpl.java:43)
at java.lang.reflect.Method.invoke(Method.java:606)
at org.junit.runners.model.FrameworkMethod$1.runReflectiveCall(FrameworkMethod.java:47)
at org.junit.internal.runners.model.ReflectiveCallable.run(ReflectiveCallable.java:12)
at org.junit.runners.model.FrameworkMethod.invokeExplosively(FrameworkMethod.java:44)
at org.junit.internal.runners.statements.RunAfters.evaluate(RunAfters.java:33)
at org.junit.runners.ParentRunner.run(ParentRunner.java:309)
at org.apache.maven.surefire.junit4.JUnit4Provider.execute(JUnit4Provider.java:264)
at org.apache.maven.surefire.junit4.JUnit4Provider.executeTestSet(JUnit4Provider.java:153)
at org.apache.maven.surefire.junit4.JUnit4Provider.invoke(JUnit4Provider.java:124)
at org.apache.maven.surefire.booter.ForkedBooter.invokeProviderInSameClassLoader(ForkedBooter.java:200)
at org.apache.maven.surefire.booter.ForkedBooter.runSuitesInProcess(ForkedBooter.java:153)
at org.apache.maven.surefire.booter.ForkedBooter.main(ForkedBooter.java:103)
org.apache.tajo.storage.pgsql.TestPgSQLEndPointTests Time elapsed: 0 sec <<< ERROR!
java.lang.NullPointerException: null
at org.apache.tajo.QueryTestCaseBase.tearDownClass(QueryTestCaseBase.java:231)
at sun.reflect.NativeMethodAccessorImpl.invoke0(Native Method)
at sun.reflect.NativeMethodAccessorImpl.invoke(NativeMethodAccessorImpl.java:57)
at sun.reflect.DelegatingMethodAccessorImpl.invoke(DelegatingMethodAccessorImpl.java:43)
at java.lang.reflect.Method.invoke(Method.java:606)
at org.junit.runners.model.FrameworkMethod$1.runReflectiveCall(FrameworkMethod.java:47)
at org.junit.internal.runners.model.ReflectiveCallable.run(ReflectiveCallable.java:12)
at org.junit.runners.model.FrameworkMethod.invokeExplosively(FrameworkMethod.java:44)
at org.junit.internal.runners.statements.RunAfters.evaluate(RunAfters.java:33)
at org.junit.runners.ParentRunner.run(ParentRunner.java:309)
at org.apache.maven.surefire.junit4.JUnit4Provider.execute(JUnit4Provider.java:264)
at org.apache.maven.surefire.junit4.JUnit4Provider.executeTestSet(JUnit4Provider.java:153)
at org.apache.maven.surefire.junit4.JUnit4Provider.invoke(JUnit4Provider.java:124)
at org.apache.maven.surefire.booter.ForkedBooter.invokeProviderInSameClassLoader(ForkedBooter.java:200)
at org.apache.maven.surefire.booter.ForkedBooter.runSuitesInProcess(ForkedBooter.java:153)
at org.apache.maven.surefire.booter.ForkedBooter.main(ForkedBooter.java:103)
Running org.apache.tajo.storage.pgsql.TestPgSQLMetadataProvider
Tests run: 1, Failures: 0, Errors: 1, Skipped: 0, Time elapsed: 0 sec <<< FAILURE! - in org.apache.tajo.storage.pgsql.TestPgSQLMetadataProvider
org.apache.tajo.storage.pgsql.TestPgSQLMetadataProvider Time elapsed: 0 sec <<< ERROR!
java.lang.NoClassDefFoundError: Could not initialize class org.apache.tajo.storage.pgsql.PgSQLTestServer
at org.apache.tajo.storage.pgsql.TestPgSQLMetadataProvider.<clinit>(TestPgSQLMetadataProvider.java:34)
Running org.apache.tajo.storage.pgsql.TestPgSQLQueryTests
2015-11-24 06:35:26,927 INFO: org.apache.tajo.session.SessionManager (createSession(79)) - Session 70195728-b051-4219-8681-c6ac36ddd4a0 is created.
Tests run: 2, Failures: 0, Errors: 2, Skipped: 0, Time elapsed: 0 sec <<< FAILURE! - in org.apache.tajo.storage.pgsql.TestPgSQLQueryTests
org.apache.tajo.storage.pgsql.TestPgSQLQueryTests Time elapsed: 0 sec <<< ERROR!
java.lang.NoClassDefFoundError: Could not initialize class org.apache.tajo.storage.pgsql.PgSQLTestServer
at org.apache.tajo.storage.pgsql.TestPgSQLQueryTests.<clinit>(TestPgSQLQueryTests.java:35)
org.apache.tajo.storage.pgsql.TestPgSQLQueryTests Time elapsed: 0 sec <<< ERROR!
java.lang.NullPointerException: null
at org.apache.tajo.QueryTestCaseBase.tearDownClass(QueryTestCaseBase.java:231)
at sun.reflect.NativeMethodAccessorImpl.invoke0(Native Method)
at sun.reflect.NativeMethodAccessorImpl.invoke(NativeMethodAccessorImpl.java:57)
at sun.reflect.DelegatingMethodAccessorImpl.invoke(DelegatingMethodAccessorImpl.java:43)
at java.lang.reflect.Method.invoke(Method.java:606)
at org.junit.runners.model.FrameworkMethod$1.runReflectiveCall(FrameworkMethod.java:47)
at org.junit.internal.runners.model.ReflectiveCallable.run(ReflectiveCallable.java:12)
at org.junit.runners.model.FrameworkMethod.invokeExplosively(FrameworkMethod.java:44)
at org.junit.internal.runners.statements.RunAfters.evaluate(RunAfters.java:33)
at org.junit.runners.ParentRunner.run(ParentRunner.java:309)
at org.apache.maven.surefire.junit4.JUnit4Provider.execute(JUnit4Provider.java:264)
at org.apache.maven.surefire.junit4.JUnit4Provider.executeTestSet(JUnit4Provider.java:153)
at org.apache.maven.surefire.junit4.JUnit4Provider.invoke(JUnit4Provider.java:124)
at org.apache.maven.surefire.booter.ForkedBooter.invokeProviderInSameClassLoader(ForkedBooter.java:200)
at org.apache.maven.surefire.booter.ForkedBooter.runSuitesInProcess(ForkedBooter.java:153)
at org.apache.maven.surefire.booter.ForkedBooter.main(ForkedBooter.java:103)
2015-11-24 06:35:26,938 INFO: org.apache.tajo.worker.TajoWorker (run(569)) - ============================================
2015-11-24 06:35:26,938 INFO: org.apache.tajo.worker.TajoWorker (run(570)) - TajoWorker received SIGINT Signal
2015-11-24 06:35:26,938 INFO: org.apache.tajo.worker.TajoWorker (run(571)) - ============================================
2015-11-24 06:35:26,942 INFO: org.apache.tajo.util.history.HistoryWriter (run(275)) - HistoryWriter_asf909.gq1.ygridcore.net_16315 stopped.
2015-11-24 06:35:26,942 INFO: org.apache.tajo.util.history.HistoryCleaner (run(136)) - History cleaner stopped
2015-11-24 06:35:26,952 INFO: org.apache.tajo.worker.NodeStatusUpdater (run(261)) - Heartbeat Thread stopped.
2015-11-24 06:35:26,951 INFO: org.apache.tajo.worker.NodeStatusUpdater (serviceStop(113)) - NodeStatusUpdater stopped.
2015-11-24 06:35:26,954 INFO: org.apache.tajo.rpc.NettyServerBase (shutdown(171)) - Rpc (QueryMasterProtocol) listened on 0:0:0:0:0:0:0:0:16317) shutdown
2015-11-24 06:35:26,955 INFO: org.apache.tajo.querymaster.QueryMasterManagerService (serviceStop(106)) - QueryMasterManagerService stopped
2015-11-24 06:35:26,956 INFO: org.apache.tajo.querymaster.QueryMaster (run(428)) - QueryMaster heartbeat thread stopped
2015-11-24 06:35:26,956 INFO: org.apache.tajo.querymaster.QueryMaster (serviceStop(164)) - QueryMaster stopped
2015-11-24 06:35:26,957 INFO: org.apache.tajo.worker.TajoWorkerClientService (stop(98)) - TajoWorkerClientService stopping
2015-11-24 06:35:26,957 INFO: org.apache.tajo.rpc.NettyServerBase (shutdown(171)) - Rpc (QueryMasterClientProtocol) listened on 0:0:0:0:0:0:0:0:16316) shutdown
2015-11-24 06:35:26,957 INFO: org.apache.tajo.worker.TajoWorkerClientService (stop(102)) - TajoWorkerClientService stopped
2015-11-24 06:35:26,958 INFO: org.apache.tajo.rpc.NettyServerBase (shutdown(171)) - Rpc (TajoWorkerProtocol) listened on 0:0:0:0:0:0:0:0:16315) shutdown
2015-11-24 06:35:26,958 INFO: org.apache.tajo.worker.TajoWorkerManagerService (serviceStop(93)) - TajoWorkerManagerService stopped
2015-11-24 06:35:26,959 INFO: org.apache.tajo.worker.TajoWorker (serviceStop(379)) - TajoWorker main thread exiting
2015-11-24 06:35:29,168 INFO: org.apache.tajo.master.TajoMaster (run(580)) - ============================================
2015-11-24 06:35:29,168 INFO: org.apache.tajo.master.TajoMaster (run(581)) - TajoMaster received SIGINT Signal
2015-11-24 06:35:29,168 INFO: org.apache.tajo.master.TajoMaster (run(582)) - ============================================
2015-11-24 06:35:29,170 INFO: org.apache.tajo.rpc.NettyServerBase (shutdown(171)) - Rpc (Tajo-REST) listened on 0:0:0:0:0:0:0:0:16314) shutdown
2015-11-24 06:35:29,170 INFO: org.apache.tajo.ws.rs.TajoRestService (serviceStop(129)) - Tajo Rest Service stopped.
2015-11-24 06:35:29,171 INFO: org.apache.tajo.util.history.HistoryWriter (run(275)) - HistoryWriter_127.0.0.1_16313 stopped.
2015-11-24 06:35:29,171 INFO: org.apache.tajo.util.history.HistoryCleaner (run(136)) - History cleaner stopped
2015-11-24 06:35:29,172 INFO: org.apache.tajo.rpc.NettyServerBase (shutdown(171)) - Rpc (QueryCoordinatorProtocol) listened on 127.0.0.1:16313) shutdown
2015-11-24 06:35:29,175 INFO: org.apache.tajo.rpc.NettyServerBase (shutdown(171)) - Rpc (TajoMasterClientProtocol) listened on 127.0.0.1:16312) shutdown
2015-11-24 06:35:29,180 INFO: org.apache.tajo.catalog.CatalogServer (serviceStop(188)) - Catalog Server (127.0.0.1:16311) shutdown
2015-11-24 06:35:29,180 INFO: org.apache.tajo.rpc.NettyServerBase (shutdown(171)) - Rpc (CatalogProtocol) listened on 127.0.0.1:16311) shutdown
2015-11-24 06:35:29,183 INFO: org.apache.tajo.catalog.store.DerbyStore (close(2901)) - Close database (jdbc:derby:memory:<https://builds.apache.org/job/Tajo-0.11.1-build/ws/tajo-storage/tajo-storage-pgsql/target/test-data/fa491abf-7c96-4b0b-be1f-d2d8a171ad6f/db;create=true)>
2015-11-24 06:35:29,184 INFO: org.apache.tajo.rpc.NettyServerBase (shutdown(171)) - Rpc (TajoResourceTrackerProtocol) listened on 127.0.0.1:16310) shutdown
2015-11-24 06:35:29,184 INFO: org.apache.tajo.master.TajoMaster (serviceStop(440)) - Tajo Master main thread exiting
2015-11-24 06:35:29,212 INFO: org.apache.tajo.catalog.store.DerbyStore (shutdown(68)) - Derby shutdown complete normally.
2015-11-24 06:35:29,213 INFO: org.apache.tajo.catalog.store.DerbyStore (shutdown(75)) - Shutdown database
Results :
Tests in error:
TestPgSQLJdbcTableSpace.<clinit>:44 ExceptionInInitializer
TestPgSQLJdbcTableSpace.testConnPropertiesNegative » NoClassDefFound Could not...
TestPgSQLJdbcTableSpace.testConnProperties » NoClassDefFound Could not initial...
TestPgSQLJdbcTableSpace.testDropTable » NoClassDefFound Could not initialize c...
TestPgSQLJdbcTableSpace.testTemporaryTablespace » NoClassDefFound Could not in...
TestPgSQLJdbcTableSpace.testTablespaceHandler » NoClassDefFound Could not init...
TestPgSQLJdbcTableSpace.testGetSplits » NoClassDefFound Could not initialize c...
TestPgSQLSimpleQueryTests.<clinit>:26 NoClassDefFound Could not initialize cla...
TestPgSQLSimpleQueryTests>QueryTestCaseBase.tearDownClass:231 » NullPointer
TestPgSQLEndPointTests.<clinit>:36 NoClassDefFound Could not initialize class ...
TestPgSQLEndPointTests.org.apache.tajo.storage.pgsql.TestPgSQLEndPointTests » NoClassDefFound
TestPgSQLEndPointTests>QueryTestCaseBase.tearDownClass:231 » NullPointer
TestPgSQLMetadataProvider.<clinit>:34 NoClassDefFound Could not initialize cla...
TestPgSQLQueryTests.<clinit>:35 NoClassDefFound Could not initialize class org...
TestPgSQLQueryTests>QueryTestCaseBase.tearDownClass:231 » NullPointer
Tests run: 15, Failures: 0, Errors: 15, Skipped: 0
[INFO] ------------------------------------------------------------------------
[INFO] Reactor Summary:
[INFO]
[INFO] Tajo Main ......................................... SUCCESS [ 3.473 s]
[INFO] Tajo Project POM .................................. SUCCESS [ 2.691 s]
[INFO] Tajo Maven Plugins ................................ SUCCESS [ 4.677 s]
[INFO] Tajo Common ....................................... SUCCESS [ 52.960 s]
[INFO] Tajo Algebra ...................................... SUCCESS [ 4.268 s]
[INFO] Tajo Catalog Common ............................... SUCCESS [ 6.954 s]
[INFO] Tajo Plan ......................................... SUCCESS [ 8.381 s]
[INFO] Tajo Rpc Common ................................... SUCCESS [ 4.639 s]
[INFO] Tajo Protocol Buffer Rpc .......................... SUCCESS [02:32 min]
[INFO] Tajo Catalog Client ............................... SUCCESS [ 1.774 s]
[INFO] Tajo Catalog Server ............................... SUCCESS [01:11 min]
[INFO] Tajo Storage Common ............................... SUCCESS [ 4.030 s]
[INFO] Tajo HDFS Storage ................................. SUCCESS [09:34 min]
[INFO] Tajo PullServer ................................... SUCCESS [ 2.150 s]
[INFO] Tajo Client ....................................... SUCCESS [ 2.967 s]
[INFO] Tajo CLI tools .................................... SUCCESS [ 3.448 s]
[INFO] Tajo SQL Parser ................................... SUCCESS [ 8.097 s]
[INFO] ASM (thirdparty) .................................. SUCCESS [ 2.492 s]
[INFO] Tajo RESTful Container ............................ SUCCESS [ 6.519 s]
[INFO] Tajo Metrics ...................................... SUCCESS [ 1.590 s]
[INFO] Tajo Core ......................................... SUCCESS [ 8.597 s]
[INFO] Tajo RPC .......................................... SUCCESS [ 0.977 s]
[INFO] Tajo Catalog Drivers Hive ......................... SUCCESS [ 37.083 s]
[INFO] Tajo Catalog Drivers .............................. SUCCESS [ 0.171 s]
[INFO] Tajo Catalog ...................................... SUCCESS [ 1.184 s]
[INFO] Tajo Client Example ............................... SUCCESS [ 1.307 s]
[INFO] Tajo HBase Storage ................................ SUCCESS [ 6.863 s]
[INFO] Tajo Cluster Tests ................................ SUCCESS [ 3.960 s]
[INFO] Tajo JDBC Driver .................................. SUCCESS [ 47.140 s]
[INFO] Tajo JDBC storage common .......................... SUCCESS [ 0.998 s]
[INFO] Tajo PostgreSQL JDBC storage ...................... FAILURE [ 21.991 s]
[INFO] Tajo Storage ...................................... SKIPPED
[INFO] Tajo Distribution ................................. SKIPPED
[INFO] Tajo Core Tests ................................... SKIPPED
[INFO] ------------------------------------------------------------------------
[INFO] BUILD FAILURE
[INFO] ------------------------------------------------------------------------
[INFO] Total time: 17:30 min
[INFO] Finished at: 2015-11-24T06:35:29+00:00
[INFO] Final Memory: 139M/957M
[INFO] ------------------------------------------------------------------------
[ERROR] Failed to execute goal org.apache.maven.plugins:maven-surefire-plugin:2.17:test (default-test) on project tajo-storage-pgsql: There are test failures.
[ERROR]
[ERROR] Please refer to <https://builds.apache.org/job/Tajo-0.11.1-build/ws/tajo-storage/tajo-storage-pgsql/target/surefire-reports> for the individual test results.
[ERROR] -> [Help 1]
[ERROR]
[ERROR] To see the full stack trace of the errors, re-run Maven with the -e switch.
[ERROR] Re-run Maven using the -X switch to enable full debug logging.
[ERROR]
[ERROR] For more information about the errors and possible solutions, please read the following articles:
[ERROR] [Help 1] http://cwiki.apache.org/confluence/display/MAVEN/MojoFailureException
[ERROR]
[ERROR] After correcting the problems, you can resume the build with the command
[ERROR] mvn <goals> -rf :tajo-storage-pgsql
Build step 'Execute shell' marked build as failure
Archiving artifacts
Jenkins build is back to normal : Tajo-0.11.1-build #111
Posted by Apache Jenkins Server <je...@builds.apache.org>.
See <https://builds.apache.org/job/Tajo-0.11.1-build/111/>