You are viewing a plain text version of this content. The canonical link for it is here.
Posted to builds@solr.apache.org by Apache Jenkins Server <je...@builds.apache.org> on 2024/06/30 03:32:33 UTC
[JENKINS] Solr » Solr-NightlyTests-main - Build # 1173 - Still Unstable!
Build: https://ci-builds.apache.org/job/Solr/job/Solr-NightlyTests-main/1173/
5 tests failed.
FAILED: org.apache.solr.client.solrj.TestLBHttp2SolrClient.testTwoServers
Error Message:
org.apache.solr.client.solrj.SolrServerException: Timeout occurred while waiting response from server at: https://127.0.0.1:44623/solr/collection1/select
Stack Trace:
org.apache.solr.client.solrj.SolrServerException: Timeout occurred while waiting response from server at: https://127.0.0.1:44623/solr/collection1/select
at __randomizedtesting.SeedInfo.seed([9CE9656C9E3D1BC1:3C03CBE1457635E1]:0)
at app//org.apache.solr.client.solrj.impl.Http2SolrClient.request(Http2SolrClient.java:511)
at app//org.apache.solr.client.solrj.impl.LBSolrClient.request(LBSolrClient.java:724)
at app//org.apache.solr.client.solrj.impl.LBSolrClient.request(LBSolrClient.java:659)
at app//org.apache.solr.client.solrj.SolrRequest.process(SolrRequest.java:229)
at app//org.apache.solr.client.solrj.SolrClient.query(SolrClient.java:927)
at app//org.apache.solr.client.solrj.SolrClient.query(SolrClient.java:940)
at app//org.apache.solr.client.solrj.TestLBHttp2SolrClient.testTwoServers(TestLBHttp2SolrClient.java:195)
at java.base@11.0.16.1/jdk.internal.reflect.NativeMethodAccessorImpl.invoke0(Native Method)
at java.base@11.0.16.1/jdk.internal.reflect.NativeMethodAccessorImpl.invoke(NativeMethodAccessorImpl.java:62)
at java.base@11.0.16.1/jdk.internal.reflect.DelegatingMethodAccessorImpl.invoke(DelegatingMethodAccessorImpl.java:43)
at java.base@11.0.16.1/java.lang.reflect.Method.invoke(Method.java:566)
at app//com.carrotsearch.randomizedtesting.RandomizedRunner.invoke(RandomizedRunner.java:1758)
at app//com.carrotsearch.randomizedtesting.RandomizedRunner$8.evaluate(RandomizedRunner.java:946)
at app//com.carrotsearch.randomizedtesting.RandomizedRunner$9.evaluate(RandomizedRunner.java:982)
at app//com.carrotsearch.randomizedtesting.RandomizedRunner$10.evaluate(RandomizedRunner.java:996)
at app//com.carrotsearch.randomizedtesting.rules.SystemPropertiesRestoreRule$1.evaluate(SystemPropertiesRestoreRule.java:80)
at app//org.junit.rules.RunRules.evaluate(RunRules.java:20)
at app//org.apache.lucene.tests.util.TestRuleSetupTeardownChained$1.evaluate(TestRuleSetupTeardownChained.java:48)
at app//org.apache.lucene.tests.util.AbstractBeforeAfterRule$1.evaluate(AbstractBeforeAfterRule.java:43)
at app//org.apache.lucene.tests.util.TestRuleThreadAndTestName$1.evaluate(TestRuleThreadAndTestName.java:45)
at app//org.apache.lucene.tests.util.TestRuleIgnoreAfterMaxFailures$1.evaluate(TestRuleIgnoreAfterMaxFailures.java:60)
at app//org.apache.lucene.tests.util.TestRuleMarkFailure$1.evaluate(TestRuleMarkFailure.java:44)
at app//org.junit.rules.RunRules.evaluate(RunRules.java:20)
at app//com.carrotsearch.randomizedtesting.rules.StatementAdapter.evaluate(StatementAdapter.java:36)
at app//com.carrotsearch.randomizedtesting.ThreadLeakControl$StatementRunner.run(ThreadLeakControl.java:390)
at app//com.carrotsearch.randomizedtesting.ThreadLeakControl.forkTimeoutingTask(ThreadLeakControl.java:843)
at app//com.carrotsearch.randomizedtesting.ThreadLeakControl$3.evaluate(ThreadLeakControl.java:490)
at app//com.carrotsearch.randomizedtesting.RandomizedRunner.runSingleTest(RandomizedRunner.java:955)
at app//com.carrotsearch.randomizedtesting.RandomizedRunner$5.evaluate(RandomizedRunner.java:840)
at app//com.carrotsearch.randomizedtesting.RandomizedRunner$6.evaluate(RandomizedRunner.java:891)
at app//com.carrotsearch.randomizedtesting.RandomizedRunner$7.evaluate(RandomizedRunner.java:902)
at app//com.carrotsearch.randomizedtesting.rules.StatementAdapter.evaluate(StatementAdapter.java:36)
at app//com.carrotsearch.randomizedtesting.rules.StatementAdapter.evaluate(StatementAdapter.java:36)
at app//org.apache.lucene.tests.util.AbstractBeforeAfterRule$1.evaluate(AbstractBeforeAfterRule.java:43)
at app//com.carrotsearch.randomizedtesting.rules.SystemPropertiesRestoreRule$1.evaluate(SystemPropertiesRestoreRule.java:80)
at app//org.junit.rules.RunRules.evaluate(RunRules.java:20)
at app//org.apache.lucene.tests.util.AbstractBeforeAfterRule$1.evaluate(AbstractBeforeAfterRule.java:43)
at app//com.carrotsearch.randomizedtesting.rules.StatementAdapter.evaluate(StatementAdapter.java:36)
at app//org.apache.lucene.tests.util.TestRuleStoreClassName$1.evaluate(TestRuleStoreClassName.java:38)
at app//com.carrotsearch.randomizedtesting.rules.NoShadowingOrOverridesOnMethodsRule$1.evaluate(NoShadowingOrOverridesOnMethodsRule.java:40)
at app//com.carrotsearch.randomizedtesting.rules.NoShadowingOrOverridesOnMethodsRule$1.evaluate(NoShadowingOrOverridesOnMethodsRule.java:40)
at app//com.carrotsearch.randomizedtesting.rules.StatementAdapter.evaluate(StatementAdapter.java:36)
at app//com.carrotsearch.randomizedtesting.rules.StatementAdapter.evaluate(StatementAdapter.java:36)
at app//org.apache.lucene.tests.util.TestRuleAssertionsRequired$1.evaluate(TestRuleAssertionsRequired.java:53)
at app//org.apache.lucene.tests.util.AbstractBeforeAfterRule$1.evaluate(AbstractBeforeAfterRule.java:43)
at app//org.apache.lucene.tests.util.TestRuleMarkFailure$1.evaluate(TestRuleMarkFailure.java:44)
at app//org.apache.lucene.tests.util.TestRuleIgnoreAfterMaxFailures$1.evaluate(TestRuleIgnoreAfterMaxFailures.java:60)
at app//org.apache.lucene.tests.util.TestRuleIgnoreTestSuites$1.evaluate(TestRuleIgnoreTestSuites.java:47)
at app//org.junit.rules.RunRules.evaluate(RunRules.java:20)
at app//com.carrotsearch.randomizedtesting.rules.StatementAdapter.evaluate(StatementAdapter.java:36)
at app//com.carrotsearch.randomizedtesting.ThreadLeakControl$StatementRunner.run(ThreadLeakControl.java:390)
at app//com.carrotsearch.randomizedtesting.ThreadLeakControl.lambda$forkTimeoutingTask$0(ThreadLeakControl.java:850)
at java.base@11.0.16.1/java.lang.Thread.run(Thread.java:829)
Caused by: java.util.concurrent.TimeoutException
at org.eclipse.jetty.client.util.InputStreamResponseListener.get(InputStreamResponseListener.java:214)
at org.apache.solr.client.solrj.impl.Http2SolrClient.request(Http2SolrClient.java:502)
... 52 more
FAILED: org.apache.solr.cloud.api.collections.ShardSplitTest.testSplitStaticIndexReplicationLink
Error Message:
java.util.concurrent.TimeoutException: Timeout waiting to see state for collection=testSplitStaticIndexReplication_link :DocCollection(testSplitStaticIndexReplication_link//collections/testSplitStaticIndexReplication_link/state.json/16 )={
"pullReplicas":"0",
"configName":"conf1",
"replicationFactor":1,
"router":{"name":"compositeId"},
"nrtReplicas":1,
"tlogReplicas":"0",
"shards":{
"shard1":{
"range":"80000000-7fffffff",
"state":"inactive",
"stateTimestamp":"1719714645662620192",
"replicas":{"core_node2":{
"core":"testSplitStaticIndexReplication_link_shard1_replica_n1",
"node_name":"127.0.0.1:43379_solr",
"type":"NRT",
"state":"active",
"leader":"true",
"force_set_state":"false",
"base_url":"http://127.0.0.1:43379/solr"}}},
"shard1_0":{
"range":"80000000-ffffffff",
"state":"active",
"stateTimestamp":"1719714645662604443",
"replicas":{
"core_node5":{
"core":"testSplitStaticIndexReplication_link_shard1_0_replica_n3",
"node_name":"127.0.0.1:43379_solr",
"type":"NRT",
"state":"active",
"leader":"true",
"force_set_state":"false",
"base_url":"http://127.0.0.1:43379/solr"},
"core_node8":{
"core":"testSplitStaticIndexReplication_link_shard1_0_replica_n7",
"node_name":"127.0.0.1:35733_solr",
"type":"NRT",
"state":"active",
"force_set_state":"false",
"base_url":"http://127.0.0.1:35733/solr"}}},
"shard1_1":{
"range":"0-7fffffff",
"state":"active",
"stateTimestamp":"1719714645662574071",
"replicas":{"core_node6":{
"core":"testSplitStaticIndexReplication_link_shard1_1_replica_n4",
"node_name":"127.0.0.1:43379_solr",
"type":"NRT",
"state":"active",
"leader":"true",
"force_set_state":"false",
"base_url":"http://127.0.0.1:43379/solr"}}}}}
Stack Trace:
java.util.concurrent.TimeoutException: Timeout waiting to see state for collection=testSplitStaticIndexReplication_link :DocCollection(testSplitStaticIndexReplication_link//collections/testSplitStaticIndexReplication_link/state.json/16 )={
"pullReplicas":"0",
"configName":"conf1",
"replicationFactor":1,
"router":{"name":"compositeId"},
"nrtReplicas":1,
"tlogReplicas":"0",
"shards":{
"shard1":{
"range":"80000000-7fffffff",
"state":"inactive",
"stateTimestamp":"1719714645662620192",
"replicas":{"core_node2":{
"core":"testSplitStaticIndexReplication_link_shard1_replica_n1",
"node_name":"127.0.0.1:43379_solr",
"type":"NRT",
"state":"active",
"leader":"true",
"force_set_state":"false",
"base_url":"http://127.0.0.1:43379/solr"}}},
"shard1_0":{
"range":"80000000-ffffffff",
"state":"active",
"stateTimestamp":"1719714645662604443",
"replicas":{
"core_node5":{
"core":"testSplitStaticIndexReplication_link_shard1_0_replica_n3",
"node_name":"127.0.0.1:43379_solr",
"type":"NRT",
"state":"active",
"leader":"true",
"force_set_state":"false",
"base_url":"http://127.0.0.1:43379/solr"},
"core_node8":{
"core":"testSplitStaticIndexReplication_link_shard1_0_replica_n7",
"node_name":"127.0.0.1:35733_solr",
"type":"NRT",
"state":"active",
"force_set_state":"false",
"base_url":"http://127.0.0.1:35733/solr"}}},
"shard1_1":{
"range":"0-7fffffff",
"state":"active",
"stateTimestamp":"1719714645662574071",
"replicas":{"core_node6":{
"core":"testSplitStaticIndexReplication_link_shard1_1_replica_n4",
"node_name":"127.0.0.1:43379_solr",
"type":"NRT",
"state":"active",
"leader":"true",
"force_set_state":"false",
"base_url":"http://127.0.0.1:43379/solr"}}}}}
at __randomizedtesting.SeedInfo.seed([9CE9656C9E3D1BC1:67D19B825BA1B2CD]:0)
at org.apache.solr.common.cloud.ZkStateReader.waitForState(ZkStateReader.java:1884)
at org.apache.solr.cloud.api.collections.ShardSplitTest.doSplitStaticIndexReplication(ShardSplitTest.java:252)
at org.apache.solr.cloud.api.collections.ShardSplitTest.testSplitStaticIndexReplicationLink(ShardSplitTest.java:131)
at java.base/jdk.internal.reflect.NativeMethodAccessorImpl.invoke0(Native Method)
at java.base/jdk.internal.reflect.NativeMethodAccessorImpl.invoke(NativeMethodAccessorImpl.java:62)
at java.base/jdk.internal.reflect.DelegatingMethodAccessorImpl.invoke(DelegatingMethodAccessorImpl.java:43)
at java.base/java.lang.reflect.Method.invoke(Method.java:566)
at com.carrotsearch.randomizedtesting.RandomizedRunner.invoke(RandomizedRunner.java:1758)
at com.carrotsearch.randomizedtesting.RandomizedRunner$8.evaluate(RandomizedRunner.java:946)
at com.carrotsearch.randomizedtesting.RandomizedRunner$9.evaluate(RandomizedRunner.java:982)
at com.carrotsearch.randomizedtesting.RandomizedRunner$10.evaluate(RandomizedRunner.java:996)
at org.apache.solr.BaseDistributedSearchTestCase$ShardsRepeatRule$ShardsFixedStatement.callStatement(BaseDistributedSearchTestCase.java:1069)
at org.apache.solr.BaseDistributedSearchTestCase$ShardsRepeatRule$ShardsStatement.evaluate(BaseDistributedSearchTestCase.java:1040)
at com.carrotsearch.randomizedtesting.rules.SystemPropertiesRestoreRule$1.evaluate(SystemPropertiesRestoreRule.java:80)
at org.junit.rules.RunRules.evaluate(RunRules.java:20)
at org.apache.lucene.tests.util.TestRuleSetupTeardownChained$1.evaluate(TestRuleSetupTeardownChained.java:48)
at org.apache.lucene.tests.util.AbstractBeforeAfterRule$1.evaluate(AbstractBeforeAfterRule.java:43)
at org.apache.lucene.tests.util.TestRuleThreadAndTestName$1.evaluate(TestRuleThreadAndTestName.java:45)
at org.apache.lucene.tests.util.TestRuleIgnoreAfterMaxFailures$1.evaluate(TestRuleIgnoreAfterMaxFailures.java:60)
at org.apache.lucene.tests.util.TestRuleMarkFailure$1.evaluate(TestRuleMarkFailure.java:44)
at org.junit.rules.RunRules.evaluate(RunRules.java:20)
at com.carrotsearch.randomizedtesting.rules.StatementAdapter.evaluate(StatementAdapter.java:36)
at com.carrotsearch.randomizedtesting.ThreadLeakControl$StatementRunner.run(ThreadLeakControl.java:390)
at com.carrotsearch.randomizedtesting.ThreadLeakControl.forkTimeoutingTask(ThreadLeakControl.java:843)
at com.carrotsearch.randomizedtesting.ThreadLeakControl$3.evaluate(ThreadLeakControl.java:490)
at com.carrotsearch.randomizedtesting.RandomizedRunner.runSingleTest(RandomizedRunner.java:955)
at com.carrotsearch.randomizedtesting.RandomizedRunner$5.evaluate(RandomizedRunner.java:840)
at com.carrotsearch.randomizedtesting.RandomizedRunner$6.evaluate(RandomizedRunner.java:891)
at com.carrotsearch.randomizedtesting.RandomizedRunner$7.evaluate(RandomizedRunner.java:902)
at com.carrotsearch.randomizedtesting.rules.StatementAdapter.evaluate(StatementAdapter.java:36)
at com.carrotsearch.randomizedtesting.rules.StatementAdapter.evaluate(StatementAdapter.java:36)
at org.apache.lucene.tests.util.AbstractBeforeAfterRule$1.evaluate(AbstractBeforeAfterRule.java:43)
at com.carrotsearch.randomizedtesting.rules.SystemPropertiesRestoreRule$1.evaluate(SystemPropertiesRestoreRule.java:80)
at org.junit.rules.RunRules.evaluate(RunRules.java:20)
at org.apache.lucene.tests.util.AbstractBeforeAfterRule$1.evaluate(AbstractBeforeAfterRule.java:43)
at com.carrotsearch.randomizedtesting.rules.StatementAdapter.evaluate(StatementAdapter.java:36)
at org.apache.lucene.tests.util.TestRuleStoreClassName$1.evaluate(TestRuleStoreClassName.java:38)
at com.carrotsearch.randomizedtesting.rules.NoShadowingOrOverridesOnMethodsRule$1.evaluate(NoShadowingOrOverridesOnMethodsRule.java:40)
at com.carrotsearch.randomizedtesting.rules.NoShadowingOrOverridesOnMethodsRule$1.evaluate(NoShadowingOrOverridesOnMethodsRule.java:40)
at com.carrotsearch.randomizedtesting.rules.StatementAdapter.evaluate(StatementAdapter.java:36)
at com.carrotsearch.randomizedtesting.rules.StatementAdapter.evaluate(StatementAdapter.java:36)
at org.apache.lucene.tests.util.TestRuleAssertionsRequired$1.evaluate(TestRuleAssertionsRequired.java:53)
at org.apache.lucene.tests.util.AbstractBeforeAfterRule$1.evaluate(AbstractBeforeAfterRule.java:43)
at org.apache.lucene.tests.util.TestRuleMarkFailure$1.evaluate(TestRuleMarkFailure.java:44)
at org.apache.lucene.tests.util.TestRuleIgnoreAfterMaxFailures$1.evaluate(TestRuleIgnoreAfterMaxFailures.java:60)
at org.apache.lucene.tests.util.TestRuleIgnoreTestSuites$1.evaluate(TestRuleIgnoreTestSuites.java:47)
at org.junit.rules.RunRules.evaluate(RunRules.java:20)
at com.carrotsearch.randomizedtesting.rules.StatementAdapter.evaluate(StatementAdapter.java:36)
at com.carrotsearch.randomizedtesting.ThreadLeakControl$StatementRunner.run(ThreadLeakControl.java:390)
at com.carrotsearch.randomizedtesting.ThreadLeakControl.lambda$forkTimeoutingTask$0(ThreadLeakControl.java:850)
at java.base/java.lang.Thread.run(Thread.java:829)
FAILED: org.apache.solr.cloud.api.collections.ShardSplitTest.testSplitStaticIndexReplication
Error Message:
java.util.concurrent.TimeoutException: Timeout waiting to see state for collection=testSplitStaticIndexReplication_rewrite :DocCollection(testSplitStaticIndexReplication_rewrite//collections/testSplitStaticIndexReplication_rewrite/state.json/18 )={
"pullReplicas":"0",
"configName":"conf1",
"replicationFactor":1,
"router":{"name":"compositeId"},
"nrtReplicas":1,
"tlogReplicas":"0",
"shards":{
"shard1":{
"range":"80000000-7fffffff",
"state":"inactive",
"stateTimestamp":"1719714799679540170",
"replicas":{"core_node2":{
"core":"testSplitStaticIndexReplication_rewrite_shard1_replica_n1",
"node_name":"127.0.0.1:44573_solr",
"type":"NRT",
"state":"active",
"leader":"true",
"force_set_state":"false",
"base_url":"http://127.0.0.1:44573/solr"}}},
"shard1_0":{
"range":"80000000-ffffffff",
"state":"active",
"stateTimestamp":"1719714799679526517",
"replicas":{
"core_node5":{
"core":"testSplitStaticIndexReplication_rewrite_shard1_0_replica_n3",
"node_name":"127.0.0.1:44573_solr",
"type":"NRT",
"state":"active",
"leader":"true",
"force_set_state":"false",
"base_url":"http://127.0.0.1:44573/solr"},
"core_node8":{
"core":"testSplitStaticIndexReplication_rewrite_shard1_0_replica_n7",
"node_name":"127.0.0.1:33393_solr",
"type":"NRT",
"state":"active",
"force_set_state":"false",
"base_url":"http://127.0.0.1:33393/solr"}}},
"shard1_1":{
"range":"0-7fffffff",
"state":"active",
"stateTimestamp":"1719714799679493919",
"replicas":{"core_node6":{
"core":"testSplitStaticIndexReplication_rewrite_shard1_1_replica_n4",
"node_name":"127.0.0.1:44573_solr",
"type":"NRT",
"state":"active",
"leader":"true",
"force_set_state":"false",
"base_url":"http://127.0.0.1:44573/solr"}}}}}
Stack Trace:
java.util.concurrent.TimeoutException: Timeout waiting to see state for collection=testSplitStaticIndexReplication_rewrite :DocCollection(testSplitStaticIndexReplication_rewrite//collections/testSplitStaticIndexReplication_rewrite/state.json/18 )={
"pullReplicas":"0",
"configName":"conf1",
"replicationFactor":1,
"router":{"name":"compositeId"},
"nrtReplicas":1,
"tlogReplicas":"0",
"shards":{
"shard1":{
"range":"80000000-7fffffff",
"state":"inactive",
"stateTimestamp":"1719714799679540170",
"replicas":{"core_node2":{
"core":"testSplitStaticIndexReplication_rewrite_shard1_replica_n1",
"node_name":"127.0.0.1:44573_solr",
"type":"NRT",
"state":"active",
"leader":"true",
"force_set_state":"false",
"base_url":"http://127.0.0.1:44573/solr"}}},
"shard1_0":{
"range":"80000000-ffffffff",
"state":"active",
"stateTimestamp":"1719714799679526517",
"replicas":{
"core_node5":{
"core":"testSplitStaticIndexReplication_rewrite_shard1_0_replica_n3",
"node_name":"127.0.0.1:44573_solr",
"type":"NRT",
"state":"active",
"leader":"true",
"force_set_state":"false",
"base_url":"http://127.0.0.1:44573/solr"},
"core_node8":{
"core":"testSplitStaticIndexReplication_rewrite_shard1_0_replica_n7",
"node_name":"127.0.0.1:33393_solr",
"type":"NRT",
"state":"active",
"force_set_state":"false",
"base_url":"http://127.0.0.1:33393/solr"}}},
"shard1_1":{
"range":"0-7fffffff",
"state":"active",
"stateTimestamp":"1719714799679493919",
"replicas":{"core_node6":{
"core":"testSplitStaticIndexReplication_rewrite_shard1_1_replica_n4",
"node_name":"127.0.0.1:44573_solr",
"type":"NRT",
"state":"active",
"leader":"true",
"force_set_state":"false",
"base_url":"http://127.0.0.1:44573/solr"}}}}}
at __randomizedtesting.SeedInfo.seed([9CE9656C9E3D1BC1:D6A3F16C0F9534C4]:0)
at org.apache.solr.common.cloud.ZkStateReader.waitForState(ZkStateReader.java:1884)
at org.apache.solr.cloud.api.collections.ShardSplitTest.doSplitStaticIndexReplication(ShardSplitTest.java:252)
at org.apache.solr.cloud.api.collections.ShardSplitTest.testSplitStaticIndexReplication(ShardSplitTest.java:126)
at java.base/jdk.internal.reflect.NativeMethodAccessorImpl.invoke0(Native Method)
at java.base/jdk.internal.reflect.NativeMethodAccessorImpl.invoke(NativeMethodAccessorImpl.java:62)
at java.base/jdk.internal.reflect.DelegatingMethodAccessorImpl.invoke(DelegatingMethodAccessorImpl.java:43)
at java.base/java.lang.reflect.Method.invoke(Method.java:566)
at com.carrotsearch.randomizedtesting.RandomizedRunner.invoke(RandomizedRunner.java:1758)
at com.carrotsearch.randomizedtesting.RandomizedRunner$8.evaluate(RandomizedRunner.java:946)
at com.carrotsearch.randomizedtesting.RandomizedRunner$9.evaluate(RandomizedRunner.java:982)
at com.carrotsearch.randomizedtesting.RandomizedRunner$10.evaluate(RandomizedRunner.java:996)
at org.apache.solr.BaseDistributedSearchTestCase$ShardsRepeatRule$ShardsFixedStatement.callStatement(BaseDistributedSearchTestCase.java:1069)
at org.apache.solr.BaseDistributedSearchTestCase$ShardsRepeatRule$ShardsStatement.evaluate(BaseDistributedSearchTestCase.java:1040)
at com.carrotsearch.randomizedtesting.rules.SystemPropertiesRestoreRule$1.evaluate(SystemPropertiesRestoreRule.java:80)
at org.junit.rules.RunRules.evaluate(RunRules.java:20)
at org.apache.lucene.tests.util.TestRuleSetupTeardownChained$1.evaluate(TestRuleSetupTeardownChained.java:48)
at org.apache.lucene.tests.util.AbstractBeforeAfterRule$1.evaluate(AbstractBeforeAfterRule.java:43)
at org.apache.lucene.tests.util.TestRuleThreadAndTestName$1.evaluate(TestRuleThreadAndTestName.java:45)
at org.apache.lucene.tests.util.TestRuleIgnoreAfterMaxFailures$1.evaluate(TestRuleIgnoreAfterMaxFailures.java:60)
at org.apache.lucene.tests.util.TestRuleMarkFailure$1.evaluate(TestRuleMarkFailure.java:44)
at org.junit.rules.RunRules.evaluate(RunRules.java:20)
at com.carrotsearch.randomizedtesting.rules.StatementAdapter.evaluate(StatementAdapter.java:36)
at com.carrotsearch.randomizedtesting.ThreadLeakControl$StatementRunner.run(ThreadLeakControl.java:390)
at com.carrotsearch.randomizedtesting.ThreadLeakControl.forkTimeoutingTask(ThreadLeakControl.java:843)
at com.carrotsearch.randomizedtesting.ThreadLeakControl$3.evaluate(ThreadLeakControl.java:490)
at com.carrotsearch.randomizedtesting.RandomizedRunner.runSingleTest(RandomizedRunner.java:955)
at com.carrotsearch.randomizedtesting.RandomizedRunner$5.evaluate(RandomizedRunner.java:840)
at com.carrotsearch.randomizedtesting.RandomizedRunner$6.evaluate(RandomizedRunner.java:891)
at com.carrotsearch.randomizedtesting.RandomizedRunner$7.evaluate(RandomizedRunner.java:902)
at com.carrotsearch.randomizedtesting.rules.StatementAdapter.evaluate(StatementAdapter.java:36)
at com.carrotsearch.randomizedtesting.rules.StatementAdapter.evaluate(StatementAdapter.java:36)
at org.apache.lucene.tests.util.AbstractBeforeAfterRule$1.evaluate(AbstractBeforeAfterRule.java:43)
at com.carrotsearch.randomizedtesting.rules.SystemPropertiesRestoreRule$1.evaluate(SystemPropertiesRestoreRule.java:80)
at org.junit.rules.RunRules.evaluate(RunRules.java:20)
at org.apache.lucene.tests.util.AbstractBeforeAfterRule$1.evaluate(AbstractBeforeAfterRule.java:43)
at com.carrotsearch.randomizedtesting.rules.StatementAdapter.evaluate(StatementAdapter.java:36)
at org.apache.lucene.tests.util.TestRuleStoreClassName$1.evaluate(TestRuleStoreClassName.java:38)
at com.carrotsearch.randomizedtesting.rules.NoShadowingOrOverridesOnMethodsRule$1.evaluate(NoShadowingOrOverridesOnMethodsRule.java:40)
at com.carrotsearch.randomizedtesting.rules.NoShadowingOrOverridesOnMethodsRule$1.evaluate(NoShadowingOrOverridesOnMethodsRule.java:40)
at com.carrotsearch.randomizedtesting.rules.StatementAdapter.evaluate(StatementAdapter.java:36)
at com.carrotsearch.randomizedtesting.rules.StatementAdapter.evaluate(StatementAdapter.java:36)
at org.apache.lucene.tests.util.TestRuleAssertionsRequired$1.evaluate(TestRuleAssertionsRequired.java:53)
at org.apache.lucene.tests.util.AbstractBeforeAfterRule$1.evaluate(AbstractBeforeAfterRule.java:43)
at org.apache.lucene.tests.util.TestRuleMarkFailure$1.evaluate(TestRuleMarkFailure.java:44)
at org.apache.lucene.tests.util.TestRuleIgnoreAfterMaxFailures$1.evaluate(TestRuleIgnoreAfterMaxFailures.java:60)
at org.apache.lucene.tests.util.TestRuleIgnoreTestSuites$1.evaluate(TestRuleIgnoreTestSuites.java:47)
at org.junit.rules.RunRules.evaluate(RunRules.java:20)
at com.carrotsearch.randomizedtesting.rules.StatementAdapter.evaluate(StatementAdapter.java:36)
at com.carrotsearch.randomizedtesting.ThreadLeakControl$StatementRunner.run(ThreadLeakControl.java:390)
at com.carrotsearch.randomizedtesting.ThreadLeakControl.lambda$forkTimeoutingTask$0(ThreadLeakControl.java:850)
at java.base/java.lang.Thread.run(Thread.java:829)
FAILED: org.apache.solr.cloud.api.collections.ShardSplitTest.testSplitMixedReplicaTypesLink
Error Message:
java.util.concurrent.TimeoutException: Timeout waiting to see state for collection=testSplitMixedReplicaTypes_link :DocCollection(testSplitMixedReplicaTypes_link//collections/testSplitMixedReplicaTypes_link/state.json/27 )={
"pullReplicas":2,
"configName":"conf1",
"replicationFactor":2,
"router":{"name":"compositeId"},
"nrtReplicas":2,
"tlogReplicas":0,
"shards":{
"shard1":{
"range":"80000000-7fffffff",
"state":"inactive",
"stateTimestamp":"1719714863363684909",
"replicas":{
"core_node3":{
"core":"testSplitMixedReplicaTypes_link_shard1_replica_p1",
"node_name":"127.0.0.1:44129_solr",
"type":"PULL",
"state":"active",
"force_set_state":"false",
"base_url":"http://127.0.0.1:44129/solr"},
"core_node5":{
"core":"testSplitMixedReplicaTypes_link_shard1_replica_p2",
"node_name":"127.0.0.1:38789_solr",
"type":"PULL",
"state":"active",
"force_set_state":"false",
"base_url":"http://127.0.0.1:38789/solr"},
"core_node7":{
"core":"testSplitMixedReplicaTypes_link_shard1_replica_n4",
"node_name":"127.0.0.1:42249_solr",
"type":"NRT",
"state":"active",
"leader":"true",
"force_set_state":"false",
"base_url":"http://127.0.0.1:42249/solr"},
"core_node8":{
"core":"testSplitMixedReplicaTypes_link_shard1_replica_n6",
"node_name":"127.0.0.1:34335_solr",
"type":"NRT",
"state":"active",
"force_set_state":"false",
"base_url":"http://127.0.0.1:34335/solr"}}},
"shard1_0":{
"range":"80000000-ffffffff",
"stateTimestamp":"1719714863363669799",
"state":"active",
"replicas":{
"core_node11":{
"core":"testSplitMixedReplicaTypes_link_shard1_0_replica_n9",
"node_name":"127.0.0.1:42249_solr",
"type":"NRT",
"state":"active",
"leader":"true",
"force_set_state":"false",
"base_url":"http://127.0.0.1:42249/solr"},
"core_node15":{
"core":"testSplitMixedReplicaTypes_link_shard1_0_replica_n2",
"node_name":"127.0.0.1:44129_solr",
"type":"NRT",
"state":"active",
"force_set_state":"false",
"base_url":"http://127.0.0.1:44129/solr"},
"core_node16":{
"core":"testSplitMixedReplicaTypes_link_shard1_0_replica_p3",
"node_name":"127.0.0.1:33407_solr",
"type":"PULL",
"state":"active",
"force_set_state":"false",
"base_url":"http://127.0.0.1:33407/solr"},
"core_node17":{
"core":"testSplitMixedReplicaTypes_link_shard1_0_replica_p4",
"node_name":"127.0.0.1:34335_solr",
"type":"PULL",
"state":"active",
"force_set_state":"false",
"base_url":"http://127.0.0.1:34335/solr"}}},
"shard1_1":{
"range":"0-7fffffff",
"stateTimestamp":"1719714863363637045",
"state":"active",
"replicas":{
"core_node12":{
"core":"testSplitMixedReplicaTypes_link_shard1_1_replica_n10",
"node_name":"127.0.0.1:42249_solr",
"type":"NRT",
"state":"active",
"leader":"true",
"force_set_state":"false",
"base_url":"http://127.0.0.1:42249/solr"},
"core_node13":{
"core":"testSplitMixedReplicaTypes_link_shard1_1_replica_p0",
"node_name":"127.0.0.1:38789_solr",
"type":"PULL",
"state":"active",
"force_set_state":"false",
"base_url":"http://127.0.0.1:38789/solr"},
"core_node14":{
"core":"testSplitMixedReplicaTypes_link_shard1_1_replica_n1",
"node_name":"127.0.0.1:33407_solr",
"type":"NRT",
"state":"active",
"force_set_state":"false",
"base_url":"http://127.0.0.1:33407/solr"},
"core_node18":{
"core":"testSplitMixedReplicaTypes_link_shard1_1_replica_p5",
"node_name":"127.0.0.1:34335_solr",
"type":"PULL",
"state":"active",
"force_set_state":"false",
"base_url":"http://127.0.0.1:34335/solr"}}}}}
Stack Trace:
java.util.concurrent.TimeoutException: Timeout waiting to see state for collection=testSplitMixedReplicaTypes_link :DocCollection(testSplitMixedReplicaTypes_link//collections/testSplitMixedReplicaTypes_link/state.json/27 )={
"pullReplicas":2,
"configName":"conf1",
"replicationFactor":2,
"router":{"name":"compositeId"},
"nrtReplicas":2,
"tlogReplicas":0,
"shards":{
"shard1":{
"range":"80000000-7fffffff",
"state":"inactive",
"stateTimestamp":"1719714863363684909",
"replicas":{
"core_node3":{
"core":"testSplitMixedReplicaTypes_link_shard1_replica_p1",
"node_name":"127.0.0.1:44129_solr",
"type":"PULL",
"state":"active",
"force_set_state":"false",
"base_url":"http://127.0.0.1:44129/solr"},
"core_node5":{
"core":"testSplitMixedReplicaTypes_link_shard1_replica_p2",
"node_name":"127.0.0.1:38789_solr",
"type":"PULL",
"state":"active",
"force_set_state":"false",
"base_url":"http://127.0.0.1:38789/solr"},
"core_node7":{
"core":"testSplitMixedReplicaTypes_link_shard1_replica_n4",
"node_name":"127.0.0.1:42249_solr",
"type":"NRT",
"state":"active",
"leader":"true",
"force_set_state":"false",
"base_url":"http://127.0.0.1:42249/solr"},
"core_node8":{
"core":"testSplitMixedReplicaTypes_link_shard1_replica_n6",
"node_name":"127.0.0.1:34335_solr",
"type":"NRT",
"state":"active",
"force_set_state":"false",
"base_url":"http://127.0.0.1:34335/solr"}}},
"shard1_0":{
"range":"80000000-ffffffff",
"stateTimestamp":"1719714863363669799",
"state":"active",
"replicas":{
"core_node11":{
"core":"testSplitMixedReplicaTypes_link_shard1_0_replica_n9",
"node_name":"127.0.0.1:42249_solr",
"type":"NRT",
"state":"active",
"leader":"true",
"force_set_state":"false",
"base_url":"http://127.0.0.1:42249/solr"},
"core_node15":{
"core":"testSplitMixedReplicaTypes_link_shard1_0_replica_n2",
"node_name":"127.0.0.1:44129_solr",
"type":"NRT",
"state":"active",
"force_set_state":"false",
"base_url":"http://127.0.0.1:44129/solr"},
"core_node16":{
"core":"testSplitMixedReplicaTypes_link_shard1_0_replica_p3",
"node_name":"127.0.0.1:33407_solr",
"type":"PULL",
"state":"active",
"force_set_state":"false",
"base_url":"http://127.0.0.1:33407/solr"},
"core_node17":{
"core":"testSplitMixedReplicaTypes_link_shard1_0_replica_p4",
"node_name":"127.0.0.1:34335_solr",
"type":"PULL",
"state":"active",
"force_set_state":"false",
"base_url":"http://127.0.0.1:34335/solr"}}},
"shard1_1":{
"range":"0-7fffffff",
"stateTimestamp":"1719714863363637045",
"state":"active",
"replicas":{
"core_node12":{
"core":"testSplitMixedReplicaTypes_link_shard1_1_replica_n10",
"node_name":"127.0.0.1:42249_solr",
"type":"NRT",
"state":"active",
"leader":"true",
"force_set_state":"false",
"base_url":"http://127.0.0.1:42249/solr"},
"core_node13":{
"core":"testSplitMixedReplicaTypes_link_shard1_1_replica_p0",
"node_name":"127.0.0.1:38789_solr",
"type":"PULL",
"state":"active",
"force_set_state":"false",
"base_url":"http://127.0.0.1:38789/solr"},
"core_node14":{
"core":"testSplitMixedReplicaTypes_link_shard1_1_replica_n1",
"node_name":"127.0.0.1:33407_solr",
"type":"NRT",
"state":"active",
"force_set_state":"false",
"base_url":"http://127.0.0.1:33407/solr"},
"core_node18":{
"core":"testSplitMixedReplicaTypes_link_shard1_1_replica_p5",
"node_name":"127.0.0.1:34335_solr",
"type":"PULL",
"state":"active",
"force_set_state":"false",
"base_url":"http://127.0.0.1:34335/solr"}}}}}
at __randomizedtesting.SeedInfo.seed([9CE9656C9E3D1BC1:A087AC353BE5B058]:0)
at org.apache.solr.common.cloud.ZkStateReader.waitForState(ZkStateReader.java:1884)
at org.apache.solr.cloud.api.collections.ShardSplitTest.doSplitMixedReplicaTypes(ShardSplitTest.java:442)
at org.apache.solr.cloud.api.collections.ShardSplitTest.testSplitMixedReplicaTypesLink(ShardSplitTest.java:412)
at java.base/jdk.internal.reflect.NativeMethodAccessorImpl.invoke0(Native Method)
at java.base/jdk.internal.reflect.NativeMethodAccessorImpl.invoke(NativeMethodAccessorImpl.java:62)
at java.base/jdk.internal.reflect.DelegatingMethodAccessorImpl.invoke(DelegatingMethodAccessorImpl.java:43)
at java.base/java.lang.reflect.Method.invoke(Method.java:566)
at com.carrotsearch.randomizedtesting.RandomizedRunner.invoke(RandomizedRunner.java:1758)
at com.carrotsearch.randomizedtesting.RandomizedRunner$8.evaluate(RandomizedRunner.java:946)
at com.carrotsearch.randomizedtesting.RandomizedRunner$9.evaluate(RandomizedRunner.java:982)
at com.carrotsearch.randomizedtesting.RandomizedRunner$10.evaluate(RandomizedRunner.java:996)
at org.apache.solr.BaseDistributedSearchTestCase$ShardsRepeatRule$ShardsFixedStatement.callStatement(BaseDistributedSearchTestCase.java:1069)
at org.apache.solr.BaseDistributedSearchTestCase$ShardsRepeatRule$ShardsStatement.evaluate(BaseDistributedSearchTestCase.java:1040)
at com.carrotsearch.randomizedtesting.rules.SystemPropertiesRestoreRule$1.evaluate(SystemPropertiesRestoreRule.java:80)
at org.junit.rules.RunRules.evaluate(RunRules.java:20)
at org.apache.lucene.tests.util.TestRuleSetupTeardownChained$1.evaluate(TestRuleSetupTeardownChained.java:48)
at org.apache.lucene.tests.util.AbstractBeforeAfterRule$1.evaluate(AbstractBeforeAfterRule.java:43)
at org.apache.lucene.tests.util.TestRuleThreadAndTestName$1.evaluate(TestRuleThreadAndTestName.java:45)
at org.apache.lucene.tests.util.TestRuleIgnoreAfterMaxFailures$1.evaluate(TestRuleIgnoreAfterMaxFailures.java:60)
at org.apache.lucene.tests.util.TestRuleMarkFailure$1.evaluate(TestRuleMarkFailure.java:44)
at org.junit.rules.RunRules.evaluate(RunRules.java:20)
at com.carrotsearch.randomizedtesting.rules.StatementAdapter.evaluate(StatementAdapter.java:36)
at com.carrotsearch.randomizedtesting.ThreadLeakControl$StatementRunner.run(ThreadLeakControl.java:390)
at com.carrotsearch.randomizedtesting.ThreadLeakControl.forkTimeoutingTask(ThreadLeakControl.java:843)
at com.carrotsearch.randomizedtesting.ThreadLeakControl$3.evaluate(ThreadLeakControl.java:490)
at com.carrotsearch.randomizedtesting.RandomizedRunner.runSingleTest(RandomizedRunner.java:955)
at com.carrotsearch.randomizedtesting.RandomizedRunner$5.evaluate(RandomizedRunner.java:840)
at com.carrotsearch.randomizedtesting.RandomizedRunner$6.evaluate(RandomizedRunner.java:891)
at com.carrotsearch.randomizedtesting.RandomizedRunner$7.evaluate(RandomizedRunner.java:902)
at com.carrotsearch.randomizedtesting.rules.StatementAdapter.evaluate(StatementAdapter.java:36)
at com.carrotsearch.randomizedtesting.rules.StatementAdapter.evaluate(StatementAdapter.java:36)
at org.apache.lucene.tests.util.AbstractBeforeAfterRule$1.evaluate(AbstractBeforeAfterRule.java:43)
at com.carrotsearch.randomizedtesting.rules.SystemPropertiesRestoreRule$1.evaluate(SystemPropertiesRestoreRule.java:80)
at org.junit.rules.RunRules.evaluate(RunRules.java:20)
at org.apache.lucene.tests.util.AbstractBeforeAfterRule$1.evaluate(AbstractBeforeAfterRule.java:43)
at com.carrotsearch.randomizedtesting.rules.StatementAdapter.evaluate(StatementAdapter.java:36)
at org.apache.lucene.tests.util.TestRuleStoreClassName$1.evaluate(TestRuleStoreClassName.java:38)
at com.carrotsearch.randomizedtesting.rules.NoShadowingOrOverridesOnMethodsRule$1.evaluate(NoShadowingOrOverridesOnMethodsRule.java:40)
at com.carrotsearch.randomizedtesting.rules.NoShadowingOrOverridesOnMethodsRule$1.evaluate(NoShadowingOrOverridesOnMethodsRule.java:40)
at com.carrotsearch.randomizedtesting.rules.StatementAdapter.evaluate(StatementAdapter.java:36)
at com.carrotsearch.randomizedtesting.rules.StatementAdapter.evaluate(StatementAdapter.java:36)
at org.apache.lucene.tests.util.TestRuleAssertionsRequired$1.evaluate(TestRuleAssertionsRequired.java:53)
at org.apache.lucene.tests.util.AbstractBeforeAfterRule$1.evaluate(AbstractBeforeAfterRule.java:43)
at org.apache.lucene.tests.util.TestRuleMarkFailure$1.evaluate(TestRuleMarkFailure.java:44)
at org.apache.lucene.tests.util.TestRuleIgnoreAfterMaxFailures$1.evaluate(TestRuleIgnoreAfterMaxFailures.java:60)
at org.apache.lucene.tests.util.TestRuleIgnoreTestSuites$1.evaluate(TestRuleIgnoreTestSuites.java:47)
at org.junit.rules.RunRules.evaluate(RunRules.java:20)
at com.carrotsearch.randomizedtesting.rules.StatementAdapter.evaluate(StatementAdapter.java:36)
at com.carrotsearch.randomizedtesting.ThreadLeakControl$StatementRunner.run(ThreadLeakControl.java:390)
at com.carrotsearch.randomizedtesting.ThreadLeakControl.lambda$forkTimeoutingTask$0(ThreadLeakControl.java:850)
at java.base/java.lang.Thread.run(Thread.java:829)
FAILED: org.apache.solr.cloud.api.collections.ShardSplitTest.testSplitMixedReplicaTypes
Error Message:
java.util.concurrent.TimeoutException: Timeout waiting to see state for collection=testSplitMixedReplicaTypes_rewrite :DocCollection(testSplitMixedReplicaTypes_rewrite//collections/testSplitMixedReplicaTypes_rewrite/state.json/21 )={
"pullReplicas":2,
"configName":"conf1",
"replicationFactor":2,
"router":{"name":"compositeId"},
"nrtReplicas":2,
"tlogReplicas":0,
"shards":{
"shard1":{
"range":"80000000-7fffffff",
"state":"inactive",
"stateTimestamp":"1719714909697965064",
"replicas":{
"core_node3":{
"core":"testSplitMixedReplicaTypes_rewrite_shard1_replica_n1",
"node_name":"127.0.0.1:33097_solr",
"type":"NRT",
"state":"active",
"leader":"true",
"force_set_state":"false",
"base_url":"http://127.0.0.1:33097/solr"},
"core_node5":{
"core":"testSplitMixedReplicaTypes_rewrite_shard1_replica_p2",
"node_name":"127.0.0.1:35231_solr",
"type":"PULL",
"state":"active",
"force_set_state":"false",
"base_url":"http://127.0.0.1:35231/solr"},
"core_node7":{
"core":"testSplitMixedReplicaTypes_rewrite_shard1_replica_n4",
"node_name":"127.0.0.1:33571_solr",
"type":"NRT",
"state":"active",
"force_set_state":"false",
"base_url":"http://127.0.0.1:33571/solr"},
"core_node8":{
"core":"testSplitMixedReplicaTypes_rewrite_shard1_replica_p6",
"node_name":"127.0.0.1:39899_solr",
"type":"PULL",
"state":"active",
"force_set_state":"false",
"base_url":"http://127.0.0.1:39899/solr"}}},
"shard1_0":{
"range":"80000000-ffffffff",
"stateTimestamp":"1719714909697948474",
"state":"active",
"replicas":{
"core_node11":{
"core":"testSplitMixedReplicaTypes_rewrite_shard1_0_replica_n9",
"node_name":"127.0.0.1:33097_solr",
"type":"NRT",
"state":"active",
"leader":"true",
"force_set_state":"false",
"base_url":"http://127.0.0.1:33097/solr"},
"core_node14":{
"core":"testSplitMixedReplicaTypes_rewrite_shard1_0_replica_p1",
"node_name":"127.0.0.1:36611_solr",
"type":"PULL",
"state":"active",
"force_set_state":"false",
"base_url":"http://127.0.0.1:36611/solr"},
"core_node15":{
"core":"testSplitMixedReplicaTypes_rewrite_shard1_0_replica_p2",
"node_name":"127.0.0.1:33571_solr",
"type":"PULL",
"state":"active",
"force_set_state":"false",
"base_url":"http://127.0.0.1:33571/solr"},
"core_node18":{
"core":"testSplitMixedReplicaTypes_rewrite_shard1_0_replica_n5",
"node_name":"127.0.0.1:35231_solr",
"type":"NRT",
"state":"active",
"force_set_state":"false",
"base_url":"http://127.0.0.1:35231/solr"}}},
"shard1_1":{
"range":"0-7fffffff",
"stateTimestamp":"1719714909697908352",
"state":"active",
"replicas":{
"core_node12":{
"core":"testSplitMixedReplicaTypes_rewrite_shard1_1_replica_n10",
"node_name":"127.0.0.1:33097_solr",
"type":"NRT",
"state":"active",
"leader":"true",
"force_set_state":"false",
"base_url":"http://127.0.0.1:33097/solr"},
"core_node13":{
"core":"testSplitMixedReplicaTypes_rewrite_shard1_1_replica_p0",
"node_name":"127.0.0.1:39899_solr",
"type":"PULL",
"state":"active",
"force_set_state":"false",
"base_url":"http://127.0.0.1:39899/solr"},
"core_node16":{
"core":"testSplitMixedReplicaTypes_rewrite_shard1_1_replica_p3",
"node_name":"127.0.0.1:33571_solr",
"type":"PULL",
"state":"active",
"force_set_state":"false",
"base_url":"http://127.0.0.1:33571/solr"},
"core_node17":{
"core":"testSplitMixedReplicaTypes_rewrite_shard1_1_replica_n4",
"node_name":"127.0.0.1:36611_solr",
"type":"NRT",
"state":"active",
"force_set_state":"false",
"base_url":"http://127.0.0.1:36611/solr"}}}}}
Stack Trace:
java.util.concurrent.TimeoutException: Timeout waiting to see state for collection=testSplitMixedReplicaTypes_rewrite :DocCollection(testSplitMixedReplicaTypes_rewrite//collections/testSplitMixedReplicaTypes_rewrite/state.json/21 )={
"pullReplicas":2,
"configName":"conf1",
"replicationFactor":2,
"router":{"name":"compositeId"},
"nrtReplicas":2,
"tlogReplicas":0,
"shards":{
"shard1":{
"range":"80000000-7fffffff",
"state":"inactive",
"stateTimestamp":"1719714909697965064",
"replicas":{
"core_node3":{
"core":"testSplitMixedReplicaTypes_rewrite_shard1_replica_n1",
"node_name":"127.0.0.1:33097_solr",
"type":"NRT",
"state":"active",
"leader":"true",
"force_set_state":"false",
"base_url":"http://127.0.0.1:33097/solr"},
"core_node5":{
"core":"testSplitMixedReplicaTypes_rewrite_shard1_replica_p2",
"node_name":"127.0.0.1:35231_solr",
"type":"PULL",
"state":"active",
"force_set_state":"false",
"base_url":"http://127.0.0.1:35231/solr"},
"core_node7":{
"core":"testSplitMixedReplicaTypes_rewrite_shard1_replica_n4",
"node_name":"127.0.0.1:33571_solr",
"type":"NRT",
"state":"active",
"force_set_state":"false",
"base_url":"http://127.0.0.1:33571/solr"},
"core_node8":{
"core":"testSplitMixedReplicaTypes_rewrite_shard1_replica_p6",
"node_name":"127.0.0.1:39899_solr",
"type":"PULL",
"state":"active",
"force_set_state":"false",
"base_url":"http://127.0.0.1:39899/solr"}}},
"shard1_0":{
"range":"80000000-ffffffff",
"stateTimestamp":"1719714909697948474",
"state":"active",
"replicas":{
"core_node11":{
"core":"testSplitMixedReplicaTypes_rewrite_shard1_0_replica_n9",
"node_name":"127.0.0.1:33097_solr",
"type":"NRT",
"state":"active",
"leader":"true",
"force_set_state":"false",
"base_url":"http://127.0.0.1:33097/solr"},
"core_node14":{
"core":"testSplitMixedReplicaTypes_rewrite_shard1_0_replica_p1",
"node_name":"127.0.0.1:36611_solr",
"type":"PULL",
"state":"active",
"force_set_state":"false",
"base_url":"http://127.0.0.1:36611/solr"},
"core_node15":{
"core":"testSplitMixedReplicaTypes_rewrite_shard1_0_replica_p2",
"node_name":"127.0.0.1:33571_solr",
"type":"PULL",
"state":"active",
"force_set_state":"false",
"base_url":"http://127.0.0.1:33571/solr"},
"core_node18":{
"core":"testSplitMixedReplicaTypes_rewrite_shard1_0_replica_n5",
"node_name":"127.0.0.1:35231_solr",
"type":"NRT",
"state":"active",
"force_set_state":"false",
"base_url":"http://127.0.0.1:35231/solr"}}},
"shard1_1":{
"range":"0-7fffffff",
"stateTimestamp":"1719714909697908352",
"state":"active",
"replicas":{
"core_node12":{
"core":"testSplitMixedReplicaTypes_rewrite_shard1_1_replica_n10",
"node_name":"127.0.0.1:33097_solr",
"type":"NRT",
"state":"active",
"leader":"true",
"force_set_state":"false",
"base_url":"http://127.0.0.1:33097/solr"},
"core_node13":{
"core":"testSplitMixedReplicaTypes_rewrite_shard1_1_replica_p0",
"node_name":"127.0.0.1:39899_solr",
"type":"PULL",
"state":"active",
"force_set_state":"false",
"base_url":"http://127.0.0.1:39899/solr"},
"core_node16":{
"core":"testSplitMixedReplicaTypes_rewrite_shard1_1_replica_p3",
"node_name":"127.0.0.1:33571_solr",
"type":"PULL",
"state":"active",
"force_set_state":"false",
"base_url":"http://127.0.0.1:33571/solr"},
"core_node17":{
"core":"testSplitMixedReplicaTypes_rewrite_shard1_1_replica_n4",
"node_name":"127.0.0.1:36611_solr",
"type":"NRT",
"state":"active",
"force_set_state":"false",
"base_url":"http://127.0.0.1:36611/solr"}}}}}
at __randomizedtesting.SeedInfo.seed([9CE9656C9E3D1BC1:242A31CC62E6CEB4]:0)
at org.apache.solr.common.cloud.ZkStateReader.waitForState(ZkStateReader.java:1884)
at org.apache.solr.cloud.api.collections.ShardSplitTest.doSplitMixedReplicaTypes(ShardSplitTest.java:442)
at org.apache.solr.cloud.api.collections.ShardSplitTest.testSplitMixedReplicaTypes(ShardSplitTest.java:407)
at java.base/jdk.internal.reflect.NativeMethodAccessorImpl.invoke0(Native Method)
at java.base/jdk.internal.reflect.NativeMethodAccessorImpl.invoke(NativeMethodAccessorImpl.java:62)
at java.base/jdk.internal.reflect.DelegatingMethodAccessorImpl.invoke(DelegatingMethodAccessorImpl.java:43)
at java.base/java.lang.reflect.Method.invoke(Method.java:566)
at com.carrotsearch.randomizedtesting.RandomizedRunner.invoke(RandomizedRunner.java:1758)
at com.carrotsearch.randomizedtesting.RandomizedRunner$8.evaluate(RandomizedRunner.java:946)
at com.carrotsearch.randomizedtesting.RandomizedRunner$9.evaluate(RandomizedRunner.java:982)
at com.carrotsearch.randomizedtesting.RandomizedRunner$10.evaluate(RandomizedRunner.java:996)
at org.apache.solr.BaseDistributedSearchTestCase$ShardsRepeatRule$ShardsFixedStatement.callStatement(BaseDistributedSearchTestCase.java:1069)
at org.apache.solr.BaseDistributedSearchTestCase$ShardsRepeatRule$ShardsStatement.evaluate(BaseDistributedSearchTestCase.java:1040)
at com.carrotsearch.randomizedtesting.rules.SystemPropertiesRestoreRule$1.evaluate(SystemPropertiesRestoreRule.java:80)
at org.junit.rules.RunRules.evaluate(RunRules.java:20)
at org.apache.lucene.tests.util.TestRuleSetupTeardownChained$1.evaluate(TestRuleSetupTeardownChained.java:48)
at org.apache.lucene.tests.util.AbstractBeforeAfterRule$1.evaluate(AbstractBeforeAfterRule.java:43)
at org.apache.lucene.tests.util.TestRuleThreadAndTestName$1.evaluate(TestRuleThreadAndTestName.java:45)
at org.apache.lucene.tests.util.TestRuleIgnoreAfterMaxFailures$1.evaluate(TestRuleIgnoreAfterMaxFailures.java:60)
at org.apache.lucene.tests.util.TestRuleMarkFailure$1.evaluate(TestRuleMarkFailure.java:44)
at org.junit.rules.RunRules.evaluate(RunRules.java:20)
at com.carrotsearch.randomizedtesting.rules.StatementAdapter.evaluate(StatementAdapter.java:36)
at com.carrotsearch.randomizedtesting.ThreadLeakControl$StatementRunner.run(ThreadLeakControl.java:390)
at com.carrotsearch.randomizedtesting.ThreadLeakControl.forkTimeoutingTask(ThreadLeakControl.java:843)
at com.carrotsearch.randomizedtesting.ThreadLeakControl$3.evaluate(ThreadLeakControl.java:490)
at com.carrotsearch.randomizedtesting.RandomizedRunner.runSingleTest(RandomizedRunner.java:955)
at com.carrotsearch.randomizedtesting.RandomizedRunner$5.evaluate(RandomizedRunner.java:840)
at com.carrotsearch.randomizedtesting.RandomizedRunner$6.evaluate(RandomizedRunner.java:891)
at com.carrotsearch.randomizedtesting.RandomizedRunner$7.evaluate(RandomizedRunner.java:902)
at com.carrotsearch.randomizedtesting.rules.StatementAdapter.evaluate(StatementAdapter.java:36)
at com.carrotsearch.randomizedtesting.rules.StatementAdapter.evaluate(StatementAdapter.java:36)
at org.apache.lucene.tests.util.AbstractBeforeAfterRule$1.evaluate(AbstractBeforeAfterRule.java:43)
at com.carrotsearch.randomizedtesting.rules.SystemPropertiesRestoreRule$1.evaluate(SystemPropertiesRestoreRule.java:80)
at org.junit.rules.RunRules.evaluate(RunRules.java:20)
at org.apache.lucene.tests.util.AbstractBeforeAfterRule$1.evaluate(AbstractBeforeAfterRule.java:43)
at com.carrotsearch.randomizedtesting.rules.StatementAdapter.evaluate(StatementAdapter.java:36)
at org.apache.lucene.tests.util.TestRuleStoreClassName$1.evaluate(TestRuleStoreClassName.java:38)
at com.carrotsearch.randomizedtesting.rules.NoShadowingOrOverridesOnMethodsRule$1.evaluate(NoShadowingOrOverridesOnMethodsRule.java:40)
at com.carrotsearch.randomizedtesting.rules.NoShadowingOrOverridesOnMethodsRule$1.evaluate(NoShadowingOrOverridesOnMethodsRule.java:40)
at com.carrotsearch.randomizedtesting.rules.StatementAdapter.evaluate(StatementAdapter.java:36)
at com.carrotsearch.randomizedtesting.rules.StatementAdapter.evaluate(StatementAdapter.java:36)
at org.apache.lucene.tests.util.TestRuleAssertionsRequired$1.evaluate(TestRuleAssertionsRequired.java:53)
at org.apache.lucene.tests.util.AbstractBeforeAfterRule$1.evaluate(AbstractBeforeAfterRule.java:43)
at org.apache.lucene.tests.util.TestRuleMarkFailure$1.evaluate(TestRuleMarkFailure.java:44)
at org.apache.lucene.tests.util.TestRuleIgnoreAfterMaxFailures$1.evaluate(TestRuleIgnoreAfterMaxFailures.java:60)
at org.apache.lucene.tests.util.TestRuleIgnoreTestSuites$1.evaluate(TestRuleIgnoreTestSuites.java:47)
at org.junit.rules.RunRules.evaluate(RunRules.java:20)
at com.carrotsearch.randomizedtesting.rules.StatementAdapter.evaluate(StatementAdapter.java:36)
at com.carrotsearch.randomizedtesting.ThreadLeakControl$StatementRunner.run(ThreadLeakControl.java:390)
at com.carrotsearch.randomizedtesting.ThreadLeakControl.lambda$forkTimeoutingTask$0(ThreadLeakControl.java:850)
at java.base/java.lang.Thread.run(Thread.java:829)
Build Log:
[...truncated 87598 lines...]
ERROR: The following test(s) have failed:
- org.apache.solr.client.solrj.TestLBHttp2SolrClient.testTwoServers (:solr:solrj)
Test history: https://ge.apache.org/scans/tests?search.rootProjectNames=solr-root&tests.container=org.apache.solr.client.solrj.TestLBHttp2SolrClient&tests.test=testTwoServers http://fucit.org/solr-jenkins-reports/history-trend-of-recent-failures.html#series/org.apache.solr.client.solrj.TestLBHttp2SolrClient.testTwoServers
Test output: /home/jenkins/jenkins-slave/workspace/Solr/Solr-NightlyTests-main/solr/solrj/build/test-results/test/outputs/OUTPUT-org.apache.solr.client.solrj.TestLBHttp2SolrClient.txt
Reproduce with: ./gradlew :solr:solrj:test --tests "org.apache.solr.client.solrj.TestLBHttp2SolrClient.testTwoServers" -Ptests.jvms=4 -Ptests.haltonfailure=false "-Ptests.jvmargs=-XX:TieredStopAtLevel=1 -XX:+UseParallelGC -XX:ActiveProcessorCount=1 -XX:ReservedCodeCacheSize=120m" -Ptests.seed=9CE9656C9E3D1BC1 -Ptests.multiplier=2 -Ptests.nightly=true -Ptests.badapples=false -Ptests.file.encoding=US-ASCII -Ptests.linedocsfile=/home/jenkins/jenkins-slave/workspace/Solr/Solr-NightlyTests-main/test-data/enwiki.random.lines.txt
- org.apache.solr.cloud.api.collections.ShardSplitTest.testSplitStaticIndexReplicationLink (:solr:core)
Test history: https://ge.apache.org/scans/tests?search.rootProjectNames=solr-root&tests.container=org.apache.solr.cloud.api.collections.ShardSplitTest&tests.test=testSplitStaticIndexReplicationLink http://fucit.org/solr-jenkins-reports/history-trend-of-recent-failures.html#series/org.apache.solr.cloud.api.collections.ShardSplitTest.testSplitStaticIndexReplicationLink
Test output: /home/jenkins/jenkins-slave/workspace/Solr/Solr-NightlyTests-main/solr/core/build/test-results/test/outputs/OUTPUT-org.apache.solr.cloud.api.collections.ShardSplitTest.txt
Reproduce with: ./gradlew :solr:core:test --tests "org.apache.solr.cloud.api.collections.ShardSplitTest.testSplitStaticIndexReplicationLink" -Ptests.jvms=4 -Ptests.haltonfailure=false "-Ptests.jvmargs=-XX:TieredStopAtLevel=1 -XX:+UseParallelGC -XX:ActiveProcessorCount=1 -XX:ReservedCodeCacheSize=120m" -Ptests.seed=9CE9656C9E3D1BC1 -Ptests.multiplier=2 -Ptests.nightly=true -Ptests.badapples=false -Ptests.file.encoding=US-ASCII -Ptests.linedocsfile=/home/jenkins/jenkins-slave/workspace/Solr/Solr-NightlyTests-main/test-data/enwiki.random.lines.txt
- org.apache.solr.cloud.api.collections.ShardSplitTest.testSplitStaticIndexReplication (:solr:core)
Test history: https://ge.apache.org/scans/tests?search.rootProjectNames=solr-root&tests.container=org.apache.solr.cloud.api.collections.ShardSplitTest&tests.test=testSplitStaticIndexReplication http://fucit.org/solr-jenkins-reports/history-trend-of-recent-failures.html#series/org.apache.solr.cloud.api.collections.ShardSplitTest.testSplitStaticIndexReplication
Test output: /home/jenkins/jenkins-slave/workspace/Solr/Solr-NightlyTests-main/solr/core/build/test-results/test/outputs/OUTPUT-org.apache.solr.cloud.api.collections.ShardSplitTest.txt
Reproduce with: ./gradlew :solr:core:test --tests "org.apache.solr.cloud.api.collections.ShardSplitTest.testSplitStaticIndexReplication" -Ptests.jvms=4 -Ptests.haltonfailure=false "-Ptests.jvmargs=-XX:TieredStopAtLevel=1 -XX:+UseParallelGC -XX:ActiveProcessorCount=1 -XX:ReservedCodeCacheSize=120m" -Ptests.seed=9CE9656C9E3D1BC1 -Ptests.multiplier=2 -Ptests.nightly=true -Ptests.badapples=false -Ptests.file.encoding=US-ASCII -Ptests.linedocsfile=/home/jenkins/jenkins-slave/workspace/Solr/Solr-NightlyTests-main/test-data/enwiki.random.lines.txt
- org.apache.solr.cloud.api.collections.ShardSplitTest.testSplitMixedReplicaTypesLink (:solr:core)
Test history: https://ge.apache.org/scans/tests?search.rootProjectNames=solr-root&tests.container=org.apache.solr.cloud.api.collections.ShardSplitTest&tests.test=testSplitMixedReplicaTypesLink http://fucit.org/solr-jenkins-reports/history-trend-of-recent-failures.html#series/org.apache.solr.cloud.api.collections.ShardSplitTest.testSplitMixedReplicaTypesLink
Test output: /home/jenkins/jenkins-slave/workspace/Solr/Solr-NightlyTests-main/solr/core/build/test-results/test/outputs/OUTPUT-org.apache.solr.cloud.api.collections.ShardSplitTest.txt
Reproduce with: ./gradlew :solr:core:test --tests "org.apache.solr.cloud.api.collections.ShardSplitTest.testSplitMixedReplicaTypesLink" -Ptests.jvms=4 -Ptests.haltonfailure=false "-Ptests.jvmargs=-XX:TieredStopAtLevel=1 -XX:+UseParallelGC -XX:ActiveProcessorCount=1 -XX:ReservedCodeCacheSize=120m" -Ptests.seed=9CE9656C9E3D1BC1 -Ptests.multiplier=2 -Ptests.nightly=true -Ptests.badapples=false -Ptests.file.encoding=US-ASCII -Ptests.linedocsfile=/home/jenkins/jenkins-slave/workspace/Solr/Solr-NightlyTests-main/test-data/enwiki.random.lines.txt
- org.apache.solr.cloud.api.collections.ShardSplitTest.testSplitMixedReplicaTypes (:solr:core)
Test history: https://ge.apache.org/scans/tests?search.rootProjectNames=solr-root&tests.container=org.apache.solr.cloud.api.collections.ShardSplitTest&tests.test=testSplitMixedReplicaTypes http://fucit.org/solr-jenkins-reports/history-trend-of-recent-failures.html#series/org.apache.solr.cloud.api.collections.ShardSplitTest.testSplitMixedReplicaTypes
Test output: /home/jenkins/jenkins-slave/workspace/Solr/Solr-NightlyTests-main/solr/core/build/test-results/test/outputs/OUTPUT-org.apache.solr.cloud.api.collections.ShardSplitTest.txt
Reproduce with: ./gradlew :solr:core:test --tests "org.apache.solr.cloud.api.collections.ShardSplitTest.testSplitMixedReplicaTypes" -Ptests.jvms=4 -Ptests.haltonfailure=false "-Ptests.jvmargs=-XX:TieredStopAtLevel=1 -XX:+UseParallelGC -XX:ActiveProcessorCount=1 -XX:ReservedCodeCacheSize=120m" -Ptests.seed=9CE9656C9E3D1BC1 -Ptests.multiplier=2 -Ptests.nightly=true -Ptests.badapples=false -Ptests.file.encoding=US-ASCII -Ptests.linedocsfile=/home/jenkins/jenkins-slave/workspace/Solr/Solr-NightlyTests-main/test-data/enwiki.random.lines.txt
Deprecated Gradle features were used in this build, making it incompatible with Gradle 9.0.
You can use '--warning-mode all' to show the individual deprecation warnings and determine if they come from your own scripts or plugins.
For more on this, please refer to https://docs.gradle.org/8.4/userguide/command_line_interface.html#sec:command_line_warnings in the Gradle documentation.
BUILD SUCCESSFUL in 1h 47m 31s
141 actionable tasks: 141 executed
Publishing build scan...
https://ge.apache.org/s/vc7mjp5vlq3fo
Build step 'Invoke Gradle script' changed build result to SUCCESS
Archiving artifacts
‘**/*.events’ doesn’t match anything: ‘**’ exists but not ‘**/*.events’
No artifacts found that match the file pattern "**/*.events,heapdumps/**,**/hs_err_pid*". Configuration error?
Recording test results
[Checks API] No suitable checks publisher found.
Build step 'Publish JUnit test result report' changed build result to UNSTABLE
Email was triggered for: Unstable (Test Failures)
Sending email for trigger: Unstable (Test Failures)