You are viewing a plain text version of this content. The canonical link for it is here.
Posted to dev@kafka.apache.org by Apache Jenkins Server <je...@builds.apache.org> on 2018/05/21 17:47:24 UTC
Build failed in Jenkins: kafka-trunk-jdk8 #2660
See <https://builds.apache.org/job/kafka-trunk-jdk8/2660/display/redirect?page=changes>
Changes:
[jason] KAFKA-6868; Fix buffer underflow and expose group state in the consumer
------------------------------------------
[...truncated 423.95 KB...]
kafka.zookeeper.ZooKeeperClientTest > testPipelinedGetData STARTED
kafka.zookeeper.ZooKeeperClientTest > testPipelinedGetData PASSED
kafka.zookeeper.ZooKeeperClientTest > testZNodeChildChangeHandlerForChildChange STARTED
kafka.zookeeper.ZooKeeperClientTest > testZNodeChildChangeHandlerForChildChange PASSED
kafka.zookeeper.ZooKeeperClientTest > testGetChildrenExistingZNodeWithChildren STARTED
kafka.zookeeper.ZooKeeperClientTest > testGetChildrenExistingZNodeWithChildren PASSED
kafka.zookeeper.ZooKeeperClientTest > testSetDataExistingZNode STARTED
kafka.zookeeper.ZooKeeperClientTest > testSetDataExistingZNode PASSED
kafka.zookeeper.ZooKeeperClientTest > testMixedPipeline STARTED
kafka.zookeeper.ZooKeeperClientTest > testMixedPipeline PASSED
kafka.zookeeper.ZooKeeperClientTest > testGetDataExistingZNode STARTED
kafka.zookeeper.ZooKeeperClientTest > testGetDataExistingZNode PASSED
kafka.zookeeper.ZooKeeperClientTest > testDeleteExistingZNode STARTED
kafka.zookeeper.ZooKeeperClientTest > testDeleteExistingZNode PASSED
kafka.zookeeper.ZooKeeperClientTest > testSessionExpiry STARTED
kafka.zookeeper.ZooKeeperClientTest > testSessionExpiry PASSED
kafka.zookeeper.ZooKeeperClientTest > testSetDataNonExistentZNode STARTED
kafka.zookeeper.ZooKeeperClientTest > testSetDataNonExistentZNode PASSED
kafka.zookeeper.ZooKeeperClientTest > testDeleteNonExistentZNode STARTED
kafka.zookeeper.ZooKeeperClientTest > testDeleteNonExistentZNode PASSED
kafka.zookeeper.ZooKeeperClientTest > testExistsExistingZNode STARTED
kafka.zookeeper.ZooKeeperClientTest > testExistsExistingZNode PASSED
kafka.zookeeper.ZooKeeperClientTest > testZooKeeperStateChangeRateMetrics STARTED
kafka.zookeeper.ZooKeeperClientTest > testZooKeeperStateChangeRateMetrics PASSED
kafka.zookeeper.ZooKeeperClientTest > testZNodeChangeHandlerForDeletion STARTED
kafka.zookeeper.ZooKeeperClientTest > testZNodeChangeHandlerForDeletion PASSED
kafka.zookeeper.ZooKeeperClientTest > testGetAclNonExistentZNode STARTED
kafka.zookeeper.ZooKeeperClientTest > testGetAclNonExistentZNode PASSED
kafka.zookeeper.ZooKeeperClientTest > testStateChangeHandlerForAuthFailure STARTED
kafka.zookeeper.ZooKeeperClientTest > testStateChangeHandlerForAuthFailure PASSED
kafka.network.SocketServerTest > testGracefulClose STARTED
kafka.network.SocketServerTest > testGracefulClose PASSED
kafka.network.SocketServerTest > controlThrowable STARTED
kafka.network.SocketServerTest > controlThrowable PASSED
kafka.network.SocketServerTest > testRequestMetricsAfterStop STARTED
kafka.network.SocketServerTest > testRequestMetricsAfterStop PASSED
kafka.network.SocketServerTest > testConnectionIdReuse STARTED
kafka.network.SocketServerTest > testConnectionIdReuse PASSED
kafka.network.SocketServerTest > testClientDisconnectionUpdatesRequestMetrics STARTED
kafka.network.SocketServerTest > testClientDisconnectionUpdatesRequestMetrics PASSED
kafka.network.SocketServerTest > testProcessorMetricsTags STARTED
kafka.network.SocketServerTest > testProcessorMetricsTags PASSED
kafka.network.SocketServerTest > testMaxConnectionsPerIp STARTED
kafka.network.SocketServerTest > testMaxConnectionsPerIp PASSED
kafka.network.SocketServerTest > testConnectionId STARTED
kafka.network.SocketServerTest > testConnectionId PASSED
kafka.network.SocketServerTest > testBrokerSendAfterChannelClosedUpdatesRequestMetrics STARTED
kafka.network.SocketServerTest > testBrokerSendAfterChannelClosedUpdatesRequestMetrics PASSED
kafka.network.SocketServerTest > testNoOpAction STARTED
kafka.network.SocketServerTest > testNoOpAction PASSED
kafka.network.SocketServerTest > simpleRequest STARTED
kafka.network.SocketServerTest > simpleRequest PASSED
kafka.network.SocketServerTest > closingChannelException STARTED
kafka.network.SocketServerTest > closingChannelException PASSED
kafka.network.SocketServerTest > testIdleConnection STARTED
kafka.network.SocketServerTest > testIdleConnection PASSED
kafka.network.SocketServerTest > testClientDisconnectionWithStagedReceivesFullyProcessed STARTED
kafka.network.SocketServerTest > testClientDisconnectionWithStagedReceivesFullyProcessed PASSED
kafka.network.SocketServerTest > testZeroMaxConnectionsPerIp STARTED
kafka.network.SocketServerTest > testZeroMaxConnectionsPerIp PASSED
kafka.network.SocketServerTest > testMetricCollectionAfterShutdown STARTED
kafka.network.SocketServerTest > testMetricCollectionAfterShutdown PASSED
kafka.network.SocketServerTest > testSessionPrincipal STARTED
kafka.network.SocketServerTest > testSessionPrincipal PASSED
kafka.network.SocketServerTest > configureNewConnectionException STARTED
kafka.network.SocketServerTest > configureNewConnectionException PASSED
kafka.network.SocketServerTest > testMaxConnectionsPerIpOverrides STARTED
kafka.network.SocketServerTest > testMaxConnectionsPerIpOverrides PASSED
kafka.network.SocketServerTest > processNewResponseException STARTED
kafka.network.SocketServerTest > processNewResponseException PASSED
kafka.network.SocketServerTest > processCompletedSendException STARTED
kafka.network.SocketServerTest > processCompletedSendException PASSED
kafka.network.SocketServerTest > processDisconnectedException STARTED
kafka.network.SocketServerTest > processDisconnectedException PASSED
kafka.network.SocketServerTest > sendCancelledKeyException STARTED
kafka.network.SocketServerTest > sendCancelledKeyException PASSED
kafka.network.SocketServerTest > processCompletedReceiveException STARTED
kafka.network.SocketServerTest > processCompletedReceiveException PASSED
kafka.network.SocketServerTest > testSocketsCloseOnShutdown STARTED
kafka.network.SocketServerTest > testSocketsCloseOnShutdown PASSED
kafka.network.SocketServerTest > pollException STARTED
kafka.network.SocketServerTest > pollException PASSED
kafka.network.SocketServerTest > testSslSocketServer STARTED
kafka.network.SocketServerTest > testSslSocketServer PASSED
kafka.network.SocketServerTest > tooBigRequestIsRejected STARTED
kafka.network.SocketServerTest > tooBigRequestIsRejected PASSED
unit.kafka.admin.DeleteConsumerGroupTest > testDeleteNonEmptyGroup STARTED
unit.kafka.admin.DeleteConsumerGroupTest > testDeleteNonEmptyGroup PASSED
unit.kafka.admin.DeleteConsumerGroupTest > testDeleteCmdWithMixOfSuccessAndError STARTED
unit.kafka.admin.DeleteConsumerGroupTest > testDeleteCmdWithMixOfSuccessAndError PASSED
unit.kafka.admin.DeleteConsumerGroupTest > testDeleteWithShortInitialization STARTED
unit.kafka.admin.DeleteConsumerGroupTest > testDeleteWithShortInitialization PASSED
unit.kafka.admin.DeleteConsumerGroupTest > testDeleteCmdWithShortInitialization STARTED
unit.kafka.admin.DeleteConsumerGroupTest > testDeleteCmdWithShortInitialization PASSED
unit.kafka.admin.DeleteConsumerGroupTest > testDeleteWithTopicOption STARTED
unit.kafka.admin.DeleteConsumerGroupTest > testDeleteWithTopicOption PASSED
unit.kafka.admin.DeleteConsumerGroupTest > testDeleteNonExistingGroup STARTED
unit.kafka.admin.DeleteConsumerGroupTest > testDeleteNonExistingGroup PASSED
unit.kafka.admin.DeleteConsumerGroupTest > testDeleteCmdNonEmptyGroup STARTED
unit.kafka.admin.DeleteConsumerGroupTest > testDeleteCmdNonEmptyGroup PASSED
unit.kafka.admin.DeleteConsumerGroupTest > testDeleteCmdNonExistingGroup STARTED
unit.kafka.admin.DeleteConsumerGroupTest > testDeleteCmdNonExistingGroup PASSED
unit.kafka.admin.DeleteConsumerGroupTest > testDeleteEmptyGroup STARTED
unit.kafka.admin.DeleteConsumerGroupTest > testDeleteEmptyGroup PASSED
unit.kafka.admin.DeleteConsumerGroupTest > testDeleteWithMixOfSuccessAndError STARTED
unit.kafka.admin.DeleteConsumerGroupTest > testDeleteWithMixOfSuccessAndError PASSED
unit.kafka.admin.DeleteConsumerGroupTest > testDeleteCmdEmptyGroup STARTED
unit.kafka.admin.DeleteConsumerGroupTest > testDeleteCmdEmptyGroup PASSED
1952 tests completed, 1 failed, 5 skipped
:kafka-trunk-jdk8:core:test FAILED
:test_core_2_11 FAILED
FAILURE: Build failed with an exception.
* What went wrong:
Execution failed for task ':kafka-trunk-jdk8:core:test'.
> There were failing tests. See the report at: file://<https://builds.apache.org/job/kafka-trunk-jdk8/ws/core/build/reports/tests/test/index.html>
* Try:
Run with --stacktrace option to get the stack trace. Run with --info or --debug option to get more log output. Run with --scan to get full insights.
* Get more help at https://help.gradle.org
BUILD FAILED in 1h 34m 47s
24 actionable tasks: 23 executed, 1 up-to-date
Build step 'Execute shell' marked build as failure
[FINDBUGS] Collecting findbugs analysis files...
Setting GRADLE_4_4_HOME=/home/jenkins/tools/gradle/4.4
[FINDBUGS] Searching for all files in <https://builds.apache.org/job/kafka-trunk-jdk8/ws/> that match the pattern **/build/reports/findbugs/*.xml
[FINDBUGS] Parsing 1 file in <https://builds.apache.org/job/kafka-trunk-jdk8/ws/>
[FINDBUGS] Successfully parsed file <https://builds.apache.org/job/kafka-trunk-jdk8/ws/core/build/reports/findbugs/main.xml> with 0 unique warnings and 0 duplicates.
Setting GRADLE_4_4_HOME=/home/jenkins/tools/gradle/4.4
Setting GRADLE_4_4_HOME=/home/jenkins/tools/gradle/4.4
<Git Blamer> Using GitBlamer to create author and commit information for all warnings.
<Git Blamer> GIT_COMMIT=16ad358d64a138fc4b455379745ae1550a93d57b, workspace=<https://builds.apache.org/job/kafka-trunk-jdk8/ws/>
[FINDBUGS] Computing warning deltas based on reference build #2654
Recording test results
Setting GRADLE_4_4_HOME=/home/jenkins/tools/gradle/4.4
Setting GRADLE_4_4_HOME=/home/jenkins/tools/gradle/4.4
Not sending mail to unregistered user github@alasdairhodge.co.uk
Not sending mail to unregistered user wangguoz@gmail.com
Jenkins build is back to normal : kafka-trunk-jdk8 #2663
Posted by Apache Jenkins Server <je...@builds.apache.org>.
See <https://builds.apache.org/job/kafka-trunk-jdk8/2663/display/redirect?page=changes>
Build failed in Jenkins: kafka-trunk-jdk8 #2662
Posted by Apache Jenkins Server <je...@builds.apache.org>.
See <https://builds.apache.org/job/kafka-trunk-jdk8/2662/display/redirect?page=changes>
Changes:
[github] MINOR: Ignore test_broker_type_bounce_at_start system test (#5055)
------------------------------------------
[...truncated 423.43 KB...]
kafka.admin.ResetConsumerGroupOffsetTest > testResetOffsetsShiftPlus STARTED
kafka.admin.ResetConsumerGroupOffsetTest > testResetOffsetsShiftPlus PASSED
kafka.admin.ResetConsumerGroupOffsetTest > testResetOffsetsToLatest STARTED
kafka.admin.ResetConsumerGroupOffsetTest > testResetOffsetsToLatest PASSED
kafka.admin.ResetConsumerGroupOffsetTest > testResetOffsetsNewConsumerExistingTopic STARTED
kafka.admin.ResetConsumerGroupOffsetTest > testResetOffsetsNewConsumerExistingTopic PASSED
kafka.admin.ResetConsumerGroupOffsetTest > testResetOffsetsShiftByLowerThanEarliest STARTED
kafka.admin.ResetConsumerGroupOffsetTest > testResetOffsetsShiftByLowerThanEarliest PASSED
kafka.admin.ResetConsumerGroupOffsetTest > testResetOffsetsByDuration STARTED
kafka.admin.ResetConsumerGroupOffsetTest > testResetOffsetsByDuration PASSED
kafka.admin.ResetConsumerGroupOffsetTest > testResetOffsetsToLocalDateTime STARTED
kafka.admin.ResetConsumerGroupOffsetTest > testResetOffsetsToLocalDateTime PASSED
kafka.admin.ResetConsumerGroupOffsetTest > testResetOffsetsToEarliestOnTopicsAndPartitions STARTED
kafka.admin.ResetConsumerGroupOffsetTest > testResetOffsetsToEarliestOnTopicsAndPartitions PASSED
kafka.admin.ResetConsumerGroupOffsetTest > testResetOffsetsToEarliestOnTopics STARTED
kafka.admin.ResetConsumerGroupOffsetTest > testResetOffsetsToEarliestOnTopics PASSED
kafka.admin.ReassignPartitionsCommandArgsTest > shouldFailIfBlankArg STARTED
kafka.admin.ReassignPartitionsCommandArgsTest > shouldFailIfBlankArg PASSED
kafka.admin.ReassignPartitionsCommandArgsTest > shouldNotAllowVerifyWithoutReassignmentOption STARTED
kafka.admin.ReassignPartitionsCommandArgsTest > shouldNotAllowVerifyWithoutReassignmentOption PASSED
kafka.admin.ReassignPartitionsCommandArgsTest > shouldNotAllowGenerateWithoutBrokersOption STARTED
kafka.admin.ReassignPartitionsCommandArgsTest > shouldNotAllowGenerateWithoutBrokersOption PASSED
kafka.admin.ReassignPartitionsCommandArgsTest > shouldNotAllowTopicsOptionWithVerify STARTED
kafka.admin.ReassignPartitionsCommandArgsTest > shouldNotAllowTopicsOptionWithVerify PASSED
kafka.admin.ReassignPartitionsCommandArgsTest > shouldNotAllowGenerateWithThrottleOption STARTED
kafka.admin.ReassignPartitionsCommandArgsTest > shouldNotAllowGenerateWithThrottleOption PASSED
kafka.admin.ReassignPartitionsCommandArgsTest > shouldFailIfNoArgs STARTED
kafka.admin.ReassignPartitionsCommandArgsTest > shouldFailIfNoArgs PASSED
kafka.admin.ReassignPartitionsCommandArgsTest > shouldNotAllowExecuteWithoutReassignmentOption STARTED
kafka.admin.ReassignPartitionsCommandArgsTest > shouldNotAllowExecuteWithoutReassignmentOption PASSED
kafka.admin.ReassignPartitionsCommandArgsTest > shouldNotAllowBrokersListWithVerifyOption STARTED
kafka.admin.ReassignPartitionsCommandArgsTest > shouldNotAllowBrokersListWithVerifyOption PASSED
kafka.admin.ReassignPartitionsCommandArgsTest > shouldCorrectlyParseValidMinimumExecuteOptions STARTED
kafka.admin.ReassignPartitionsCommandArgsTest > shouldCorrectlyParseValidMinimumExecuteOptions PASSED
kafka.admin.ReassignPartitionsCommandArgsTest > shouldNotAllowGenerateWithReassignmentOption STARTED
kafka.admin.ReassignPartitionsCommandArgsTest > shouldNotAllowGenerateWithReassignmentOption PASSED
kafka.admin.ReassignPartitionsCommandArgsTest > shouldCorrectlyParseValidMinimumGenerateOptions STARTED
kafka.admin.ReassignPartitionsCommandArgsTest > shouldCorrectlyParseValidMinimumGenerateOptions PASSED
kafka.admin.ReassignPartitionsCommandArgsTest > shouldNotAllowGenerateWithoutBrokersAndTopicsOptions STARTED
kafka.admin.ReassignPartitionsCommandArgsTest > shouldNotAllowGenerateWithoutBrokersAndTopicsOptions PASSED
kafka.admin.ReassignPartitionsCommandArgsTest > shouldNotAllowThrottleWithVerifyOption STARTED
kafka.admin.ReassignPartitionsCommandArgsTest > shouldNotAllowThrottleWithVerifyOption PASSED
kafka.admin.ReassignPartitionsCommandArgsTest > shouldUseDefaultsIfEnabled STARTED
kafka.admin.ReassignPartitionsCommandArgsTest > shouldUseDefaultsIfEnabled PASSED
kafka.admin.ReassignPartitionsCommandArgsTest > shouldAllowThrottleOptionOnExecute STARTED
kafka.admin.ReassignPartitionsCommandArgsTest > shouldAllowThrottleOptionOnExecute PASSED
kafka.admin.ReassignPartitionsCommandArgsTest > shouldNotAllowExecuteWithBrokers STARTED
kafka.admin.ReassignPartitionsCommandArgsTest > shouldNotAllowExecuteWithBrokers PASSED
kafka.admin.ReassignPartitionsCommandArgsTest > shouldNotAllowExecuteWithTopicsOption STARTED
kafka.admin.ReassignPartitionsCommandArgsTest > shouldNotAllowExecuteWithTopicsOption PASSED
kafka.admin.ReassignPartitionsCommandArgsTest > shouldCorrectlyParseValidMinimumVerifyOptions STARTED
kafka.admin.ReassignPartitionsCommandArgsTest > shouldCorrectlyParseValidMinimumVerifyOptions PASSED
kafka.admin.ReassignPartitionsCommandArgsTest > shouldNotAllowGenerateWithoutTopicsOption STARTED
kafka.admin.ReassignPartitionsCommandArgsTest > shouldNotAllowGenerateWithoutTopicsOption PASSED
kafka.admin.BrokerApiVersionsCommandTest > checkBrokerApiVersionCommandOutput STARTED
kafka.admin.BrokerApiVersionsCommandTest > checkBrokerApiVersionCommandOutput PASSED
kafka.admin.TopicCommandTest > testCreateIfNotExists STARTED
kafka.admin.TopicCommandTest > testCreateIfNotExists PASSED
kafka.admin.TopicCommandTest > testCreateAlterTopicWithRackAware STARTED
kafka.admin.TopicCommandTest > testCreateAlterTopicWithRackAware PASSED
kafka.admin.TopicCommandTest > testTopicDeletion STARTED
kafka.admin.TopicCommandTest > testTopicDeletion PASSED
kafka.admin.TopicCommandTest > testConfigPreservationAcrossPartitionAlteration STARTED
kafka.admin.TopicCommandTest > testConfigPreservationAcrossPartitionAlteration PASSED
kafka.admin.TopicCommandTest > testAlterIfExists STARTED
kafka.admin.TopicCommandTest > testAlterIfExists PASSED
kafka.admin.TopicCommandTest > testDescribeAndListTopicsMarkedForDeletion STARTED
kafka.admin.TopicCommandTest > testDescribeAndListTopicsMarkedForDeletion PASSED
kafka.admin.TopicCommandTest > testDeleteIfExists STARTED
kafka.admin.TopicCommandTest > testDeleteIfExists PASSED
kafka.admin.AdminZkClientTest > testGetBrokerMetadatas STARTED
kafka.admin.AdminZkClientTest > testGetBrokerMetadatas PASSED
kafka.admin.AdminZkClientTest > testBootstrapClientIdConfig STARTED
kafka.admin.AdminZkClientTest > testBootstrapClientIdConfig PASSED
kafka.admin.AdminZkClientTest > testTopicConfigChange STARTED
kafka.admin.AdminZkClientTest > testTopicConfigChange PASSED
kafka.admin.AdminZkClientTest > testManualReplicaAssignment STARTED
kafka.admin.AdminZkClientTest > testManualReplicaAssignment PASSED
kafka.admin.AdminZkClientTest > testConcurrentTopicCreation STARTED
kafka.admin.AdminZkClientTest > testConcurrentTopicCreation PASSED
kafka.admin.AdminZkClientTest > shouldPropagateDynamicBrokerConfigs STARTED
kafka.admin.AdminZkClientTest > shouldPropagateDynamicBrokerConfigs PASSED
kafka.admin.AdminZkClientTest > testTopicCreationWithCollision STARTED
kafka.admin.AdminZkClientTest > testTopicCreationWithCollision PASSED
kafka.admin.AdminZkClientTest > testTopicCreationInZK STARTED
kafka.admin.AdminZkClientTest > testTopicCreationInZK PASSED
unit.kafka.admin.DeleteConsumerGroupTest > testDeleteNonEmptyGroup STARTED
unit.kafka.admin.DeleteConsumerGroupTest > testDeleteNonEmptyGroup PASSED
unit.kafka.admin.DeleteConsumerGroupTest > testDeleteCmdWithMixOfSuccessAndError STARTED
unit.kafka.admin.DeleteConsumerGroupTest > testDeleteCmdWithMixOfSuccessAndError PASSED
unit.kafka.admin.DeleteConsumerGroupTest > testDeleteWithShortInitialization STARTED
unit.kafka.admin.DeleteConsumerGroupTest > testDeleteWithShortInitialization PASSED
unit.kafka.admin.DeleteConsumerGroupTest > testDeleteCmdWithShortInitialization STARTED
unit.kafka.admin.DeleteConsumerGroupTest > testDeleteCmdWithShortInitialization PASSED
unit.kafka.admin.DeleteConsumerGroupTest > testDeleteWithTopicOption STARTED
unit.kafka.admin.DeleteConsumerGroupTest > testDeleteWithTopicOption PASSED
unit.kafka.admin.DeleteConsumerGroupTest > testDeleteNonExistingGroup STARTED
unit.kafka.admin.DeleteConsumerGroupTest > testDeleteNonExistingGroup PASSED
unit.kafka.admin.DeleteConsumerGroupTest > testDeleteCmdNonEmptyGroup STARTED
unit.kafka.admin.DeleteConsumerGroupTest > testDeleteCmdNonEmptyGroup PASSED
unit.kafka.admin.DeleteConsumerGroupTest > testDeleteCmdNonExistingGroup STARTED
unit.kafka.admin.DeleteConsumerGroupTest > testDeleteCmdNonExistingGroup PASSED
unit.kafka.admin.DeleteConsumerGroupTest > testDeleteEmptyGroup STARTED
unit.kafka.admin.DeleteConsumerGroupTest > testDeleteEmptyGroup PASSED
unit.kafka.admin.DeleteConsumerGroupTest > testDeleteWithMixOfSuccessAndError STARTED
unit.kafka.admin.DeleteConsumerGroupTest > testDeleteWithMixOfSuccessAndError PASSED
unit.kafka.admin.DeleteConsumerGroupTest > testDeleteCmdEmptyGroup STARTED
unit.kafka.admin.DeleteConsumerGroupTest > testDeleteCmdEmptyGroup PASSED
1952 tests completed, 1 failed, 5 skipped
:kafka-trunk-jdk8:core:test FAILED
:test_core_2_11 FAILED
FAILURE: Build failed with an exception.
* What went wrong:
Execution failed for task ':kafka-trunk-jdk8:core:test'.
> There were failing tests. See the report at: file://<https://builds.apache.org/job/kafka-trunk-jdk8/ws/core/build/reports/tests/test/index.html>
* Try:
Run with --stacktrace option to get the stack trace. Run with --info or --debug option to get more log output. Run with --scan to get full insights.
* Get more help at https://help.gradle.org
BUILD FAILED in 1h 5m 52s
24 actionable tasks: 3 executed, 21 up-to-date
Build step 'Execute shell' marked build as failure
[FINDBUGS] Collecting findbugs analysis files...
Setting GRADLE_4_4_HOME=/home/jenkins/tools/gradle/4.4
[FINDBUGS] Searching for all files in <https://builds.apache.org/job/kafka-trunk-jdk8/ws/> that match the pattern **/build/reports/findbugs/*.xml
[FINDBUGS] Parsing 1 file in <https://builds.apache.org/job/kafka-trunk-jdk8/ws/>
[FINDBUGS] Successfully parsed file <https://builds.apache.org/job/kafka-trunk-jdk8/ws/core/build/reports/findbugs/main.xml> with 0 unique warnings and 0 duplicates.
Setting GRADLE_4_4_HOME=/home/jenkins/tools/gradle/4.4
Setting GRADLE_4_4_HOME=/home/jenkins/tools/gradle/4.4
<Git Blamer> Using GitBlamer to create author and commit information for all warnings.
<Git Blamer> GIT_COMMIT=70a506b9839605304a0a67b70e711a1139b47cbe, workspace=<https://builds.apache.org/job/kafka-trunk-jdk8/ws/>
[FINDBUGS] Computing warning deltas based on reference build #2654
Recording test results
Setting GRADLE_4_4_HOME=/home/jenkins/tools/gradle/4.4
Setting GRADLE_4_4_HOME=/home/jenkins/tools/gradle/4.4
Not sending mail to unregistered user github@alasdairhodge.co.uk
Not sending mail to unregistered user wangguoz@gmail.com
Build failed in Jenkins: kafka-trunk-jdk8 #2661
Posted by Apache Jenkins Server <je...@builds.apache.org>.
See <https://builds.apache.org/job/kafka-trunk-jdk8/2661/display/redirect?page=changes>
Changes:
[github] MINOR: Reduce required occurrance from 100 to 10 (#5048)
------------------------------------------
[...truncated 422.86 KB...]
kafka.server.epoch.LeaderEpochFileCacheTest > shouldNotClearAnythingIfOffsetToFirstOffset STARTED
kafka.server.epoch.LeaderEpochFileCacheTest > shouldNotClearAnythingIfOffsetToFirstOffset PASSED
kafka.server.epoch.LeaderEpochFileCacheTest > shouldNotLetOffsetsGoBackwardsEvenIfEpochsProgress STARTED
kafka.server.epoch.LeaderEpochFileCacheTest > shouldNotLetOffsetsGoBackwardsEvenIfEpochsProgress PASSED
kafka.server.epoch.LeaderEpochFileCacheTest > shouldGetFirstOffsetOfSubsequentEpochWhenOffsetRequestedForPreviousEpoch STARTED
kafka.server.epoch.LeaderEpochFileCacheTest > shouldGetFirstOffsetOfSubsequentEpochWhenOffsetRequestedForPreviousEpoch PASSED
kafka.server.epoch.LeaderEpochFileCacheTest > shouldUpdateOffsetBetweenEpochBoundariesOnClearEarliest2 STARTED
kafka.server.epoch.LeaderEpochFileCacheTest > shouldUpdateOffsetBetweenEpochBoundariesOnClearEarliest2 PASSED
kafka.server.epoch.LeaderEpochFileCacheTest > shouldClearEarliestOnEmptyCache STARTED
kafka.server.epoch.LeaderEpochFileCacheTest > shouldClearEarliestOnEmptyCache PASSED
kafka.server.epoch.LeaderEpochFileCacheTest > shouldPreserveResetOffsetOnClearEarliestIfOneExists STARTED
kafka.server.epoch.LeaderEpochFileCacheTest > shouldPreserveResetOffsetOnClearEarliestIfOneExists PASSED
kafka.server.epoch.LeaderEpochFileCacheTest > shouldUpdateOffsetBetweenEpochBoundariesOnClearEarliest STARTED
kafka.server.epoch.LeaderEpochFileCacheTest > shouldUpdateOffsetBetweenEpochBoundariesOnClearEarliest PASSED
kafka.server.epoch.LeaderEpochFileCacheTest > shouldReturnInvalidOffsetIfEpochIsRequestedWhichIsNotCurrentlyTracked STARTED
kafka.server.epoch.LeaderEpochFileCacheTest > shouldReturnInvalidOffsetIfEpochIsRequestedWhichIsNotCurrentlyTracked PASSED
kafka.server.epoch.LeaderEpochFileCacheTest > shouldFetchEndOffsetOfEmptyCache STARTED
kafka.server.epoch.LeaderEpochFileCacheTest > shouldFetchEndOffsetOfEmptyCache PASSED
kafka.server.epoch.LeaderEpochFileCacheTest > shouldRetainLatestEpochOnClearAllEarliestAndUpdateItsOffset STARTED
kafka.server.epoch.LeaderEpochFileCacheTest > shouldRetainLatestEpochOnClearAllEarliestAndUpdateItsOffset PASSED
kafka.server.epoch.LeaderEpochFileCacheTest > shouldClearAllEntries STARTED
kafka.server.epoch.LeaderEpochFileCacheTest > shouldClearAllEntries PASSED
kafka.server.epoch.LeaderEpochFileCacheTest > shouldClearLatestOnEmptyCache STARTED
kafka.server.epoch.LeaderEpochFileCacheTest > shouldClearLatestOnEmptyCache PASSED
kafka.server.epoch.LeaderEpochFileCacheTest > shouldNotResetEpochHistoryHeadIfUndefinedPassed STARTED
kafka.server.epoch.LeaderEpochFileCacheTest > shouldNotResetEpochHistoryHeadIfUndefinedPassed PASSED
kafka.server.epoch.LeaderEpochIntegrationTest > shouldIncreaseLeaderEpochBetweenLeaderRestarts STARTED
kafka.server.epoch.LeaderEpochIntegrationTest > shouldIncreaseLeaderEpochBetweenLeaderRestarts PASSED
kafka.server.epoch.LeaderEpochIntegrationTest > shouldAddCurrentLeaderEpochToMessagesAsTheyAreWrittenToLeader STARTED
kafka.server.epoch.LeaderEpochIntegrationTest > shouldAddCurrentLeaderEpochToMessagesAsTheyAreWrittenToLeader PASSED
kafka.server.epoch.LeaderEpochIntegrationTest > shouldSendLeaderEpochRequestAndGetAResponse STARTED
kafka.server.epoch.LeaderEpochIntegrationTest > shouldSendLeaderEpochRequestAndGetAResponse PASSED
kafka.server.epoch.OffsetsForLeaderEpochTest > shouldGetEpochsFromReplica STARTED
kafka.server.epoch.OffsetsForLeaderEpochTest > shouldGetEpochsFromReplica PASSED
kafka.server.epoch.OffsetsForLeaderEpochTest > shouldReturnUnknownTopicOrPartitionIfThrown STARTED
kafka.server.epoch.OffsetsForLeaderEpochTest > shouldReturnUnknownTopicOrPartitionIfThrown PASSED
kafka.server.epoch.OffsetsForLeaderEpochTest > shouldReturnNoLeaderForPartitionIfThrown STARTED
kafka.server.epoch.OffsetsForLeaderEpochTest > shouldReturnNoLeaderForPartitionIfThrown PASSED
kafka.server.epoch.EpochDrivenReplicationProtocolAcceptanceTest > shouldSurviveFastLeaderChange STARTED
kafka.server.epoch.EpochDrivenReplicationProtocolAcceptanceTest > shouldSurviveFastLeaderChange PASSED
kafka.server.epoch.EpochDrivenReplicationProtocolAcceptanceTest > offsetsShouldNotGoBackwards STARTED
kafka.server.epoch.EpochDrivenReplicationProtocolAcceptanceTest > offsetsShouldNotGoBackwards PASSED
kafka.server.epoch.EpochDrivenReplicationProtocolAcceptanceTest > shouldFollowLeaderEpochBasicWorkflow STARTED
kafka.server.epoch.EpochDrivenReplicationProtocolAcceptanceTest > shouldFollowLeaderEpochBasicWorkflow PASSED
kafka.server.epoch.EpochDrivenReplicationProtocolAcceptanceTest > shouldNotAllowDivergentLogs STARTED
kafka.server.epoch.EpochDrivenReplicationProtocolAcceptanceTest > shouldNotAllowDivergentLogs PASSED
kafka.server.epoch.EpochDrivenReplicationProtocolAcceptanceTest > logsShouldNotDivergeOnUncleanLeaderElections STARTED
kafka.server.epoch.EpochDrivenReplicationProtocolAcceptanceTest > logsShouldNotDivergeOnUncleanLeaderElections PASSED
kafka.server.ScramServerStartupTest > testAuthentications STARTED
kafka.server.ScramServerStartupTest > testAuthentications PASSED
kafka.server.MultipleListenersWithAdditionalJaasContextTest > testProduceConsume STARTED
kafka.server.MultipleListenersWithAdditionalJaasContextTest > testProduceConsume PASSED
kafka.server.OffsetCommitTest > testUpdateOffsets STARTED
kafka.server.OffsetCommitTest > testUpdateOffsets PASSED
kafka.server.OffsetCommitTest > testLargeMetadataPayload STARTED
kafka.server.OffsetCommitTest > testLargeMetadataPayload PASSED
kafka.server.OffsetCommitTest > testOffsetsDeleteAfterTopicDeletion STARTED
kafka.server.OffsetCommitTest > testOffsetsDeleteAfterTopicDeletion PASSED
kafka.server.OffsetCommitTest > testCommitAndFetchOffsets STARTED
kafka.server.OffsetCommitTest > testCommitAndFetchOffsets PASSED
kafka.server.OffsetCommitTest > testOffsetExpiration STARTED
kafka.server.OffsetCommitTest > testOffsetExpiration PASSED
kafka.server.OffsetCommitTest > testNonExistingTopicOffsetCommit STARTED
kafka.server.OffsetCommitTest > testNonExistingTopicOffsetCommit PASSED
kafka.server.ReplicationQuotasTest > shouldBootstrapTwoBrokersWithLeaderThrottle STARTED
kafka.server.ReplicationQuotasTest > shouldBootstrapTwoBrokersWithLeaderThrottle PASSED
kafka.server.ReplicationQuotasTest > shouldThrottleOldSegments STARTED
kafka.server.ReplicationQuotasTest > shouldThrottleOldSegments PASSED
kafka.server.ReplicationQuotasTest > shouldBootstrapTwoBrokersWithFollowerThrottle STARTED
kafka.server.ReplicationQuotasTest > shouldBootstrapTwoBrokersWithFollowerThrottle PASSED
kafka.server.EdgeCaseRequestTest > testInvalidApiVersionRequest STARTED
kafka.server.EdgeCaseRequestTest > testInvalidApiVersionRequest PASSED
kafka.server.EdgeCaseRequestTest > testMalformedHeaderRequest STARTED
kafka.server.EdgeCaseRequestTest > testMalformedHeaderRequest PASSED
kafka.server.EdgeCaseRequestTest > testProduceRequestWithNullClientId STARTED
kafka.server.EdgeCaseRequestTest > testProduceRequestWithNullClientId PASSED
kafka.server.EdgeCaseRequestTest > testInvalidApiKeyRequest STARTED
kafka.server.EdgeCaseRequestTest > testInvalidApiKeyRequest PASSED
kafka.server.EdgeCaseRequestTest > testHeaderOnlyRequest STARTED
kafka.server.EdgeCaseRequestTest > testHeaderOnlyRequest PASSED
kafka.server.SaslApiVersionsRequestTest > testApiVersionsRequestWithUnsupportedVersion STARTED
kafka.server.SaslApiVersionsRequestTest > testApiVersionsRequestWithUnsupportedVersion PASSED
kafka.server.SaslApiVersionsRequestTest > testApiVersionsRequestBeforeSaslHandshakeRequest STARTED
kafka.server.SaslApiVersionsRequestTest > testApiVersionsRequestBeforeSaslHandshakeRequest PASSED
kafka.server.SaslApiVersionsRequestTest > testApiVersionsRequestAfterSaslHandshakeRequest STARTED
kafka.server.SaslApiVersionsRequestTest > testApiVersionsRequestAfterSaslHandshakeRequest PASSED
kafka.metrics.MetricsTest > testMetricsReporterAfterDeletingTopic STARTED
kafka.metrics.MetricsTest > testMetricsReporterAfterDeletingTopic PASSED
kafka.metrics.MetricsTest > testSessionExpireListenerMetrics STARTED
kafka.metrics.MetricsTest > testSessionExpireListenerMetrics PASSED
kafka.metrics.MetricsTest > testBrokerTopicMetricsUnregisteredAfterDeletingTopic STARTED
kafka.metrics.MetricsTest > testBrokerTopicMetricsUnregisteredAfterDeletingTopic PASSED
kafka.metrics.MetricsTest > testClusterIdMetric STARTED
kafka.metrics.MetricsTest > testClusterIdMetric PASSED
kafka.metrics.MetricsTest > testControllerMetrics STARTED
kafka.metrics.MetricsTest > testControllerMetrics PASSED
kafka.metrics.MetricsTest > testWindowsStyleTagNames STARTED
kafka.metrics.MetricsTest > testWindowsStyleTagNames PASSED
kafka.metrics.MetricsTest > testMetricsLeak STARTED
kafka.metrics.MetricsTest > testMetricsLeak FAILED
java.lang.AssertionError: expected:<1751> but was:<1754>
at org.junit.Assert.fail(Assert.java:88)
at org.junit.Assert.failNotEquals(Assert.java:834)
at org.junit.Assert.assertEquals(Assert.java:645)
at org.junit.Assert.assertEquals(Assert.java:631)
at kafka.metrics.MetricsTest$$anonfun$testMetricsLeak$1.apply$mcVI$sp(MetricsTest.scala:68)
at scala.collection.immutable.Range.foreach$mVc$sp(Range.scala:160)
at kafka.metrics.MetricsTest.testMetricsLeak(MetricsTest.scala:66)
kafka.metrics.MetricsTest > testBrokerTopicMetricsBytesInOut STARTED
kafka.metrics.MetricsTest > testBrokerTopicMetricsBytesInOut PASSED
kafka.metrics.KafkaTimerTest > testKafkaTimer STARTED
kafka.metrics.KafkaTimerTest > testKafkaTimer PASSED
1952 tests completed, 1 failed, 5 skipped
:kafka-trunk-jdk8:core:test FAILED
:test_core_2_11 FAILED
FAILURE: Build failed with an exception.
* What went wrong:
Execution failed for task ':kafka-trunk-jdk8:core:test'.
> There were failing tests. See the report at: file://<https://builds.apache.org/job/kafka-trunk-jdk8/ws/core/build/reports/tests/test/index.html>
* Try:
Run with --stacktrace option to get the stack trace. Run with --info or --debug option to get more log output. Run with --scan to get full insights.
* Get more help at https://help.gradle.org
BUILD FAILED in 1h 2m 48s
24 actionable tasks: 3 executed, 21 up-to-date
Build step 'Execute shell' marked build as failure
[FINDBUGS] Collecting findbugs analysis files...
Setting GRADLE_4_4_HOME=/home/jenkins/tools/gradle/4.4
[FINDBUGS] Searching for all files in <https://builds.apache.org/job/kafka-trunk-jdk8/ws/> that match the pattern **/build/reports/findbugs/*.xml
[FINDBUGS] Parsing 1 file in <https://builds.apache.org/job/kafka-trunk-jdk8/ws/>
[FINDBUGS] Successfully parsed file <https://builds.apache.org/job/kafka-trunk-jdk8/ws/core/build/reports/findbugs/main.xml> with 0 unique warnings and 0 duplicates.
Setting GRADLE_4_4_HOME=/home/jenkins/tools/gradle/4.4
Setting GRADLE_4_4_HOME=/home/jenkins/tools/gradle/4.4
<Git Blamer> Using GitBlamer to create author and commit information for all warnings.
<Git Blamer> GIT_COMMIT=cbce95d9a5273a072c6c1e3d489760d5d52e638e, workspace=<https://builds.apache.org/job/kafka-trunk-jdk8/ws/>
[FINDBUGS] Computing warning deltas based on reference build #2654
Recording test results
Setting GRADLE_4_4_HOME=/home/jenkins/tools/gradle/4.4
Setting GRADLE_4_4_HOME=/home/jenkins/tools/gradle/4.4
Not sending mail to unregistered user github@alasdairhodge.co.uk
Not sending mail to unregistered user wangguoz@gmail.com