You are viewing a plain text version of this content. The canonical link for it is here.
Posted to dev@lucene.apache.org by Policeman Jenkins Server <je...@thetaphi.de> on 2015/05/19 23:52:15 UTC
[JENKINS] Lucene-Solr-trunk-Linux (64bit/jdk1.9.0-ea-b60) - Build #
12746 - Failure!
Build: http://jenkins.thetaphi.de/job/Lucene-Solr-trunk-Linux/12746/
Java: 64bit/jdk1.9.0-ea-b60 -XX:-UseCompressedOops -XX:+UseG1GC
2 tests failed.
FAILED: junit.framework.TestSuite.org.apache.lucene.analysis.snowball.TestSnowballVocab
Error Message:
Suite timeout exceeded (>= 7200000 msec).
Stack Trace:
java.lang.Exception: Suite timeout exceeded (>= 7200000 msec).
at __randomizedtesting.SeedInfo.seed([7FBAD445ED608074]:0)
FAILED: org.apache.lucene.analysis.snowball.TestSnowballVocab.testStemmers
Error Message:
Test abandoned because suite timeout was reached.
Stack Trace:
java.lang.Exception: Test abandoned because suite timeout was reached.
at __randomizedtesting.SeedInfo.seed([7FBAD445ED608074]:0)
Build Log:
[...truncated 3199 lines...]
[junit4] Suite: org.apache.lucene.analysis.snowball.TestSnowballVocab
[junit4] 2> mag 19, 2015 6:51:40 PM com.carrotsearch.randomizedtesting.ThreadLeakControl$2 evaluate
[junit4] 2> WARNING: Suite execution timed out: org.apache.lucene.analysis.snowball.TestSnowballVocab
[junit4] 2> 1) Thread[id=13, name=JUnit4-serializer-daemon, state=TIMED_WAITING, group=main]
[junit4] 2> at java.lang.Thread.sleep(Native Method)
[junit4] 2> at com.carrotsearch.ant.tasks.junit4.events.Serializer$1.run(Serializer.java:47)
[junit4] 2> 2) Thread[id=1, name=main, state=WAITING, group=main]
[junit4] 2> at java.lang.Object.wait(Native Method)
[junit4] 2> at java.lang.Thread.join(Thread.java:1249)
[junit4] 2> at java.lang.Thread.join(Thread.java:1323)
[junit4] 2> at com.carrotsearch.randomizedtesting.RandomizedRunner.runSuite(RandomizedRunner.java:578)
[junit4] 2> at com.carrotsearch.randomizedtesting.RandomizedRunner.run(RandomizedRunner.java:444)
[junit4] 2> at com.carrotsearch.ant.tasks.junit4.slave.SlaveMain.execute(SlaveMain.java:199)
[junit4] 2> at com.carrotsearch.ant.tasks.junit4.slave.SlaveMain.main(SlaveMain.java:310)
[junit4] 2> at com.carrotsearch.ant.tasks.junit4.slave.SlaveMainSafe.main(SlaveMainSafe.java:12)
[junit4] 2> 3) Thread[id=148, name=SUITE-TestSnowballVocab-seed#[7FBAD445ED608074], state=RUNNABLE, group=TGRP-TestSnowballVocab]
[junit4] 2> at java.lang.Thread.getStackTrace(Thread.java:1556)
[junit4] 2> at com.carrotsearch.randomizedtesting.ThreadLeakControl.getThreadsWithTraces(ThreadLeakControl.java:690)
[junit4] 2> at com.carrotsearch.randomizedtesting.ThreadLeakControl.formatThreadStacksFull(ThreadLeakControl.java:679)
[junit4] 2> at com.carrotsearch.randomizedtesting.ThreadLeakControl.access$900(ThreadLeakControl.java:62)
[junit4] 2> at com.carrotsearch.randomizedtesting.ThreadLeakControl$2.evaluate(ThreadLeakControl.java:412)
[junit4] 2> at com.carrotsearch.randomizedtesting.RandomizedRunner.runSuite(RandomizedRunner.java:651)
[junit4] 2> at com.carrotsearch.randomizedtesting.RandomizedRunner.access$200(RandomizedRunner.java:138)
[junit4] 2> at com.carrotsearch.randomizedtesting.RandomizedRunner$1.run(RandomizedRunner.java:568)
[junit4] 2> 4) Thread[id=149, name=TEST-TestSnowballVocab.testStemmers-seed#[7FBAD445ED608074], state=RUNNABLE, group=TGRP-TestSnowballVocab]
[junit4] 2> at org.tartarus.snowball.ext.FrenchStemmer.stem(FrenchStemmer.java:1379)
[junit4] 2> at org.apache.lucene.analysis.snowball.SnowballFilter.incrementToken(SnowballFilter.java:95)
[junit4] 2> at org.apache.lucene.analysis.BaseTokenStreamTestCase.checkResetException(BaseTokenStreamTestCase.java:400)
[junit4] 2> at org.apache.lucene.analysis.BaseTokenStreamTestCase.assertAnalyzesTo(BaseTokenStreamTestCase.java:352)
[junit4] 2> at org.apache.lucene.analysis.BaseTokenStreamTestCase.assertAnalyzesTo(BaseTokenStreamTestCase.java:362)
[junit4] 2> at org.apache.lucene.analysis.BaseTokenStreamTestCase.checkOneTerm(BaseTokenStreamTestCase.java:423)
[junit4] 2> at org.apache.lucene.analysis.VocabularyAssert.assertVocabulary(VocabularyAssert.java:47)
[junit4] 2> at org.apache.lucene.analysis.VocabularyAssert.assertVocabulary(VocabularyAssert.java:73)
[junit4] 2> at org.apache.lucene.analysis.snowball.TestSnowballVocab.assertCorrectOutput(TestSnowballVocab.java:80)
[junit4] 2> at org.apache.lucene.analysis.snowball.TestSnowballVocab.testStemmers(TestSnowballVocab.java:45)
[junit4] 2> at sun.reflect.NativeMethodAccessorImpl.invoke0(Native Method)
[junit4] 2> at sun.reflect.NativeMethodAccessorImpl.invoke(NativeMethodAccessorImpl.java:62)
[junit4] 2> at sun.reflect.DelegatingMethodAccessorImpl.invoke(DelegatingMethodAccessorImpl.java:43)
[junit4] 2> at java.lang.reflect.Method.invoke(Method.java:502)
[junit4] 2> at com.carrotsearch.randomizedtesting.RandomizedRunner.invoke(RandomizedRunner.java:1627)
[junit4] 2> at com.carrotsearch.randomizedtesting.RandomizedRunner$6.evaluate(RandomizedRunner.java:836)
[junit4] 2> at com.carrotsearch.randomizedtesting.RandomizedRunner$7.evaluate(RandomizedRunner.java:872)
[junit4] 2> at com.carrotsearch.randomizedtesting.RandomizedRunner$8.evaluate(RandomizedRunner.java:886)
[junit4] 2> at org.apache.lucene.util.TestRuleSetupTeardownChained$1.evaluate(TestRuleSetupTeardownChained.java:50)
[junit4] 2> at org.apache.lucene.util.AbstractBeforeAfterRule$1.evaluate(AbstractBeforeAfterRule.java:46)
[junit4] 2> at org.apache.lucene.util.TestRuleThreadAndTestName$1.evaluate(TestRuleThreadAndTestName.java:49)
[junit4] 2> at org.apache.lucene.util.TestRuleIgnoreAfterMaxFailures$1.evaluate(TestRuleIgnoreAfterMaxFailures.java:65)
[junit4] 2> at org.apache.lucene.util.TestRuleMarkFailure$1.evaluate(TestRuleMarkFailure.java:48)
[junit4] 2> at com.carrotsearch.randomizedtesting.rules.StatementAdapter.evaluate(StatementAdapter.java:36)
[junit4] 2> at com.carrotsearch.randomizedtesting.ThreadLeakControl$StatementRunner.run(ThreadLeakControl.java:365)
[junit4] 2> at com.carrotsearch.randomizedtesting.ThreadLeakControl.forkTimeoutingTask(ThreadLeakControl.java:798)
[junit4] 2> at com.carrotsearch.randomizedtesting.ThreadLeakControl$3.evaluate(ThreadLeakControl.java:458)
[junit4] 2> at com.carrotsearch.randomizedtesting.RandomizedRunner.runSingleTest(RandomizedRunner.java:845)
[junit4] 2> at com.carrotsearch.randomizedtesting.RandomizedRunner$3.evaluate(RandomizedRunner.java:747)
[junit4] 2> at com.carrotsearch.randomizedtesting.RandomizedRunner$4.evaluate(RandomizedRunner.java:781)
[junit4] 2> at com.carrotsearch.randomizedtesting.RandomizedRunner$5.evaluate(RandomizedRunner.java:792)
[junit4] 2> at org.apache.lucene.util.AbstractBeforeAfterRule$1.evaluate(AbstractBeforeAfterRule.java:46)
[junit4] 2> at com.carrotsearch.randomizedtesting.rules.StatementAdapter.evaluate(StatementAdapter.java:36)
[junit4] 2> at org.apache.lucene.util.TestRuleStoreClassName$1.evaluate(TestRuleStoreClassName.java:42)
[junit4] 2> at com.carrotsearch.randomizedtesting.rules.NoShadowingOrOverridesOnMethodsRule$1.evaluate(NoShadowingOrOverridesOnMethodsRule.java:39)
[junit4] 2> at com.carrotsearch.randomizedtesting.rules.NoShadowingOrOverridesOnMethodsRule$1.evaluate(NoShadowingOrOverridesOnMethodsRule.java:39)
[junit4] 2> at com.carrotsearch.randomizedtesting.rules.StatementAdapter.evaluate(StatementAdapter.java:36)
[junit4] 2> at com.carrotsearch.randomizedtesting.rules.StatementAdapter.evaluate(StatementAdapter.java:36)
[junit4] 2> at com.carrotsearch.randomizedtesting.rules.StatementAdapter.evaluate(StatementAdapter.java:36)
[junit4] 2> at org.apache.lucene.util.TestRuleAssertionsRequired$1.evaluate(TestRuleAssertionsRequired.java:54)
[junit4] 2> at org.apache.lucene.util.TestRuleMarkFailure$1.evaluate(TestRuleMarkFailure.java:48)
[junit4] 2> at org.apache.lucene.util.TestRuleIgnoreAfterMaxFailures$1.evaluate(TestRuleIgnoreAfterMaxFailures.java:65)
[junit4] 2> at org.apache.lucene.util.TestRuleIgnoreTestSuites$1.evaluate(TestRuleIgnoreTestSuites.java:55)
[junit4] 2> at com.carrotsearch.randomizedtesting.rules.StatementAdapter.evaluate(StatementAdapter.java:36)
[junit4] 2> at com.carrotsearch.randomizedtesting.ThreadLeakControl$StatementRunner.run(ThreadLeakControl.java:365)
[junit4] 2> at java.lang.Thread.run(Thread.java:745)
[junit4] 2> NOTE: reproduce with: ant test -Dtestcase=TestSnowballVocab -Dtests.method=testStemmers -Dtests.seed=7FBAD445ED608074 -Dtests.multiplier=3 -Dtests.slow=true -Dtests.locale=it -Dtests.timezone=America/Cordoba -Dtests.asserts=true -Dtests.file.encoding=US-ASCII
[junit4] ERROR 7200s J2 | TestSnowballVocab.testStemmers <<<
[junit4] > Throwable #1: java.lang.Exception: Test abandoned because suite timeout was reached.
[junit4] > at __randomizedtesting.SeedInfo.seed([7FBAD445ED608074]:0)
[junit4] 2> mag 19, 2015 6:51:40 PM com.carrotsearch.randomizedtesting.ThreadLeakControl checkThreadLeaks
[junit4] 2> WARNING: Will linger awaiting termination of 1 leaked thread(s).
[junit4] 2> mag 19, 2015 6:52:00 PM com.carrotsearch.randomizedtesting.ThreadLeakControl checkThreadLeaks
[junit4] 2> SEVERE: 1 thread leaked from SUITE scope at org.apache.lucene.analysis.snowball.TestSnowballVocab:
[junit4] 2> 1) Thread[id=149, name=TEST-TestSnowballVocab.testStemmers-seed#[7FBAD445ED608074], state=RUNNABLE, group=TGRP-TestSnowballVocab]
[junit4] 2> at org.tartarus.snowball.ext.FrenchStemmer.stem(FrenchStemmer.java:1379)
[junit4] 2> at org.apache.lucene.analysis.snowball.SnowballFilter.incrementToken(SnowballFilter.java:95)
[junit4] 2> at org.apache.lucene.analysis.BaseTokenStreamTestCase.checkResetException(BaseTokenStreamTestCase.java:400)
[junit4] 2> at org.apache.lucene.analysis.BaseTokenStreamTestCase.assertAnalyzesTo(BaseTokenStreamTestCase.java:352)
[junit4] 2> at org.apache.lucene.analysis.BaseTokenStreamTestCase.assertAnalyzesTo(BaseTokenStreamTestCase.java:362)
[junit4] 2> at org.apache.lucene.analysis.BaseTokenStreamTestCase.checkOneTerm(BaseTokenStreamTestCase.java:423)
[junit4] 2> at org.apache.lucene.analysis.VocabularyAssert.assertVocabulary(VocabularyAssert.java:47)
[junit4] 2> at org.apache.lucene.analysis.VocabularyAssert.assertVocabulary(VocabularyAssert.java:73)
[junit4] 2> at org.apache.lucene.analysis.snowball.TestSnowballVocab.assertCorrectOutput(TestSnowballVocab.java:80)
[junit4] 2> at org.apache.lucene.analysis.snowball.TestSnowballVocab.testStemmers(TestSnowballVocab.java:45)
[junit4] 2> at sun.reflect.NativeMethodAccessorImpl.invoke0(Native Method)
[junit4] 2> at sun.reflect.NativeMethodAccessorImpl.invoke(NativeMethodAccessorImpl.java:62)
[junit4] 2> at sun.reflect.DelegatingMethodAccessorImpl.invoke(DelegatingMethodAccessorImpl.java:43)
[junit4] 2> at java.lang.reflect.Method.invoke(Method.java:502)
[junit4] 2> at com.carrotsearch.randomizedtesting.RandomizedRunner.invoke(RandomizedRunner.java:1627)
[junit4] 2> at com.carrotsearch.randomizedtesting.RandomizedRunner$6.evaluate(RandomizedRunner.java:836)
[junit4] 2> at com.carrotsearch.randomizedtesting.RandomizedRunner$7.evaluate(RandomizedRunner.java:872)
[junit4] 2> at com.carrotsearch.randomizedtesting.RandomizedRunner$8.evaluate(RandomizedRunner.java:886)
[junit4] 2> at org.apache.lucene.util.TestRuleSetupTeardownChained$1.evaluate(TestRuleSetupTeardownChained.java:50)
[junit4] 2> at org.apache.lucene.util.AbstractBeforeAfterRule$1.evaluate(AbstractBeforeAfterRule.java:46)
[junit4] 2> at org.apache.lucene.util.TestRuleThreadAndTestName$1.evaluate(TestRuleThreadAndTestName.java:49)
[junit4] 2> at org.apache.lucene.util.TestRuleIgnoreAfterMaxFailures$1.evaluate(TestRuleIgnoreAfterMaxFailures.java:65)
[junit4] 2> at org.apache.lucene.util.TestRuleMarkFailure$1.evaluate(TestRuleMarkFailure.java:48)
[junit4] 2> at com.carrotsearch.randomizedtesting.rules.StatementAdapter.evaluate(StatementAdapter.java:36)
[junit4] 2> at com.carrotsearch.randomizedtesting.ThreadLeakControl$StatementRunner.run(ThreadLeakControl.java:365)
[junit4] 2> at com.carrotsearch.randomizedtesting.ThreadLeakControl.forkTimeoutingTask(ThreadLeakControl.java:798)
[junit4] 2> at com.carrotsearch.randomizedtesting.ThreadLeakControl$3.evaluate(ThreadLeakControl.java:458)
[junit4] 2> at com.carrotsearch.randomizedtesting.RandomizedRunner.runSingleTest(RandomizedRunner.java:845)
[junit4] 2> at com.carrotsearch.randomizedtesting.RandomizedRunner$3.evaluate(RandomizedRunner.java:747)
[junit4] 2> at com.carrotsearch.randomizedtesting.RandomizedRunner$4.evaluate(RandomizedRunner.java:781)
[junit4] 2> at com.carrotsearch.randomizedtesting.RandomizedRunner$5.evaluate(RandomizedRunner.java:792)
[junit4] 2> at org.apache.lucene.util.AbstractBeforeAfterRule$1.evaluate(AbstractBeforeAfterRule.java:46)
[junit4] 2> at com.carrotsearch.randomizedtesting.rules.StatementAdapter.evaluate(StatementAdapter.java:36)
[junit4] 2> at org.apache.lucene.util.TestRuleStoreClassName$1.evaluate(TestRuleStoreClassName.java:42)
[junit4] 2> at com.carrotsearch.randomizedtesting.rules.NoShadowingOrOverridesOnMethodsRule$1.evaluate(NoShadowingOrOverridesOnMethodsRule.java:39)
[junit4] 2> at com.carrotsearch.randomizedtesting.rules.NoShadowingOrOverridesOnMethodsRule$1.evaluate(NoShadowingOrOverridesOnMethodsRule.java:39)
[junit4] 2> at com.carrotsearch.randomizedtesting.rules.StatementAdapter.evaluate(StatementAdapter.java:36)
[junit4] 2> at com.carrotsearch.randomizedtesting.rules.StatementAdapter.evaluate(StatementAdapter.java:36)
[junit4] 2> at com.carrotsearch.randomizedtesting.rules.StatementAdapter.evaluate(StatementAdapter.java:36)
[junit4] 2> at org.apache.lucene.util.TestRuleAssertionsRequired$1.evaluate(TestRuleAssertionsRequired.java:54)
[junit4] 2> at org.apache.lucene.util.TestRuleMarkFailure$1.evaluate(TestRuleMarkFailure.java:48)
[junit4] 2> at org.apache.lucene.util.TestRuleIgnoreAfterMaxFailures$1.evaluate(TestRuleIgnoreAfterMaxFailures.java:65)
[junit4] 2> at org.apache.lucene.util.TestRuleIgnoreTestSuites$1.evaluate(TestRuleIgnoreTestSuites.java:55)
[junit4] 2> at com.carrotsearch.randomizedtesting.rules.StatementAdapter.evaluate(StatementAdapter.java:36)
[junit4] 2> at com.carrotsearch.randomizedtesting.ThreadLeakControl$StatementRunner.run(ThreadLeakControl.java:365)
[junit4] 2> at java.lang.Thread.run(Thread.java:745)
[junit4] 2> mag 19, 2015 6:52:00 PM com.carrotsearch.randomizedtesting.ThreadLeakControl tryToInterruptAll
[junit4] 2> INFO: Starting to interrupt leaked threads:
[junit4] 2> 1) Thread[id=149, name=TEST-TestSnowballVocab.testStemmers-seed#[7FBAD445ED608074], state=RUNNABLE, group=TGRP-TestSnowballVocab]
[junit4] 2> mag 19, 2015 6:52:03 PM com.carrotsearch.randomizedtesting.ThreadLeakControl tryToInterruptAll
[junit4] 2> SEVERE: There are still zombie threads that couldn't be terminated:
[junit4] 2> 1) Thread[id=149, name=TEST-TestSnowballVocab.testStemmers-seed#[7FBAD445ED608074], state=RUNNABLE, group=TGRP-TestSnowballVocab]
[junit4] 2> at org.tartarus.snowball.ext.FrenchStemmer.stem(FrenchStemmer.java:1379)
[junit4] 2> at org.apache.lucene.analysis.snowball.SnowballFilter.incrementToken(SnowballFilter.java:95)
[junit4] 2> at org.apache.lucene.analysis.BaseTokenStreamTestCase.checkResetException(BaseTokenStreamTestCase.java:400)
[junit4] 2> at org.apache.lucene.analysis.BaseTokenStreamTestCase.assertAnalyzesTo(BaseTokenStreamTestCase.java:352)
[junit4] 2> at org.apache.lucene.analysis.BaseTokenStreamTestCase.assertAnalyzesTo(BaseTokenStreamTestCase.java:362)
[junit4] 2> at org.apache.lucene.analysis.BaseTokenStreamTestCase.checkOneTerm(BaseTokenStreamTestCase.java:423)
[junit4] 2> at org.apache.lucene.analysis.VocabularyAssert.assertVocabulary(VocabularyAssert.java:47)
[junit4] 2> at org.apache.lucene.analysis.VocabularyAssert.assertVocabulary(VocabularyAssert.java:73)
[junit4] 2> at org.apache.lucene.analysis.snowball.TestSnowballVocab.assertCorrectOutput(TestSnowballVocab.java:80)
[junit4] 2> at org.apache.lucene.analysis.snowball.TestSnowballVocab.testStemmers(TestSnowballVocab.java:45)
[junit4] 2> at sun.reflect.NativeMethodAccessorImpl.invoke0(Native Method)
[junit4] 2> at sun.reflect.NativeMethodAccessorImpl.invoke(NativeMethodAccessorImpl.java:62)
[junit4] 2> at sun.reflect.DelegatingMethodAccessorImpl.invoke(DelegatingMethodAccessorImpl.java:43)
[junit4] 2> at java.lang.reflect.Method.invoke(Method.java:502)
[junit4] 2> at com.carrotsearch.randomizedtesting.RandomizedRunner.invoke(RandomizedRunner.java:1627)
[junit4] 2> at com.carrotsearch.randomizedtesting.RandomizedRunner$6.evaluate(RandomizedRunner.java:836)
[junit4] 2> at com.carrotsearch.randomizedtesting.RandomizedRunner$7.evaluate(RandomizedRunner.java:872)
[junit4] 2> at com.carrotsearch.randomizedtesting.RandomizedRunner$8.evaluate(RandomizedRunner.java:886)
[junit4] 2> at org.apache.lucene.util.TestRuleSetupTeardownChained$1.evaluate(TestRuleSetupTeardownChained.java:50)
[junit4] 2> at org.apache.lucene.util.AbstractBeforeAfterRule$1.evaluate(AbstractBeforeAfterRule.java:46)
[junit4] 2> at org.apache.lucene.util.TestRuleThreadAndTestName$1.evaluate(TestRuleThreadAndTestName.java:49)
[junit4] 2> at org.apache.lucene.util.TestRuleIgnoreAfterMaxFailures$1.evaluate(TestRuleIgnoreAfterMaxFailures.java:65)
[junit4] 2> at org.apache.lucene.util.TestRuleMarkFailure$1.evaluate(TestRuleMarkFailure.java:48)
[junit4] 2> at com.carrotsearch.randomizedtesting.rules.StatementAdapter.evaluate(StatementAdapter.java:36)
[junit4] 2> at com.carrotsearch.randomizedtesting.ThreadLeakControl$StatementRunner.run(ThreadLeakControl.java:365)
[junit4] 2> at com.carrotsearch.randomizedtesting.ThreadLeakControl.forkTimeoutingTask(ThreadLeakControl.java:798)
[junit4] 2> at com.carrotsearch.randomizedtesting.ThreadLeakControl$3.evaluate(ThreadLeakControl.java:458)
[junit4] 2> at com.carrotsearch.randomizedtesting.RandomizedRunner.runSingleTest(RandomizedRunner.java:845)
[junit4] 2> at com.carrotsearch.randomizedtesting.RandomizedRunner$3.evaluate(RandomizedRunner.java:747)
[junit4] 2> at com.carrotsearch.randomizedtesting.RandomizedRunner$4.evaluate(RandomizedRunner.java:781)
[junit4] 2> at com.carrotsearch.randomizedtesting.RandomizedRunner$5.evaluate(RandomizedRunner.java:792)
[junit4] 2> at org.apache.lucene.util.AbstractBeforeAfterRule$1.evaluate(AbstractBeforeAfterRule.java:46)
[junit4] 2> at com.carrotsearch.randomizedtesting.rules.StatementAdapter.evaluate(StatementAdapter.java:36)
[junit4] 2> at org.apache.lucene.util.TestRuleStoreClassName$1.evaluate(TestRuleStoreClassName.java:42)
[junit4] 2> at com.carrotsearch.randomizedtesting.rules.NoShadowingOrOverridesOnMethodsRule$1.evaluate(NoShadowingOrOverridesOnMethodsRule.java:39)
[junit4] 2> at com.carrotsearch.randomizedtesting.rules.NoShadowingOrOverridesOnMethodsRule$1.evaluate(NoShadowingOrOverridesOnMethodsRule.java:39)
[junit4] 2> at com.carrotsearch.randomizedtesting.rules.StatementAdapter.evaluate(StatementAdapter.java:36)
[junit4] 2> at com.carrotsearch.randomizedtesting.rules.StatementAdapter.evaluate(StatementAdapter.java:36)
[junit4] 2> at com.carrotsearch.randomizedtesting.rules.StatementAdapter.evaluate(StatementAdapter.java:36)
[junit4] 2> at org.apache.lucene.util.TestRuleAssertionsRequired$1.evaluate(TestRuleAssertionsRequired.java:54)
[junit4] 2> at org.apache.lucene.util.TestRuleMarkFailure$1.evaluate(TestRuleMarkFailure.java:48)
[junit4] 2> at org.apache.lucene.util.TestRuleIgnoreAfterMaxFailures$1.evaluate(TestRuleIgnoreAfterMaxFailures.java:65)
[junit4] 2> at org.apache.lucene.util.TestRuleIgnoreTestSuites$1.evaluate(TestRuleIgnoreTestSuites.java:55)
[junit4] 2> at com.carrotsearch.randomizedtesting.rules.StatementAdapter.evaluate(StatementAdapter.java:36)
[junit4] 2> at com.carrotsearch.randomizedtesting.ThreadLeakControl$StatementRunner.run(ThreadLeakControl.java:365)
[junit4] 2> at java.lang.Thread.run(Thread.java:745)
[junit4] 2> NOTE: test params are: codec=Asserting(Lucene50): {}, docValues:{}, sim=RandomSimilarityProvider(queryNorm=true,coord=no): {}, locale=it, timezone=America/Cordoba
[junit4] 2> NOTE: Linux 3.13.0-52-generic amd64/Oracle Corporation 1.9.0-ea (64-bit)/cpus=12,threads=2,free=245344712,total=530579456
[junit4] 2> NOTE: All tests run in this JVM: [TestCondition2, TestHyphenatedWordsFilter, TestUAX29URLEmailAnalyzer, TestFrenchLightStemFilter, TokenRangeSinkTokenizerTest, TestCJKAnalyzer, TestOnlyInCompound, TestDutchAnalyzer, TestEmptyTokenStream, Test64kAffixes, TestIndonesianStemmer, TestItalianLightStemFilterFactory, TestTurkishLowerCaseFilterFactory, TestRandomChains, TestBasqueAnalyzer, TestArabicNormalizationFilter, TestNorwegianMinimalStemFilterFactory, TestCaseInsensitive, TestGermanMinimalStemFilterFactory, TestDanishAnalyzer, TestStemmerOverrideFilter, TestKStemFilterFactory, TestHunspellStemFilter, TestCustomAnalyzer, TestCJKWidthFilter, TestScandinavianNormalizationFilterFactory, TestArmenianAnalyzer, TestHTMLStripCharFilterFactory, TestFullStrip, NGramTokenizerTest, TestGermanLightStemFilter, TestDictionaryCompoundWordTokenFilterFactory, TestSynonymFilterFactory, CommonGramsFilterTest, TestHomonyms, TestSnowballVocab]
[junit4] 2> NOTE: reproduce with: ant test -Dtestcase=TestSnowballVocab -Dtests.seed=7FBAD445ED608074 -Dtests.multiplier=3 -Dtests.slow=true -Dtests.locale=it -Dtests.timezone=America/Cordoba -Dtests.asserts=true -Dtests.file.encoding=US-ASCII
[junit4] ERROR 0.00s J2 | TestSnowballVocab (suite) <<<
[junit4] > Throwable #1: java.lang.Exception: Suite timeout exceeded (>= 7200000 msec).
[junit4] > at __randomizedtesting.SeedInfo.seed([7FBAD445ED608074]:0)
[junit4] Completed [261/270] on J2 in 7223.12s, 1 test, 2 errors <<< FAILURES!
[...truncated 39 lines...]
BUILD FAILED
/home/jenkins/workspace/Lucene-Solr-trunk-Linux/build.xml:526: The following error occurred while executing this line:
/home/jenkins/workspace/Lucene-Solr-trunk-Linux/build.xml:474: The following error occurred while executing this line:
/home/jenkins/workspace/Lucene-Solr-trunk-Linux/build.xml:61: The following error occurred while executing this line:
/home/jenkins/workspace/Lucene-Solr-trunk-Linux/extra-targets.xml:39: The following error occurred while executing this line:
/home/jenkins/workspace/Lucene-Solr-trunk-Linux/lucene/build.xml:466: The following error occurred while executing this line:
/home/jenkins/workspace/Lucene-Solr-trunk-Linux/lucene/common-build.xml:2145: The following error occurred while executing this line:
/home/jenkins/workspace/Lucene-Solr-trunk-Linux/lucene/analysis/build.xml:106: The following error occurred while executing this line:
/home/jenkins/workspace/Lucene-Solr-trunk-Linux/lucene/analysis/build.xml:38: The following error occurred while executing this line:
/home/jenkins/workspace/Lucene-Solr-trunk-Linux/lucene/module-build.xml:58: The following error occurred while executing this line:
/home/jenkins/workspace/Lucene-Solr-trunk-Linux/lucene/common-build.xml:1415: The following error occurred while executing this line:
/home/jenkins/workspace/Lucene-Solr-trunk-Linux/lucene/common-build.xml:973: There were test failures: 270 suites, 1376 tests, 1 suite-level error, 1 error, 40 ignored
Total time: 129 minutes 18 seconds
Build step 'Invoke Ant' marked build as failure
Archiving artifacts
Recording test results
Email was triggered for: Failure - Any
Sending email for trigger: Failure - Any
RE: [JENKINS] Lucene-Solr-trunk-Linux (64bit/jdk1.9.0-ea-b60) - Build # 12746 - Failure!
Posted by Uwe Schindler <uw...@thetaphi.de>.
Hi again,
I now upgraded to latest kernel build:
serv1:/usr/share/doc/linux-image-3.13.0-53-generic# uname -a
Linux serv1 3.13.0-53-generic #88-Ubuntu SMP Wed May 13 18:10:29 UTC 2015 x86_64 x86_64 x86_64 GNU/Linux
I also checked Ubuntu/Debian’s kernel log (which contains all their backported patches):
http://changelogs.ubuntu.com/changelogs/pool/main/l/linux/linux_3.13.0-51.84/changelog
* futex: Ensure get_futex_key_refs() always implies a barrier
- LP: #1387886
This was fixed in Ubuntu kernel 3.13.0-40... So we are fine.
Uwe
-----
Uwe Schindler
H.-H.-Meier-Allee 63, D-28213 Bremen
<http://www.thetaphi.de/> http://www.thetaphi.de
eMail: uwe@thetaphi.de
From: Uwe Schindler [mailto:uwe@thetaphi.de]
Sent: Wednesday, May 20, 2015 9:57 PM
To: dev@lucene.apache.org; 'Michael McCandless'
Subject: RE: [JENKINS] Lucene-Solr-trunk-Linux (64bit/jdk1.9.0-ea-b60) - Build # 12746 - Failure!
Hi Mike,
…and yes, it’s Haswell:
Intel(R) Xeon(R) CPU E5-2620 v3 @ 2.40GHz (12 hyperthreading cores)
Uwe
-----
Uwe Schindler
H.-H.-Meier-Allee 63, D-28213 Bremen
<http://www.thetaphi.de/> http://www.thetaphi.de
eMail: uwe@thetaphi.de
From: Uwe Schindler [mailto:uwe@thetaphi.de]
Sent: Wednesday, May 20, 2015 8:52 PM
To: dev@lucene.apache.org; Michael McCandless
Subject: Re: [JENKINS] Lucene-Solr-trunk-Linux (64bit/jdk1.9.0-ea-b60) - Build # 12746 - Failure!
Hi,
But it could be that Ubuntu has backported it (as described in the mailing list). But Ubuntu is fast and may have ported the fix already, too. We have to check Debian/Ubuntu kernel log.
Uwe
Am 20. Mai 2015 20:48:24 MESZ, schrieb Michael McCandless <lu...@mikemccandless.com>:
Hrmph, OK, that's before the bug showed up (3.14) ...
Mike McCandless
http://blog.mikemccandless.com
On Wed, May 20, 2015 at 2:41 PM, Uwe Schindler <uw...@thetaphi.de> wrote:
This is the very latest kernel from Ubuntu 14.04:
serv1:~# uname -a
Linux serv1 3.13.0-52-generic #86-Ubuntu SMP Mon May 4 04:32:59 UTC 2015 x86_64 x86_64 x86_64 GNU/Linux
Uwe
-----
Uwe Schindler
H.-H.-Meier-Allee 63, D-28213 Bremen
http://www.thetaphi.de
eMail: uwe@thetaphi.de
-----Original Message-----
From: Michael McCandless
[mailto:lucene@mikemccandless.com]
Sent: Wednesday, May 20, 2015 3:35 PM
To: Lucene/Solr dev
Subject: Re: [JENKINS] Lucene-Solr-trunk-Linux (64bit/jdk1.9.0-ea-b60) -
Build # 12746 - Failure!
Uwe, which exact Linux kernel version and CPU is this build box? I'm
wondering if we're maybe hitting this crazy Linux kernel bug:
https://groups.google.com/forum/#!msg/mechanical-
sympathy/QbmpZxp6C64/BonaHiVbEmsJ
I wish the HEARTBEAT would give us more info, e.g. how much CPU is the
JVM process using (are we hung or spinning?), and thread stack traces ... I
know I sound like a broken record Dawid!
Mike McCandless
http://blog.mikemccandless.com
On Wed, May 20, 2015 at 6:05 AM, Dawid Weiss
<da...@cs.put.poznan.pl> wrote:
Does not reproduce for me.
Dawid
On Tue, May 19, 2015 at 11:52 PM, Policeman Jenkins Server
<je...@thetaphi.de> wrote:
Build: http://jenkins.thetaphi.de/job/Lucene-Solr-trunk-Linux/12746/
Java: 64bit/jdk1.9.0-ea-b60 -XX:-UseCompressedOops -XX:+UseG1GC
2 tests failed.
FAILED:
junit.framework.TestSuite.org.apache.lucene.analysis.snowball.TestSno
wballVocab
Error Message:
Suite timeout exceeded (>= 7200000 msec).
Stack Trace:
java.lang.Exception: Suite timeout exceeded (>= 7200000 msec).
at
__randomizedtesting.SeedInfo.seed([7FBAD445ED608074]:0)
FAILED:
org.apache.lucene.analysis.snowball.TestSnowballVocab.testStemmers
Error Message:
Test abandoned because suite timeout was reached.
Stack Trace:
java.lang.Exception: Test abandoned because suite timeout was reached.
at __randomizedtesting.SeedInfo.seed([7FBAD445ED608074]:0)
Build Log:
[...truncated 3199 lines...]
[junit4] Suite: org.apache.lucene.analysis.snowball.TestSnowballVocab
[junit4] 2> mag 19, 2015 6:51:40 PM
com.carrotsearch.randomizedtesting.ThreadLeakControl$2 evaluate
[junit4] 2> WARNING: Suite
execution timed out:
org.apache.lucene.analysis.snowball.TestSnowballVocab
[junit4] 2> 1) Thread[id=13, name=JUnit4-serializer-daemon,
state=TIMED_WAITING, group=main]
[junit4] 2> at java.lang.Thread.sleep(Native Method)
[junit4] 2> at
com.carrotsearch.ant.tasks.junit4.events.Serializer$1.run(Serializer.java:47)
[junit4] 2> 2) Thread[id=1, name=main, state=WAITING, group=main]
[junit4] 2> at java.lang.Object.wait(Native Method)
[junit4] 2> at java.lang.Thread.join(Thread.java:1249)
[junit4] 2> at java.lang.Thread.join(Thread.java:1323)
[junit4] 2> at
com.carrotsearch.randomizedtesting.RandomizedRunner.runSuite(Randomi
zedRunner.java:578)
[junit4] 2> at
com.carrotsearch.randomizedtesting.RandomizedRunner.run(RandomizedR
unner.java:444)
[junit4] 2> at
com.carrotsearch.ant.tasks.junit4.slave.SlaveMain.execute(SlaveMain.java:1
99)
[junit4] 2> at
com.carrotsearch.ant.tasks.junit4.slave.SlaveMain.main(SlaveMain.java:310)
[junit4] 2> at
com.carrotsearch.ant.tasks.junit4.slave.SlaveMainSafe.main(SlaveMainSafe.j
ava:12)
[junit4] 2> 3) Thread[id=148, name=SUITE-TestSnowballVocab-
seed#[7FBAD445ED608074], state=RUNNABLE, group=TGRP-
TestSnowballVocab]
[junit4] 2> at
java.lang.Thread.getStackTrace(Thread.java:1556)
[junit4] 2> at
com.carrotsearch.randomizedtesting.ThreadLeakControl.getThreadsWithTra
ces(ThreadLeakControl.java:690)
[junit4] 2> at
com.carrotsearch.randomizedtesting.ThreadLeakControl.formatThreadStack
sFull(ThreadLeakControl.java:679)
[junit4] 2> at
com.carrotsearch.randomizedtesting.ThreadLeakControl.access$900(ThreadL
eakControl.java:62)
[junit4] 2> at
com.carrotsearch.randomizedtesting.ThreadLeakControl$2.evaluate(ThreadL
eakControl.java:412)
[junit4] 2> at
com.carrotsearch.randomizedtesting.RandomizedRunner.runSuite(Randomi
zedRunner.java:651)
[junit4] 2> at
com.carrotsearch.randomizedtesting.RandomizedRunner.access$200(Rando
mizedRunner.java:138)
[junit4] 2> at
com.carrotsearch.randomizedtesting.RandomizedRunner$1.run(Randomized
Runner.java:568)
[junit4] 2> 4) Thread[id=149,
name=TEST-
TestSnowballVocab.testStemmers-seed#[7FBAD445ED608074],
state=RUNNABLE, group=TGRP-TestSnowballVocab]
[junit4] 2> at
org.tartarus.snowball.ext.FrenchStemmer.stem(FrenchStemmer.java:1379)
[junit4] 2> at
org.apache.lucene.analysis.snowball.SnowballFilter.incrementToken(Snowb
allFilter.java:95)
[junit4] 2> at
org.apache.lucene.analysis.BaseTokenStreamTestCase.checkResetException
(BaseTokenStreamTestCase.java:400)
[junit4] 2> at
org.apache.lucene.analysis.BaseTokenStreamTestCase.assertAnalyzesTo(Bas
eTokenStreamTestCase.java:352)
[junit4] 2> at
org.apache.lucene.analysis.BaseTokenStreamTestCase.assertAnalyzesTo(Bas
eTokenStreamTestCase.java:362)
[junit4] 2> at
org.apache.lucene.analysis.BaseTokenStreamTestCase.checkOneTerm(Base
TokenStreamTestCase.java:423)
[junit4] 2> at
org.apache.lucene.analysis.VocabularyAssert.assertVocabulary(VocabularyA
ssert.java:47)
[junit4] 2> at
org.apache.lucene.analysis.VocabularyAssert.assertVocabulary(VocabularyA
ssert.java:73)
[junit4] 2> at
org.apache.lucene.analysis.snowball.TestSnowballVocab.assertCorrectOutpu
t(TestSnowballVocab.java:80)
[junit4] 2> at
org.apache.lucene.analysis.snowball.TestSnowballVocab.testStemmers(Test
SnowballVocab.java:45)
[junit4] 2> at
sun.reflect.NativeMethodAccessorImpl.invoke0(Native Method)
[junit4] 2> at
sun.reflect.NativeMethodAccessorImpl.invoke(NativeMethodAccessorImpl.j
ava:62)
[junit4] 2> at
sun.reflect.DelegatingMethodAccessorImpl.invoke(DelegatingMethodAcces
sorImpl.java:43)
[junit4] 2> at java.lang.reflect.Method.invoke(Method.java:502)
[junit4] 2> at
com.carrotsearch.randomizedtesting.RandomizedRunner.invoke(Randomize
dRunner.java:1627)
[junit4] 2> at
com.carrotsearch.randomizedtesting.RandomizedRunner$6.evaluate(Rando
mizedRunner.java:836)
[junit4] 2> at
com.carrotsearch.randomizedtesting.RandomizedRunner$7.evaluate(Rando
mizedRunner.java:872)
[junit4] 2> at
com.carrotsearch.randomizedtesting.RandomizedRunner$8.evaluate(Rando
mizedRunner.java:886)
[junit4] 2> at
org.apache.lucene.util.TestRuleSetupTeardownChained$1.evaluate(TestRule
SetupTeardownChained.java:50)
[junit4] 2> at
org.apache.lucene.util.AbstractBeforeAfterRule$1.evaluate(AbstractBeforeA
fterRule.java:46)
[junit4] 2> at
org.apache.lucene.util.TestRuleThreadAndTestName$1.evaluate(TestRuleTh
readAndTestName.java:49)
[junit4] 2> at
org.apache.lucene.util.TestRuleIgnoreAfterMaxFailures$1.evaluate(TestRule
IgnoreAfterMaxFailures.java:65)
[junit4]
2> at
org.apache.lucene.util.TestRuleMarkFailure$1.evaluate(TestRuleMarkFailure
.java:48)
[junit4] 2> at
com.carrotsearch.randomizedtesting.rules.StatementAdapter.evaluate(Stat
ementAdapter.java:36)
[junit4] 2> at
com.carrotsearch.randomizedtesting.ThreadLeakControl$StatementRunner.
run(ThreadLeakControl.java:365)
[junit4] 2> at
com.carrotsearch.randomizedtesting.ThreadLeakControl.forkTimeoutingTask
(ThreadLeakControl.java:798)
[junit4] 2> at
com.carrotsearch.randomizedtesting.ThreadLeakControl$3.evaluate(ThreadL
eakControl.java:458)
[junit4] 2> at
com.carrotsearch.randomizedtesting.RandomizedRunner.runSingleTest(Ran
domizedRunner.java:845)
[junit4] 2> at
com.carrotsearch.randomizedtesting.RandomizedRunner$3.evaluate(Rando
mizedRunner.java:747)
[junit4] 2> at
com.carrotsearch.randomizedtesting.RandomizedRunner$4.evaluate(Rando
mizedRunner.java:781)
[junit4] 2> at
com.carrotsearch.randomizedtesting.RandomizedRunner$5.evaluate(Rando
mizedRunner.java:792)
[junit4] 2> at
org.apache.lucene.util.AbstractBeforeAfterRule$1.evaluate(AbstractBeforeA
fterRule.java:46)
[junit4] 2> at
com.carrotsearch.randomizedtesting.rules.StatementAdapter.evaluate(Stat
ementAdapter.java:36)
[junit4] 2> at
org.apache.lucene.util.TestRuleStoreClassName$1.evaluate(TestRuleStoreCl
assName.java:42)
[junit4] 2> at
com.carrotsearch.randomizedtesting.rules.NoShadowingOrOverridesOnMet
hodsRule$1.evaluate(NoShadowingOrOverridesOnMethodsRule.java:39)
[junit4] 2> at
com.carrotsearch.randomizedtesting.rules.NoShadowingOrOverridesOnMet
hodsRule$1.evaluate(NoShadowingOrOverridesOnMethodsRule.java:39)
[junit4] 2> at
com.carrotsearch.randomizedtesting.rules.StatementAdapter.evaluate(Stat
ementAdapter.java:36)
[junit4] 2> at
com.carrotsearch.randomizedtesting.rules.StatementAdapter.evaluate(Stat
ementAdapter.java:36)
[junit4] 2> at
com.carrotsearch.randomizedtesting.rules.StatementAdapter.evaluate(Stat
ementAdapter.java:36)
[junit4] 2> at
org.apache.lucene.util.TestRuleAssertionsRequired$1.evaluate(TestRuleAss
ertionsRequired.java:54)
[junit4] 2> at
org.apache.lucene.util.TestRuleMarkFailure$1.evaluate(TestRuleMarkFailure
.java:48)
[junit4] 2> at
org.apache.lucene.util.TestRuleIgnoreAfterMaxFailures$1.evaluate(TestRule
IgnoreAfterMaxFailures.java:65)
[junit4] 2> at
org.apache.lucene.util.TestRuleIgnoreTestSuites$1.evaluate(TestRuleIgnore
TestSuites.java:55)
[junit4] 2> at
com.carrotsearch.randomizedtesting.rules.StatementAdapter.evaluate(Stat
ementAdapter.java:36)
[junit4] 2> at
com.carrotsearch.randomizedtesting.ThreadLeakControl$StatementRunner.
run(ThreadLeakControl.java:365)
[junit4] 2> at java.lang.Thread.run(Thread.java:745)
[junit4] 2> NOTE: reproduce with: ant test -
Dtestcase=TestSnowballVocab -Dtests.method=testStemmers -
Dtests.seed=7FBAD445ED608074 -Dtests.multiplier=3 -Dtests.slow=true -
Dtests.locale=it -Dtests.timezone=America/Cordoba -Dtests.asserts=true -
Dtests.file.encoding=US-ASCII
[junit4] ERROR 7200s J2 | TestSnowballVocab.testStemmers <<<
[junit4] > Throwable #1: java.lang.Exception: Test abandoned because
suite timeout was reached.
[junit4] > at
__randomizedtesting.SeedInfo.seed([7FBAD445ED608074]:0)
[junit4] 2> mag 19, 2015 6:51:40 PM
com.carrotsearch.randomizedtesting.ThreadLeakControl checkThreadLeaks
[junit4] 2> WARNING: Will linger awaiting termination of 1 leaked
thread(s).
[junit4] 2> mag 19, 2015 6:52:00 PM
com.carrotsearch.randomizedtesting.ThreadLeakControl checkThreadLeaks
[junit4] 2> SEVERE: 1 thread leaked from SUITE scope at
org.apache.lucene.analysis.snowball.TestSnowballVocab:
[junit4] 2> 1) Thread[id=149, name=TEST-
TestSnowballVocab.testStemmers-seed#[7FBAD445ED608074],
state=RUNNABLE, group=TGRP-TestSnowballVocab]
[junit4] 2>
at
org.tartarus.snowball.ext.FrenchStemmer.stem(FrenchStemmer.java:1379)
[junit4] 2> at
org.apache.lucene.analysis.snowball.SnowballFilter.incrementToken(Snowb
allFilter.java:95)
[junit4] 2> at
org.apache.lucene.analysis.BaseTokenStreamTestCase.checkResetException
(BaseTokenStreamTestCase.java:400)
[junit4] 2> at
org.apache.lucene.analysis.BaseTokenStreamTestCase.assertAnalyzesTo(Bas
eTokenStreamTestCase.java:352)
[junit4] 2> at
org.apache.lucene.analysis.BaseTokenStreamTestCase.assertAnalyzesTo(Bas
eTokenStreamTestCase.java:362)
[junit4] 2> at
org.apache.lucene.analysis.BaseTokenStreamTestCase.checkOneTerm(Base
TokenStreamTestCase.java:423)
[junit4] 2> at
org.apache.lucene.analysis.VocabularyAssert.assertVocabulary(VocabularyA
ssert.java:47)
[junit4] 2> at
org.apache.lucene.analysis.VocabularyAssert.assertVocabulary(VocabularyA
ssert.java:73)
[junit4] 2> at
org.apache.lucene.analysis.snowball.TestSnowballVocab.assertCorrectOutpu
t(TestSnowballVocab.java:80)
[junit4] 2> at
org.apache.lucene.analysis.snowball.TestSnowballVocab.testStemmers(Test
SnowballVocab.java:45)
[junit4] 2> at
sun.reflect.NativeMethodAccessorImpl.invoke0(Native Method)
[junit4] 2> at
sun.reflect.NativeMethodAccessorImpl.invoke(NativeMethodAccessorImpl.j
ava:62)
[junit4] 2> at
sun.reflect.DelegatingMethodAccessorImpl.invoke(DelegatingMethodAcces
sorImpl.java:43)
[junit4] 2> at java.lang.reflect.Method.invoke(Method.java:502)
[junit4] 2> at
com.carrotsearch.randomizedtesting.RandomizedRunner.invoke(Randomize
dRunner.java:1627)
[junit4] 2> at
com.carrotsearch.randomizedtesting.RandomizedRunner$6.evaluate(Rando
mizedRunner.java:836)
[junit4] 2> at
com.carrotsearch.randomizedtesting.RandomizedRunner$7.evaluate(Rando
mizedRunner.java:872)
[junit4] 2> at
com.carrotsearch.randomizedtesting.RandomizedRunner$8.evaluate(Rando
mizedRunner.java:886)
[junit4] 2> at
org.apache.lucene.util.TestRuleSetupTeardownChained$1.evaluate(TestRule
SetupTeardownChained.java:50)
[junit4] 2> at
org.apache.lucene.util.AbstractBeforeAfterRule$1.evaluate(AbstractBeforeA
fterRule.java:46)
[junit4] 2> at
org.apache.lucene.util.TestRuleThreadAndTestName$1.evaluate(TestRuleTh
readAndTestName.java:49)
[junit4] 2> at
org.apache.lucene.util.TestRuleIgnoreAfterMaxFailures$1.evaluate(TestRule
IgnoreAfterMaxFailures.java:65)
[junit4] 2> at
org.apache.lucene.util.TestRuleMarkFailure$1.evaluate(TestRuleMarkFailure
.java:48)
[junit4]
2> at
com.carrotsearch.randomizedtesting.rules.StatementAdapter.evaluate(Stat
ementAdapter.java:36)
[junit4] 2> at
com.carrotsearch.randomizedtesting.ThreadLeakControl$StatementRunner.
run(ThreadLeakControl.java:365)
[junit4] 2> at
com.carrotsearch.randomizedtesting.ThreadLeakControl.forkTimeoutingTask
(ThreadLeakControl.java:798)
[junit4] 2> at
com.carrotsearch.randomizedtesting.ThreadLeakControl$3.evaluate(ThreadL
eakControl.java:458)
[junit4] 2> at
com.carrotsearch.randomizedtesting.RandomizedRunner.runSingleTest(Ran
domizedRunner.java:845)
[junit4] 2> at
com.carrotsearch.randomizedtesting.RandomizedRunner$3.evaluate(Rando
mizedRunner.java:747)
[junit4] 2> at
com.carrotsearch.randomizedtesting.RandomizedRunner$4.evaluate(Rando
mizedRunner.java:781)
[junit4] 2> at
com.carrotsearch.randomizedtesting.RandomizedRunner$5.evaluate(Rando
mizedRunner.java:792)
[junit4] 2> at
org.apache.lucene.util.AbstractBeforeAfterRule$1.evaluate(AbstractBeforeA
fterRule.java:46)
[junit4] 2> at
com.carrotsearch.randomizedtesting.rules.StatementAdapter.evaluate(Stat
ementAdapter.java:36)
[junit4] 2> at
org.apache.lucene.util.TestRuleStoreClassName$1.evaluate(TestRuleStoreCl
assName.java:42)
[junit4] 2> at
com.carrotsearch.randomizedtesting.rules.NoShadowingOrOverridesOnMet
hodsRule$1.evaluate(NoShadowingOrOverridesOnMethodsRule.java:39)
[junit4] 2> at
com.carrotsearch.randomizedtesting.rules.NoShadowingOrOverridesOnMet
hodsRule$1.evaluate(NoShadowingOrOverridesOnMethodsRule.java:39)
[junit4] 2> at
com.carrotsearch.randomizedtesting.rules.StatementAdapter.evaluate(Stat
ementAdapter.java:36)
[junit4] 2> at
com.carrotsearch.randomizedtesting.rules.StatementAdapter.evaluate(Stat
ementAdapter.java:36)
[junit4] 2> at
com.carrotsearch.randomizedtesting.rules.StatementAdapter.evaluate(Stat
ementAdapter.java:36)
[junit4] 2> at
org.apache.lucene.util.TestRuleAssertionsRequired$1.evaluate(TestRuleAss
ertionsRequired.java:54)
[junit4] 2> at
org.apache.lucene.util.TestRuleMarkFailure$1.evaluate(TestRuleMarkFailure
.java:48)
[junit4] 2> at
org.apache.lucene.util.TestRuleIgnoreAfterMaxFailures$1.evaluate(TestRule
IgnoreAfterMaxFailures.java:65)
[junit4] 2> at
org.apache.lucene.util.TestRuleIgnoreTestSuites$1.evaluate(TestRuleIgnore
TestSuites.java:55)
[junit4] 2> at
com.carrotsearch.randomizedtesting.rules.StatementAdapter.evaluate(Stat
ementAdapter.java:36)
[junit4] 2> at
com.carrotsearch.randomizedtesting.ThreadLeakControl$StatementRunner.
run(ThreadLeakControl.java:365)
[junit4] 2> at java.lang.Thread.run(Thread.java:745)
[junit4] 2> mag 19, 2015 6:52:00 PM
com.carrotsearch.randomizedtesting.ThreadLeakControl tryToInterruptAll
[junit4] 2> INFO: Starting to interrupt leaked threads:
[junit4] 2> 1) Thread[id=149, name=TEST-
TestSnowballVocab.testStemmers-seed#[7FBAD445ED608074],
state=RUNNABLE, group=TGRP-TestSnowballVocab]
[junit4] 2> mag 19, 2015 6:52:03 PM
com.carrotsearch.randomizedtesting.ThreadLeakControl tryToInterruptAll
[junit4] 2> SEVERE: There are still zombie threads that couldn't be
terminated:
[junit4] 2> 1) Thread[id=149, name=TEST-
TestSnowballVocab.testStemmers-seed#[7FBAD445ED608074],
state=RUNNABLE,
group=TGRP-TestSnowballVocab]
[junit4] 2> at
org.tartarus.snowball.ext.FrenchStemmer.stem(FrenchStemmer.java:1379)
[junit4] 2> at
org.apache.lucene.analysis.snowball.SnowballFilter.incrementToken(Snowb
allFilter.java:95)
[junit4] 2> at
org.apache.lucene.analysis.BaseTokenStreamTestCase.checkResetException
(BaseTokenStreamTestCase.java:400)
[junit4] 2> at
org.apache.lucene.analysis.BaseTokenStreamTestCase.assertAnalyzesTo(Bas
eTokenStreamTestCase.java:352)
[junit4] 2> at
org.apache.lucene.analysis.BaseTokenStreamTestCase.assertAnalyzesTo(Bas
eTokenStreamTestCase.java:362)
[junit4] 2> at
org.apache.lucene.analysis.BaseTokenStreamTestCase.checkOneTerm(Base
TokenStreamTestCase.java:423)
[junit4] 2> at
org.apache.lucene.analysis.VocabularyAssert.assertVocabulary(VocabularyA
ssert.java:47)
[junit4] 2> at
org.apache.lucene.analysis.VocabularyAssert.assertVocabulary(VocabularyA
ssert.java:73)
[junit4] 2> at
org.apache.lucene.analysis.snowball.TestSnowballVocab.assertCorrectOutpu
t(TestSnowballVocab.java:80)
[junit4]
2> at
org.apache.lucene.analysis.snowball.TestSnowballVocab.testStemmers(Test
SnowballVocab.java:45)
[junit4] 2> at
sun.reflect.NativeMethodAccessorImpl.invoke0(Native Method)
[junit4] 2> at
sun.reflect.NativeMethodAccessorImpl.invoke(NativeMethodAccessorImpl.j
ava:62)
[junit4] 2> at
sun.reflect.DelegatingMethodAccessorImpl.invoke(DelegatingMethodAcces
sorImpl.java:43)
[junit4] 2> at java.lang.reflect.Method.invoke(Method.java:502)
[junit4] 2> at
com.carrotsearch.randomizedtesting.RandomizedRunner.invoke(Randomize
dRunner.java:1627)
[junit4] 2> at
com.carrotsearch.randomizedtesting.RandomizedRunner$6.evaluate(Rando
mizedRunner.java:836)
[junit4] 2> at
com.carrotsearch.randomizedtesting.RandomizedRunner$7.evaluate(Rando
mizedRunner.java:872)
[junit4] 2> at
com.carrotsearch.randomizedtesting.RandomizedRunner$8.evaluate(Rando
mizedRunner.java:886)
[junit4] 2> at
org.apache.lucene.util.TestRuleSetupTeardownChained$1.evaluate(TestRule
SetupTeardownChained.java:50)
[junit4] 2> at
org.apache.lucene.util.AbstractBeforeAfterRule$1.evaluate(AbstractBeforeA
fterRule.java:46)
[junit4] 2> at
org.apache.lucene.util.TestRuleThreadAndTestName$1.evaluate(TestRuleTh
readAndTestName.java:49)
[junit4] 2> at
org.apache.lucene.util.TestRuleIgnoreAfterMaxFailures$1.evaluate(TestRule
IgnoreAfterMaxFailures.java:65)
[junit4] 2> at
org.apache.lucene.util.TestRuleMarkFailure$1.evaluate(TestRuleMarkFailure
.java:48)
[junit4] 2> at
com.carrotsearch.randomizedtesting.rules.StatementAdapter.evaluate(Stat
ementAdapter.java:36)
[junit4] 2> at
com.carrotsearch.randomizedtesting.ThreadLeakControl$StatementRunner.
run(ThreadLeakControl.java:365)
[junit4] 2> at
com.carrotsearch.randomizedtesting.ThreadLeakControl.forkTimeoutingTask
(ThreadLeakControl.java:798)
[junit4] 2> at
com.carrotsearch.randomizedtesting.ThreadLeakControl$3.evaluate(ThreadL
eakControl.java:458)
[junit4] 2>
at
com.carrotsearch.randomizedtesting.RandomizedRunner.runSingleTest(Ran
domizedRunner.java:845)
[junit4] 2> at
com.carrotsearch.randomizedtesting.RandomizedRunner$3.evaluate(Rando
mizedRunner.java:747)
[junit4] 2> at
com.carrotsearch.randomizedtesting.RandomizedRunner$4.evaluate(Rando
mizedRunner.java:781)
[junit4] 2> at
com.carrotsearch.randomizedtesting.RandomizedRunner$5.evaluate(Rando
mizedRunner.java:792)
[junit4] 2> at
org.apache.lucene.util.AbstractBeforeAfterRule$1.evaluate(AbstractBeforeA
fterRule.java:46)
[junit4] 2> at
com.carrotsearch.randomizedtesting.rules.StatementAdapter.evaluate(Stat
ementAdapter.java:36)
[junit4] 2> at
org.apache.lucene.util.TestRuleStoreClassName$1.evaluate(TestRuleStoreCl
assName.java:42)
[junit4] 2> at
com.carrotsearch.randomizedtesting.rules.NoShadowingOrOverridesOnMet
hodsRule$1.evaluate(NoShadowingOrOverridesOnMethodsRule.java:39)
[junit4] 2> at
com.carrotsearch.randomizedtesting.rules.NoShadowingOrOverridesOnMet
hodsRule$1.evaluate(NoShadowingOrOverridesOnMethodsRule.java:39)
[junit4] 2> at
com.carrotsearch.randomizedtesting.rules.StatementAdapter.evaluate(Stat
ementAdapter.java:36)
[junit4] 2> at
com.carrotsearch.randomizedtesting.rules.StatementAdapter.evaluate(Stat
ementAdapter.java:36)
[junit4] 2> at
com.carrotsearch.randomizedtesting.rules.StatementAdapter.evaluate(Stat
ementAdapter.java:36)
[junit4]
2> at
org.apache.lucene.util.TestRuleAssertionsRequired$1.evaluate(TestRuleAss
ertionsRequired.java:54)
[junit4] 2> at
org.apache.lucene.util.TestRuleMarkFailure$1.evaluate(TestRuleMarkFailure
.java:48)
[junit4] 2> at
org.apache.lucene.util.TestRuleIgnoreAfterMaxFailures$1.evaluate(TestRule
IgnoreAfterMaxFailures.java:65)
[junit4] 2> at
org.apache.lucene.util.TestRuleIgnoreTestSuites$1.evaluate(TestRuleIgnore
TestSuites.java:55)
[junit4] 2> at
com.carrotsearch.randomizedtesting.rules.StatementAdapter.evaluate(Stat
ementAdapter.java:36)
[junit4] 2> at
com.carrotsearch.randomizedtesting.ThreadLeakControl$StatementRunner.
run(ThreadLeakControl.java:365)
[junit4] 2> at java.lang.Thread.run(Thread.java:745)
[junit4] 2> NOTE: test params are: codec=Asserting(Lucene50): {},
docValues:{}, sim=RandomSimilarityProvider(queryNorm=true,coord=no): {},
locale=it, timezone=America/Cordoba
[junit4] 2> NOTE: Linux 3.13.0-52-generic amd64/Oracle Corporation
1.9.0-ea (64-bit)/cpus=12,threads=2,free=245344712,total=530579456
[junit4] 2> NOTE: All tests run in this JVM: [TestCondition2,
TestHyphenatedWordsFilter, TestUAX29URLEmailAnalyzer,
TestFrenchLightStemFilter, TokenRangeSinkTokenizerTest, TestCJKAnalyzer,
TestOnlyInCompound, TestDutchAnalyzer, TestEmptyTokenStream,
Test64kAffixes, TestIndonesianStemmer, TestItalianLightStemFilterFactory,
TestTurkishLowerCaseFilterFactory, TestRandomChains,
TestBasqueAnalyzer, TestArabicNormalizationFilter,
TestNorwegianMinimalStemFilterFactory, TestCaseInsensitive,
TestGermanMinimalStemFilterFactory, TestDanishAnalyzer,
TestStemmerOverrideFilter, TestKStemFilterFactory, TestHunspellStemFilter,
TestCustomAnalyzer, TestCJKWidthFilter,
TestScandinavianNormalizationFilterFactory, TestArmenianAnalyzer,
TestHTMLStripCharFilterFactory, TestFullStrip, NGramTokenizerTest,
TestGermanLightStemFilter,
TestDictionaryCompoundWordTokenFilterFactory,
TestSynonymFilterFactory, CommonGramsFilterTest, TestHomonyms,
TestSnowballVocab]
[junit4] 2> NOTE: reproduce with: ant test -
Dtestcase=TestSnowballVocab -Dtests.seed=7FBAD445ED608074 -
Dtests.multiplier=3 -Dtests.slow=true -Dtests.locale=it -
Dtests.timezone=America/Cordoba
-Dtests.asserts=true -
Dtests.file.encoding=US-ASCII
[junit4] ERROR 0.00s J2 | TestSnowballVocab (suite) <<<
[junit4] > Throwable #1: java.lang.Exception: Suite timeout exceeded
(>= 7200000 msec).
[junit4] > at
__randomizedtesting.SeedInfo.seed([7FBAD445ED608074]:0)
[junit4] Completed [261/270] on J2 in 7223.12s, 1 test, 2 errors <<<
FAILURES!
[...truncated 39 lines...]
BUILD FAILED
/home/jenkins/workspace/Lucene-Solr-trunk-Linux/build.xml:526: The
following error occurred while executing this line:
/home/jenkins/workspace/Lucene-Solr-trunk-Linux/build.xml:474: The
following error occurred while executing this line:
/home/jenkins/workspace/Lucene-Solr-trunk-Linux/build.xml:61: The
following error occurred while executing this line:
/home/jenkins/workspace/Lucene-Solr-trunk-Linux/extra-targets.xml:39:
The following error occurred while executing this line:
/home/jenkins/workspace/Lucene-Solr-trunk-
Linux/lucene/build.xml:466: The following error occurred while executing this
line:
/home/jenkins/workspace/Lucene-Solr-trunk-Linux/lucene/common-
build.xml:2145: The following error occurred while executing this line:
/home/jenkins/workspace/Lucene-Solr-trunk-
Linux/lucene/analysis/build.xml:106: The following error occurred while
executing this line:
/home/jenkins/workspace/Lucene-Solr-trunk-
Linux/lucene/analysis/build.xml:38: The following error occurred while
executing this line:
/home/jenkins/workspace/Lucene-Solr-trunk-Linux/lucene/module-
build.xml:58: The following error occurred while
executing this line:
/home/jenkins/workspace/Lucene-Solr-trunk-Linux/lucene/common-
build.xml:1415: The following error occurred while executing this line:
/home/jenkins/workspace/Lucene-Solr-trunk-Linux/lucene/common-
build.x
ml:973: There were test failures: 270 suites, 1376 tests, 1
suite-level error, 1 error, 40 ignored
Total time: 129 minutes 18 seconds
Build step 'Invoke Ant' marked build as failure Archiving artifacts
Recording test results Email was triggered for: Failure - Any Sending
email for trigger: Failure - Any
_____
To unsubscribe, e-mail: dev-unsubscribe@lucene.apache.org For
additional commands, e-mail: dev-help@lucene.apache.org
_____
To unsubscribe, e-mail: dev-unsubscribe@lucene.apache.org For
additional commands, e-mail: dev-help@lucene.apache.org
_____
To unsubscribe, e-mail: dev-unsubscribe@lucene.apache.org For additional
commands, e-mail: dev-help@lucene.apache.org
_____
To unsubscribe, e-mail: dev-unsubscribe@lucene.apache.org
For additional commands, e-mail:
dev-help@lucene.apache.org
_____
To unsubscribe, e-mail: dev-unsubscribe@lucene.apache.org
For additional commands, e-mail: dev-help@lucene.apache.org
--
Uwe Schindler
H.-H.-Meier-Allee 63, 28213 Bremen
http://www.thetaphi.de
RE: [JENKINS] Lucene-Solr-trunk-Linux (64bit/jdk1.9.0-ea-b60) - Build # 12746 - Failure!
Posted by Uwe Schindler <uw...@thetaphi.de>.
Hi Mike,
…and yes, it’s Haswell:
Intel(R) Xeon(R) CPU E5-2620 v3 @ 2.40GHz (12 hyperthreading cores)
Uwe
-----
Uwe Schindler
H.-H.-Meier-Allee 63, D-28213 Bremen
<http://www.thetaphi.de/> http://www.thetaphi.de
eMail: uwe@thetaphi.de
From: Uwe Schindler [mailto:uwe@thetaphi.de]
Sent: Wednesday, May 20, 2015 8:52 PM
To: dev@lucene.apache.org; Michael McCandless
Subject: Re: [JENKINS] Lucene-Solr-trunk-Linux (64bit/jdk1.9.0-ea-b60) - Build # 12746 - Failure!
Hi,
But it could be that Ubuntu has backported it (as described in the mailing list). But Ubuntu is fast and may have ported the fix already, too. We have to check Debian/Ubuntu kernel log.
Uwe
Am 20. Mai 2015 20:48:24 MESZ, schrieb Michael McCandless <lu...@mikemccandless.com>:
Hrmph, OK, that's before the bug showed up (3.14) ...
Mike McCandless
http://blog.mikemccandless.com
On Wed, May 20, 2015 at 2:41 PM, Uwe Schindler <uw...@thetaphi.de> wrote:
This is the very latest kernel from Ubuntu 14.04:
serv1:~# uname -a
Linux serv1 3.13.0-52-generic #86-Ubuntu SMP Mon May 4 04:32:59 UTC 2015 x86_64 x86_64 x86_64 GNU/Linux
Uwe
-----
Uwe Schindler
H.-H.-Meier-Allee 63, D-28213 Bremen
http://www.thetaphi.de
eMail: uwe@thetaphi.de
-----Original Message-----
From: Michael McCandless
[mailto:lucene@mikemccandless.com]
Sent: Wednesday, May 20, 2015 3:35 PM
To: Lucene/Solr dev
Subject: Re: [JENKINS] Lucene-Solr-trunk-Linux (64bit/jdk1.9.0-ea-b60) -
Build # 12746 - Failure!
Uwe, which exact Linux kernel version and CPU is this build box? I'm
wondering if we're maybe hitting this crazy Linux kernel bug:
https://groups.google.com/forum/#!msg/mechanical-
sympathy/QbmpZxp6C64/BonaHiVbEmsJ
I wish the HEARTBEAT would give us more info, e.g. how much CPU is the
JVM process using (are we hung or spinning?), and thread stack traces ... I
know I sound like a broken record Dawid!
Mike McCandless
http://blog.mikemccandless.com
On Wed, May 20, 2015 at 6:05 AM, Dawid Weiss
<da...@cs.put.poznan.pl> wrote:
Does not reproduce for me.
Dawid
On Tue, May 19, 2015 at 11:52 PM, Policeman Jenkins Server
<je...@thetaphi.de> wrote:
Build: http://jenkins.thetaphi.de/job/Lucene-Solr-trunk-Linux/12746/
Java: 64bit/jdk1.9.0-ea-b60 -XX:-UseCompressedOops -XX:+UseG1GC
2 tests failed.
FAILED:
junit.framework.TestSuite.org.apache.lucene.analysis.snowball.TestSno
wballVocab
Error Message:
Suite timeout exceeded (>= 7200000 msec).
Stack Trace:
java.lang.Exception: Suite timeout exceeded (>= 7200000 msec).
at
__randomizedtesting.SeedInfo.seed([7FBAD445ED608074]:0)
FAILED:
org.apache.lucene.analysis.snowball.TestSnowballVocab.testStemmers
Error Message:
Test abandoned because suite timeout was reached.
Stack Trace:
java.lang.Exception: Test abandoned because suite timeout was reached.
at __randomizedtesting.SeedInfo.seed([7FBAD445ED608074]:0)
Build Log:
[...truncated 3199 lines...]
[junit4] Suite: org.apache.lucene.analysis.snowball.TestSnowballVocab
[junit4] 2> mag 19, 2015 6:51:40 PM
com.carrotsearch.randomizedtesting.ThreadLeakControl$2 evaluate
[junit4] 2> WARNING: Suite
execution timed out:
org.apache.lucene.analysis.snowball.TestSnowballVocab
[junit4] 2> 1) Thread[id=13, name=JUnit4-serializer-daemon,
state=TIMED_WAITING, group=main]
[junit4] 2> at java.lang.Thread.sleep(Native Method)
[junit4] 2> at
com.carrotsearch.ant.tasks.junit4.events.Serializer$1.run(Serializer.java:47)
[junit4] 2> 2) Thread[id=1, name=main, state=WAITING, group=main]
[junit4] 2> at java.lang.Object.wait(Native Method)
[junit4] 2> at java.lang.Thread.join(Thread.java:1249)
[junit4] 2> at java.lang.Thread.join(Thread.java:1323)
[junit4] 2> at
com.carrotsearch.randomizedtesting.RandomizedRunner.runSuite(Randomi
zedRunner.java:578)
[junit4] 2> at
com.carrotsearch.randomizedtesting.RandomizedRunner.run(RandomizedR
unner.java:444)
[junit4] 2> at
com.carrotsearch.ant.tasks.junit4.slave.SlaveMain.execute(SlaveMain.java:1
99)
[junit4] 2> at
com.carrotsearch.ant.tasks.junit4.slave.SlaveMain.main(SlaveMain.java:310)
[junit4] 2> at
com.carrotsearch.ant.tasks.junit4.slave.SlaveMainSafe.main(SlaveMainSafe.j
ava:12)
[junit4] 2> 3) Thread[id=148, name=SUITE-TestSnowballVocab-
seed#[7FBAD445ED608074], state=RUNNABLE, group=TGRP-
TestSnowballVocab]
[junit4] 2> at
java.lang.Thread.getStackTrace(Thread.java:1556)
[junit4] 2> at
com.carrotsearch.randomizedtesting.ThreadLeakControl.getThreadsWithTra
ces(ThreadLeakControl.java:690)
[junit4] 2> at
com.carrotsearch.randomizedtesting.ThreadLeakControl.formatThreadStack
sFull(ThreadLeakControl.java:679)
[junit4] 2> at
com.carrotsearch.randomizedtesting.ThreadLeakControl.access$900(ThreadL
eakControl.java:62)
[junit4] 2> at
com.carrotsearch.randomizedtesting.ThreadLeakControl$2.evaluate(ThreadL
eakControl.java:412)
[junit4] 2> at
com.carrotsearch.randomizedtesting.RandomizedRunner.runSuite(Randomi
zedRunner.java:651)
[junit4] 2> at
com.carrotsearch.randomizedtesting.RandomizedRunner.access$200(Rando
mizedRunner.java:138)
[junit4] 2> at
com.carrotsearch.randomizedtesting.RandomizedRunner$1.run(Randomized
Runner.java:568)
[junit4] 2> 4) Thread[id=149,
name=TEST-
TestSnowballVocab.testStemmers-seed#[7FBAD445ED608074],
state=RUNNABLE, group=TGRP-TestSnowballVocab]
[junit4] 2> at
org.tartarus.snowball.ext.FrenchStemmer.stem(FrenchStemmer.java:1379)
[junit4] 2> at
org.apache.lucene.analysis.snowball.SnowballFilter.incrementToken(Snowb
allFilter.java:95)
[junit4] 2> at
org.apache.lucene.analysis.BaseTokenStreamTestCase.checkResetException
(BaseTokenStreamTestCase.java:400)
[junit4] 2> at
org.apache.lucene.analysis.BaseTokenStreamTestCase.assertAnalyzesTo(Bas
eTokenStreamTestCase.java:352)
[junit4] 2> at
org.apache.lucene.analysis.BaseTokenStreamTestCase.assertAnalyzesTo(Bas
eTokenStreamTestCase.java:362)
[junit4] 2> at
org.apache.lucene.analysis.BaseTokenStreamTestCase.checkOneTerm(Base
TokenStreamTestCase.java:423)
[junit4] 2> at
org.apache.lucene.analysis.VocabularyAssert.assertVocabulary(VocabularyA
ssert.java:47)
[junit4] 2> at
org.apache.lucene.analysis.VocabularyAssert.assertVocabulary(VocabularyA
ssert.java:73)
[junit4] 2> at
org.apache.lucene.analysis.snowball.TestSnowballVocab.assertCorrectOutpu
t(TestSnowballVocab.java:80)
[junit4] 2> at
org.apache.lucene.analysis.snowball.TestSnowballVocab.testStemmers(Test
SnowballVocab.java:45)
[junit4] 2> at
sun.reflect.NativeMethodAccessorImpl.invoke0(Native Method)
[junit4] 2> at
sun.reflect.NativeMethodAccessorImpl.invoke(NativeMethodAccessorImpl.j
ava:62)
[junit4] 2> at
sun.reflect.DelegatingMethodAccessorImpl.invoke(DelegatingMethodAcces
sorImpl.java:43)
[junit4] 2> at java.lang.reflect.Method.invoke(Method.java:502)
[junit4] 2> at
com.carrotsearch.randomizedtesting.RandomizedRunner.invoke(Randomize
dRunner.java:1627)
[junit4] 2> at
com.carrotsearch.randomizedtesting.RandomizedRunner$6.evaluate(Rando
mizedRunner.java:836)
[junit4] 2> at
com.carrotsearch.randomizedtesting.RandomizedRunner$7.evaluate(Rando
mizedRunner.java:872)
[junit4] 2> at
com.carrotsearch.randomizedtesting.RandomizedRunner$8.evaluate(Rando
mizedRunner.java:886)
[junit4] 2> at
org.apache.lucene.util.TestRuleSetupTeardownChained$1.evaluate(TestRule
SetupTeardownChained.java:50)
[junit4] 2> at
org.apache.lucene.util.AbstractBeforeAfterRule$1.evaluate(AbstractBeforeA
fterRule.java:46)
[junit4] 2> at
org.apache.lucene.util.TestRuleThreadAndTestName$1.evaluate(TestRuleTh
readAndTestName.java:49)
[junit4] 2> at
org.apache.lucene.util.TestRuleIgnoreAfterMaxFailures$1.evaluate(TestRule
IgnoreAfterMaxFailures.java:65)
[junit4]
2> at
org.apache.lucene.util.TestRuleMarkFailure$1.evaluate(TestRuleMarkFailure
.java:48)
[junit4] 2> at
com.carrotsearch.randomizedtesting.rules.StatementAdapter.evaluate(Stat
ementAdapter.java:36)
[junit4] 2> at
com.carrotsearch.randomizedtesting.ThreadLeakControl$StatementRunner.
run(ThreadLeakControl.java:365)
[junit4] 2> at
com.carrotsearch.randomizedtesting.ThreadLeakControl.forkTimeoutingTask
(ThreadLeakControl.java:798)
[junit4] 2> at
com.carrotsearch.randomizedtesting.ThreadLeakControl$3.evaluate(ThreadL
eakControl.java:458)
[junit4] 2> at
com.carrotsearch.randomizedtesting.RandomizedRunner.runSingleTest(Ran
domizedRunner.java:845)
[junit4] 2> at
com.carrotsearch.randomizedtesting.RandomizedRunner$3.evaluate(Rando
mizedRunner.java:747)
[junit4] 2> at
com.carrotsearch.randomizedtesting.RandomizedRunner$4.evaluate(Rando
mizedRunner.java:781)
[junit4] 2> at
com.carrotsearch.randomizedtesting.RandomizedRunner$5.evaluate(Rando
mizedRunner.java:792)
[junit4] 2> at
org.apache.lucene.util.AbstractBeforeAfterRule$1.evaluate(AbstractBeforeA
fterRule.java:46)
[junit4] 2> at
com.carrotsearch.randomizedtesting.rules.StatementAdapter.evaluate(Stat
ementAdapter.java:36)
[junit4] 2> at
org.apache.lucene.util.TestRuleStoreClassName$1.evaluate(TestRuleStoreCl
assName.java:42)
[junit4] 2> at
com.carrotsearch.randomizedtesting.rules.NoShadowingOrOverridesOnMet
hodsRule$1.evaluate(NoShadowingOrOverridesOnMethodsRule.java:39)
[junit4] 2> at
com.carrotsearch.randomizedtesting.rules.NoShadowingOrOverridesOnMet
hodsRule$1.evaluate(NoShadowingOrOverridesOnMethodsRule.java:39)
[junit4] 2> at
com.carrotsearch.randomizedtesting.rules.StatementAdapter.evaluate(Stat
ementAdapter.java:36)
[junit4] 2> at
com.carrotsearch.randomizedtesting.rules.StatementAdapter.evaluate(Stat
ementAdapter.java:36)
[junit4] 2> at
com.carrotsearch.randomizedtesting.rules.StatementAdapter.evaluate(Stat
ementAdapter.java:36)
[junit4] 2> at
org.apache.lucene.util.TestRuleAssertionsRequired$1.evaluate(TestRuleAss
ertionsRequired.java:54)
[junit4] 2> at
org.apache.lucene.util.TestRuleMarkFailure$1.evaluate(TestRuleMarkFailure
.java:48)
[junit4] 2> at
org.apache.lucene.util.TestRuleIgnoreAfterMaxFailures$1.evaluate(TestRule
IgnoreAfterMaxFailures.java:65)
[junit4] 2> at
org.apache.lucene.util.TestRuleIgnoreTestSuites$1.evaluate(TestRuleIgnore
TestSuites.java:55)
[junit4] 2> at
com.carrotsearch.randomizedtesting.rules.StatementAdapter.evaluate(Stat
ementAdapter.java:36)
[junit4] 2> at
com.carrotsearch.randomizedtesting.ThreadLeakControl$StatementRunner.
run(ThreadLeakControl.java:365)
[junit4] 2> at java.lang.Thread.run(Thread.java:745)
[junit4] 2> NOTE: reproduce with: ant test -
Dtestcase=TestSnowballVocab -Dtests.method=testStemmers -
Dtests.seed=7FBAD445ED608074 -Dtests.multiplier=3 -Dtests.slow=true -
Dtests.locale=it -Dtests.timezone=America/Cordoba -Dtests.asserts=true -
Dtests.file.encoding=US-ASCII
[junit4] ERROR 7200s J2 | TestSnowballVocab.testStemmers <<<
[junit4] > Throwable #1: java.lang.Exception: Test abandoned because
suite timeout was reached.
[junit4] > at
__randomizedtesting.SeedInfo.seed([7FBAD445ED608074]:0)
[junit4] 2> mag 19, 2015 6:51:40 PM
com.carrotsearch.randomizedtesting.ThreadLeakControl checkThreadLeaks
[junit4] 2> WARNING: Will linger awaiting termination of 1 leaked
thread(s).
[junit4] 2> mag 19, 2015 6:52:00 PM
com.carrotsearch.randomizedtesting.ThreadLeakControl checkThreadLeaks
[junit4] 2> SEVERE: 1 thread leaked from SUITE scope at
org.apache.lucene.analysis.snowball.TestSnowballVocab:
[junit4] 2> 1) Thread[id=149, name=TEST-
TestSnowballVocab.testStemmers-seed#[7FBAD445ED608074],
state=RUNNABLE, group=TGRP-TestSnowballVocab]
[junit4] 2>
at
org.tartarus.snowball.ext.FrenchStemmer.stem(FrenchStemmer.java:1379)
[junit4] 2> at
org.apache.lucene.analysis.snowball.SnowballFilter.incrementToken(Snowb
allFilter.java:95)
[junit4] 2> at
org.apache.lucene.analysis.BaseTokenStreamTestCase.checkResetException
(BaseTokenStreamTestCase.java:400)
[junit4] 2> at
org.apache.lucene.analysis.BaseTokenStreamTestCase.assertAnalyzesTo(Bas
eTokenStreamTestCase.java:352)
[junit4] 2> at
org.apache.lucene.analysis.BaseTokenStreamTestCase.assertAnalyzesTo(Bas
eTokenStreamTestCase.java:362)
[junit4] 2> at
org.apache.lucene.analysis.BaseTokenStreamTestCase.checkOneTerm(Base
TokenStreamTestCase.java:423)
[junit4] 2> at
org.apache.lucene.analysis.VocabularyAssert.assertVocabulary(VocabularyA
ssert.java:47)
[junit4] 2> at
org.apache.lucene.analysis.VocabularyAssert.assertVocabulary(VocabularyA
ssert.java:73)
[junit4] 2> at
org.apache.lucene.analysis.snowball.TestSnowballVocab.assertCorrectOutpu
t(TestSnowballVocab.java:80)
[junit4] 2> at
org.apache.lucene.analysis.snowball.TestSnowballVocab.testStemmers(Test
SnowballVocab.java:45)
[junit4] 2> at
sun.reflect.NativeMethodAccessorImpl.invoke0(Native Method)
[junit4] 2> at
sun.reflect.NativeMethodAccessorImpl.invoke(NativeMethodAccessorImpl.j
ava:62)
[junit4] 2> at
sun.reflect.DelegatingMethodAccessorImpl.invoke(DelegatingMethodAcces
sorImpl.java:43)
[junit4] 2> at java.lang.reflect.Method.invoke(Method.java:502)
[junit4] 2> at
com.carrotsearch.randomizedtesting.RandomizedRunner.invoke(Randomize
dRunner.java:1627)
[junit4] 2> at
com.carrotsearch.randomizedtesting.RandomizedRunner$6.evaluate(Rando
mizedRunner.java:836)
[junit4] 2> at
com.carrotsearch.randomizedtesting.RandomizedRunner$7.evaluate(Rando
mizedRunner.java:872)
[junit4] 2> at
com.carrotsearch.randomizedtesting.RandomizedRunner$8.evaluate(Rando
mizedRunner.java:886)
[junit4] 2> at
org.apache.lucene.util.TestRuleSetupTeardownChained$1.evaluate(TestRule
SetupTeardownChained.java:50)
[junit4] 2> at
org.apache.lucene.util.AbstractBeforeAfterRule$1.evaluate(AbstractBeforeA
fterRule.java:46)
[junit4] 2> at
org.apache.lucene.util.TestRuleThreadAndTestName$1.evaluate(TestRuleTh
readAndTestName.java:49)
[junit4] 2> at
org.apache.lucene.util.TestRuleIgnoreAfterMaxFailures$1.evaluate(TestRule
IgnoreAfterMaxFailures.java:65)
[junit4] 2> at
org.apache.lucene.util.TestRuleMarkFailure$1.evaluate(TestRuleMarkFailure
.java:48)
[junit4]
2> at
com.carrotsearch.randomizedtesting.rules.StatementAdapter.evaluate(Stat
ementAdapter.java:36)
[junit4] 2> at
com.carrotsearch.randomizedtesting.ThreadLeakControl$StatementRunner.
run(ThreadLeakControl.java:365)
[junit4] 2> at
com.carrotsearch.randomizedtesting.ThreadLeakControl.forkTimeoutingTask
(ThreadLeakControl.java:798)
[junit4] 2> at
com.carrotsearch.randomizedtesting.ThreadLeakControl$3.evaluate(ThreadL
eakControl.java:458)
[junit4] 2> at
com.carrotsearch.randomizedtesting.RandomizedRunner.runSingleTest(Ran
domizedRunner.java:845)
[junit4] 2> at
com.carrotsearch.randomizedtesting.RandomizedRunner$3.evaluate(Rando
mizedRunner.java:747)
[junit4] 2> at
com.carrotsearch.randomizedtesting.RandomizedRunner$4.evaluate(Rando
mizedRunner.java:781)
[junit4] 2> at
com.carrotsearch.randomizedtesting.RandomizedRunner$5.evaluate(Rando
mizedRunner.java:792)
[junit4] 2> at
org.apache.lucene.util.AbstractBeforeAfterRule$1.evaluate(AbstractBeforeA
fterRule.java:46)
[junit4] 2> at
com.carrotsearch.randomizedtesting.rules.StatementAdapter.evaluate(Stat
ementAdapter.java:36)
[junit4] 2> at
org.apache.lucene.util.TestRuleStoreClassName$1.evaluate(TestRuleStoreCl
assName.java:42)
[junit4] 2> at
com.carrotsearch.randomizedtesting.rules.NoShadowingOrOverridesOnMet
hodsRule$1.evaluate(NoShadowingOrOverridesOnMethodsRule.java:39)
[junit4] 2> at
com.carrotsearch.randomizedtesting.rules.NoShadowingOrOverridesOnMet
hodsRule$1.evaluate(NoShadowingOrOverridesOnMethodsRule.java:39)
[junit4] 2> at
com.carrotsearch.randomizedtesting.rules.StatementAdapter.evaluate(Stat
ementAdapter.java:36)
[junit4] 2> at
com.carrotsearch.randomizedtesting.rules.StatementAdapter.evaluate(Stat
ementAdapter.java:36)
[junit4] 2> at
com.carrotsearch.randomizedtesting.rules.StatementAdapter.evaluate(Stat
ementAdapter.java:36)
[junit4] 2> at
org.apache.lucene.util.TestRuleAssertionsRequired$1.evaluate(TestRuleAss
ertionsRequired.java:54)
[junit4] 2> at
org.apache.lucene.util.TestRuleMarkFailure$1.evaluate(TestRuleMarkFailure
.java:48)
[junit4] 2> at
org.apache.lucene.util.TestRuleIgnoreAfterMaxFailures$1.evaluate(TestRule
IgnoreAfterMaxFailures.java:65)
[junit4] 2> at
org.apache.lucene.util.TestRuleIgnoreTestSuites$1.evaluate(TestRuleIgnore
TestSuites.java:55)
[junit4] 2> at
com.carrotsearch.randomizedtesting.rules.StatementAdapter.evaluate(Stat
ementAdapter.java:36)
[junit4] 2> at
com.carrotsearch.randomizedtesting.ThreadLeakControl$StatementRunner.
run(ThreadLeakControl.java:365)
[junit4] 2> at java.lang.Thread.run(Thread.java:745)
[junit4] 2> mag 19, 2015 6:52:00 PM
com.carrotsearch.randomizedtesting.ThreadLeakControl tryToInterruptAll
[junit4] 2> INFO: Starting to interrupt leaked threads:
[junit4] 2> 1) Thread[id=149, name=TEST-
TestSnowballVocab.testStemmers-seed#[7FBAD445ED608074],
state=RUNNABLE, group=TGRP-TestSnowballVocab]
[junit4] 2> mag 19, 2015 6:52:03 PM
com.carrotsearch.randomizedtesting.ThreadLeakControl tryToInterruptAll
[junit4] 2> SEVERE: There are still zombie threads that couldn't be
terminated:
[junit4] 2> 1) Thread[id=149, name=TEST-
TestSnowballVocab.testStemmers-seed#[7FBAD445ED608074],
state=RUNNABLE,
group=TGRP-TestSnowballVocab]
[junit4] 2> at
org.tartarus.snowball.ext.FrenchStemmer.stem(FrenchStemmer.java:1379)
[junit4] 2> at
org.apache.lucene.analysis.snowball.SnowballFilter.incrementToken(Snowb
allFilter.java:95)
[junit4] 2> at
org.apache.lucene.analysis.BaseTokenStreamTestCase.checkResetException
(BaseTokenStreamTestCase.java:400)
[junit4] 2> at
org.apache.lucene.analysis.BaseTokenStreamTestCase.assertAnalyzesTo(Bas
eTokenStreamTestCase.java:352)
[junit4] 2> at
org.apache.lucene.analysis.BaseTokenStreamTestCase.assertAnalyzesTo(Bas
eTokenStreamTestCase.java:362)
[junit4] 2> at
org.apache.lucene.analysis.BaseTokenStreamTestCase.checkOneTerm(Base
TokenStreamTestCase.java:423)
[junit4] 2> at
org.apache.lucene.analysis.VocabularyAssert.assertVocabulary(VocabularyA
ssert.java:47)
[junit4] 2> at
org.apache.lucene.analysis.VocabularyAssert.assertVocabulary(VocabularyA
ssert.java:73)
[junit4] 2> at
org.apache.lucene.analysis.snowball.TestSnowballVocab.assertCorrectOutpu
t(TestSnowballVocab.java:80)
[junit4]
2> at
org.apache.lucene.analysis.snowball.TestSnowballVocab.testStemmers(Test
SnowballVocab.java:45)
[junit4] 2> at
sun.reflect.NativeMethodAccessorImpl.invoke0(Native Method)
[junit4] 2> at
sun.reflect.NativeMethodAccessorImpl.invoke(NativeMethodAccessorImpl.j
ava:62)
[junit4] 2> at
sun.reflect.DelegatingMethodAccessorImpl.invoke(DelegatingMethodAcces
sorImpl.java:43)
[junit4] 2> at java.lang.reflect.Method.invoke(Method.java:502)
[junit4] 2> at
com.carrotsearch.randomizedtesting.RandomizedRunner.invoke(Randomize
dRunner.java:1627)
[junit4] 2> at
com.carrotsearch.randomizedtesting.RandomizedRunner$6.evaluate(Rando
mizedRunner.java:836)
[junit4] 2> at
com.carrotsearch.randomizedtesting.RandomizedRunner$7.evaluate(Rando
mizedRunner.java:872)
[junit4] 2> at
com.carrotsearch.randomizedtesting.RandomizedRunner$8.evaluate(Rando
mizedRunner.java:886)
[junit4] 2> at
org.apache.lucene.util.TestRuleSetupTeardownChained$1.evaluate(TestRule
SetupTeardownChained.java:50)
[junit4] 2> at
org.apache.lucene.util.AbstractBeforeAfterRule$1.evaluate(AbstractBeforeA
fterRule.java:46)
[junit4] 2> at
org.apache.lucene.util.TestRuleThreadAndTestName$1.evaluate(TestRuleTh
readAndTestName.java:49)
[junit4] 2> at
org.apache.lucene.util.TestRuleIgnoreAfterMaxFailures$1.evaluate(TestRule
IgnoreAfterMaxFailures.java:65)
[junit4] 2> at
org.apache.lucene.util.TestRuleMarkFailure$1.evaluate(TestRuleMarkFailure
.java:48)
[junit4] 2> at
com.carrotsearch.randomizedtesting.rules.StatementAdapter.evaluate(Stat
ementAdapter.java:36)
[junit4] 2> at
com.carrotsearch.randomizedtesting.ThreadLeakControl$StatementRunner.
run(ThreadLeakControl.java:365)
[junit4] 2> at
com.carrotsearch.randomizedtesting.ThreadLeakControl.forkTimeoutingTask
(ThreadLeakControl.java:798)
[junit4] 2> at
com.carrotsearch.randomizedtesting.ThreadLeakControl$3.evaluate(ThreadL
eakControl.java:458)
[junit4] 2>
at
com.carrotsearch.randomizedtesting.RandomizedRunner.runSingleTest(Ran
domizedRunner.java:845)
[junit4] 2> at
com.carrotsearch.randomizedtesting.RandomizedRunner$3.evaluate(Rando
mizedRunner.java:747)
[junit4] 2> at
com.carrotsearch.randomizedtesting.RandomizedRunner$4.evaluate(Rando
mizedRunner.java:781)
[junit4] 2> at
com.carrotsearch.randomizedtesting.RandomizedRunner$5.evaluate(Rando
mizedRunner.java:792)
[junit4] 2> at
org.apache.lucene.util.AbstractBeforeAfterRule$1.evaluate(AbstractBeforeA
fterRule.java:46)
[junit4] 2> at
com.carrotsearch.randomizedtesting.rules.StatementAdapter.evaluate(Stat
ementAdapter.java:36)
[junit4] 2> at
org.apache.lucene.util.TestRuleStoreClassName$1.evaluate(TestRuleStoreCl
assName.java:42)
[junit4] 2> at
com.carrotsearch.randomizedtesting.rules.NoShadowingOrOverridesOnMet
hodsRule$1.evaluate(NoShadowingOrOverridesOnMethodsRule.java:39)
[junit4] 2> at
com.carrotsearch.randomizedtesting.rules.NoShadowingOrOverridesOnMet
hodsRule$1.evaluate(NoShadowingOrOverridesOnMethodsRule.java:39)
[junit4] 2> at
com.carrotsearch.randomizedtesting.rules.StatementAdapter.evaluate(Stat
ementAdapter.java:36)
[junit4] 2> at
com.carrotsearch.randomizedtesting.rules.StatementAdapter.evaluate(Stat
ementAdapter.java:36)
[junit4] 2> at
com.carrotsearch.randomizedtesting.rules.StatementAdapter.evaluate(Stat
ementAdapter.java:36)
[junit4]
2> at
org.apache.lucene.util.TestRuleAssertionsRequired$1.evaluate(TestRuleAss
ertionsRequired.java:54)
[junit4] 2> at
org.apache.lucene.util.TestRuleMarkFailure$1.evaluate(TestRuleMarkFailure
.java:48)
[junit4] 2> at
org.apache.lucene.util.TestRuleIgnoreAfterMaxFailures$1.evaluate(TestRule
IgnoreAfterMaxFailures.java:65)
[junit4] 2> at
org.apache.lucene.util.TestRuleIgnoreTestSuites$1.evaluate(TestRuleIgnore
TestSuites.java:55)
[junit4] 2> at
com.carrotsearch.randomizedtesting.rules.StatementAdapter.evaluate(Stat
ementAdapter.java:36)
[junit4] 2> at
com.carrotsearch.randomizedtesting.ThreadLeakControl$StatementRunner.
run(ThreadLeakControl.java:365)
[junit4] 2> at java.lang.Thread.run(Thread.java:745)
[junit4] 2> NOTE: test params are: codec=Asserting(Lucene50): {},
docValues:{}, sim=RandomSimilarityProvider(queryNorm=true,coord=no): {},
locale=it, timezone=America/Cordoba
[junit4] 2> NOTE: Linux 3.13.0-52-generic amd64/Oracle Corporation
1.9.0-ea (64-bit)/cpus=12,threads=2,free=245344712,total=530579456
[junit4] 2> NOTE: All tests run in this JVM: [TestCondition2,
TestHyphenatedWordsFilter, TestUAX29URLEmailAnalyzer,
TestFrenchLightStemFilter, TokenRangeSinkTokenizerTest, TestCJKAnalyzer,
TestOnlyInCompound, TestDutchAnalyzer, TestEmptyTokenStream,
Test64kAffixes, TestIndonesianStemmer, TestItalianLightStemFilterFactory,
TestTurkishLowerCaseFilterFactory, TestRandomChains,
TestBasqueAnalyzer, TestArabicNormalizationFilter,
TestNorwegianMinimalStemFilterFactory, TestCaseInsensitive,
TestGermanMinimalStemFilterFactory, TestDanishAnalyzer,
TestStemmerOverrideFilter, TestKStemFilterFactory, TestHunspellStemFilter,
TestCustomAnalyzer, TestCJKWidthFilter,
TestScandinavianNormalizationFilterFactory, TestArmenianAnalyzer,
TestHTMLStripCharFilterFactory, TestFullStrip, NGramTokenizerTest,
TestGermanLightStemFilter,
TestDictionaryCompoundWordTokenFilterFactory,
TestSynonymFilterFactory, CommonGramsFilterTest, TestHomonyms,
TestSnowballVocab]
[junit4] 2> NOTE: reproduce with: ant test -
Dtestcase=TestSnowballVocab -Dtests.seed=7FBAD445ED608074 -
Dtests.multiplier=3 -Dtests.slow=true -Dtests.locale=it -
Dtests.timezone=America/Cordoba
-Dtests.asserts=true -
Dtests.file.encoding=US-ASCII
[junit4] ERROR 0.00s J2 | TestSnowballVocab (suite) <<<
[junit4] > Throwable #1: java.lang.Exception: Suite timeout exceeded
(>= 7200000 msec).
[junit4] > at
__randomizedtesting.SeedInfo.seed([7FBAD445ED608074]:0)
[junit4] Completed [261/270] on J2 in 7223.12s, 1 test, 2 errors <<<
FAILURES!
[...truncated 39 lines...]
BUILD FAILED
/home/jenkins/workspace/Lucene-Solr-trunk-Linux/build.xml:526: The
following error occurred while executing this line:
/home/jenkins/workspace/Lucene-Solr-trunk-Linux/build.xml:474: The
following error occurred while executing this line:
/home/jenkins/workspace/Lucene-Solr-trunk-Linux/build.xml:61: The
following error occurred while executing this line:
/home/jenkins/workspace/Lucene-Solr-trunk-Linux/extra-targets.xml:39:
The following error occurred while executing this line:
/home/jenkins/workspace/Lucene-Solr-trunk-
Linux/lucene/build.xml:466: The following error occurred while executing this
line:
/home/jenkins/workspace/Lucene-Solr-trunk-Linux/lucene/common-
build.xml:2145: The following error occurred while executing this line:
/home/jenkins/workspace/Lucene-Solr-trunk-
Linux/lucene/analysis/build.xml:106: The following error occurred while
executing this line:
/home/jenkins/workspace/Lucene-Solr-trunk-
Linux/lucene/analysis/build.xml:38: The following error occurred while
executing this line:
/home/jenkins/workspace/Lucene-Solr-trunk-Linux/lucene/module-
build.xml:58: The following error occurred while
executing this line:
/home/jenkins/workspace/Lucene-Solr-trunk-Linux/lucene/common-
build.xml:1415: The following error occurred while executing this line:
/home/jenkins/workspace/Lucene-Solr-trunk-Linux/lucene/common-
build.x
ml:973: There were test failures: 270 suites, 1376 tests, 1
suite-level error, 1 error, 40 ignored
Total time: 129 minutes 18 seconds
Build step 'Invoke Ant' marked build as failure Archiving artifacts
Recording test results Email was triggered for: Failure - Any Sending
email for trigger: Failure - Any
_____
To unsubscribe, e-mail: dev-unsubscribe@lucene.apache.org For
additional commands, e-mail: dev-help@lucene.apache.org
_____
To unsubscribe, e-mail: dev-unsubscribe@lucene.apache.org For
additional commands, e-mail: dev-help@lucene.apache.org
_____
To unsubscribe, e-mail: dev-unsubscribe@lucene.apache.org For additional
commands, e-mail: dev-help@lucene.apache.org
_____
To unsubscribe, e-mail: dev-unsubscribe@lucene.apache.org
For additional commands, e-mail:
dev-help@lucene.apache.org
_____
To unsubscribe, e-mail: dev-unsubscribe@lucene.apache.org
For additional commands, e-mail: dev-help@lucene.apache.org
--
Uwe Schindler
H.-H.-Meier-Allee 63, 28213 Bremen
http://www.thetaphi.de
Re: [JENKINS] Lucene-Solr-trunk-Linux (64bit/jdk1.9.0-ea-b60) - Build # 12746 - Failure!
Posted by Uwe Schindler <uw...@thetaphi.de>.
Hi,
But it could be that Ubuntu has backported it (as described in the mailing list). But Ubuntu is fast and may have ported the fix already, too. We have to check Debian/Ubuntu kernel log.
Uwe
Am 20. Mai 2015 20:48:24 MESZ, schrieb Michael McCandless <lu...@mikemccandless.com>:
>Hrmph, OK, that's before the bug showed up (3.14) ...
>
>Mike McCandless
>
>http://blog.mikemccandless.com
>
>
>On Wed, May 20, 2015 at 2:41 PM, Uwe Schindler <uw...@thetaphi.de> wrote:
>> This is the very latest kernel from Ubuntu 14.04:
>>
>> serv1:~# uname -a
>> Linux serv1 3.13.0-52-generic #86-Ubuntu SMP Mon May 4 04:32:59 UTC
>2015 x86_64 x86_64 x86_64 GNU/Linux
>>
>> Uwe
>>
>> -----
>> Uwe Schindler
>> H.-H.-Meier-Allee 63, D-28213 Bremen
>> http://www.thetaphi.de
>> eMail: uwe@thetaphi.de
>>
>>
>>> -----Original Message-----
>>> From: Michael McCandless [mailto:lucene@mikemccandless.com]
>>> Sent: Wednesday, May 20, 2015 3:35 PM
>>> To: Lucene/Solr dev
>>> Subject: Re: [JENKINS] Lucene-Solr-trunk-Linux
>(64bit/jdk1.9.0-ea-b60) -
>>> Build # 12746 - Failure!
>>>
>>> Uwe, which exact Linux kernel version and CPU is this build box?
>I'm
>>> wondering if we're maybe hitting this crazy Linux kernel bug:
>>> https://groups.google.com/forum/#!msg/mechanical-
>>> sympathy/QbmpZxp6C64/BonaHiVbEmsJ
>>>
>>> I wish the HEARTBEAT would give us more info, e.g. how much CPU is
>the
>>> JVM process using (are we hung or spinning?), and thread stack
>traces ... I
>>> know I sound like a broken record Dawid!
>>>
>>> Mike McCandless
>>>
>>> http://blog.mikemccandless.com
>>>
>>>
>>> On Wed, May 20, 2015 at 6:05 AM, Dawid Weiss
>>> <da...@cs.put.poznan.pl> wrote:
>>> > Does not reproduce for me.
>>> >
>>> > Dawid
>>> >
>>> > On Tue, May 19, 2015 at 11:52 PM, Policeman Jenkins Server
>>> > <je...@thetaphi.de> wrote:
>>> >> Build:
>http://jenkins.thetaphi.de/job/Lucene-Solr-trunk-Linux/12746/
>>> >> Java: 64bit/jdk1.9.0-ea-b60 -XX:-UseCompressedOops -XX:+UseG1GC
>>> >>
>>> >> 2 tests failed.
>>> >> FAILED:
>>> >>
>junit.framework.TestSuite.org.apache.lucene.analysis.snowball.TestSno
>>> >> wballVocab
>>> >>
>>> >> Error Message:
>>> >> Suite timeout exceeded (>= 7200000 msec).
>>> >>
>>> >> Stack Trace:
>>> >> java.lang.Exception: Suite timeout exceeded (>= 7200000 msec).
>>> >> at
>__randomizedtesting.SeedInfo.seed([7FBAD445ED608074]:0)
>>> >>
>>> >>
>>> >> FAILED:
>>> >>
>org.apache.lucene.analysis.snowball.TestSnowballVocab.testStemmers
>>> >>
>>> >> Error Message:
>>> >> Test abandoned because suite timeout was reached.
>>> >>
>>> >> Stack Trace:
>>> >> java.lang.Exception: Test abandoned because suite timeout was
>reached.
>>> >> at
>__randomizedtesting.SeedInfo.seed([7FBAD445ED608074]:0)
>>> >>
>>> >>
>>> >>
>>> >>
>>> >> Build Log:
>>> >> [...truncated 3199 lines...]
>>> >> [junit4] Suite:
>org.apache.lucene.analysis.snowball.TestSnowballVocab
>>> >> [junit4] 2> mag 19, 2015 6:51:40 PM
>>> com.carrotsearch.randomizedtesting.ThreadLeakControl$2 evaluate
>>> >> [junit4] 2> WARNING: Suite execution timed out:
>>> org.apache.lucene.analysis.snowball.TestSnowballVocab
>>> >> [junit4] 2> 1) Thread[id=13,
>name=JUnit4-serializer-daemon,
>>> state=TIMED_WAITING, group=main]
>>> >> [junit4] 2> at java.lang.Thread.sleep(Native Method)
>>> >> [junit4] 2> at
>>>
>com.carrotsearch.ant.tasks.junit4.events.Serializer$1.run(Serializer.java:47)
>>> >> [junit4] 2> 2) Thread[id=1, name=main, state=WAITING,
>group=main]
>>> >> [junit4] 2> at java.lang.Object.wait(Native Method)
>>> >> [junit4] 2> at
>java.lang.Thread.join(Thread.java:1249)
>>> >> [junit4] 2> at
>java.lang.Thread.join(Thread.java:1323)
>>> >> [junit4] 2> at
>>> com.carrotsearch.randomizedtesting.RandomizedRunner.runSuite(Randomi
>>> zedRunner.java:578)
>>> >> [junit4] 2> at
>>> com.carrotsearch.randomizedtesting.RandomizedRunner.run(RandomizedR
>>> unner.java:444)
>>> >> [junit4] 2> at
>>>
>com.carrotsearch.ant.tasks.junit4.slave.SlaveMain.execute(SlaveMain.java:1
>>> 99)
>>> >> [junit4] 2> at
>>>
>com.carrotsearch.ant.tasks.junit4.slave.SlaveMain.main(SlaveMain.java:310)
>>> >> [junit4] 2> at
>>>
>com.carrotsearch.ant.tasks.junit4.slave.SlaveMainSafe.main(SlaveMainSafe.j
>>> ava:12)
>>> >> [junit4] 2> 3) Thread[id=148,
>name=SUITE-TestSnowballVocab-
>>> seed#[7FBAD445ED608074], state=RUNNABLE, group=TGRP-
>>> TestSnowballVocab]
>>> >> [junit4] 2> at
>java.lang.Thread.getStackTrace(Thread.java:1556)
>>> >> [junit4] 2> at
>>>
>com.carrotsearch.randomizedtesting.ThreadLeakControl.getThreadsWithTra
>>> ces(ThreadLeakControl.java:690)
>>> >> [junit4] 2> at
>>>
>com.carrotsearch.randomizedtesting.ThreadLeakControl.formatThreadStack
>>> sFull(ThreadLeakControl.java:679)
>>> >> [junit4] 2> at
>>>
>com.carrotsearch.randomizedtesting.ThreadLeakControl.access$900(ThreadL
>>> eakControl.java:62)
>>> >> [junit4] 2> at
>>>
>com.carrotsearch.randomizedtesting.ThreadLeakControl$2.evaluate(ThreadL
>>> eakControl.java:412)
>>> >> [junit4] 2> at
>>> com.carrotsearch.randomizedtesting.RandomizedRunner.runSuite(Randomi
>>> zedRunner.java:651)
>>> >> [junit4] 2> at
>>> com.carrotsearch.randomizedtesting.RandomizedRunner.access$200(Rando
>>> mizedRunner.java:138)
>>> >> [junit4] 2> at
>>> com.carrotsearch.randomizedtesting.RandomizedRunner$1.run(Randomized
>>> Runner.java:568)
>>> >> [junit4] 2> 4) Thread[id=149, name=TEST-
>>> TestSnowballVocab.testStemmers-seed#[7FBAD445ED608074],
>>> state=RUNNABLE, group=TGRP-TestSnowballVocab]
>>> >> [junit4] 2> at
>>>
>org.tartarus.snowball.ext.FrenchStemmer.stem(FrenchStemmer.java:1379)
>>> >> [junit4] 2> at
>>>
>org.apache.lucene.analysis.snowball.SnowballFilter.incrementToken(Snowb
>>> allFilter.java:95)
>>> >> [junit4] 2> at
>>>
>org.apache.lucene.analysis.BaseTokenStreamTestCase.checkResetException
>>> (BaseTokenStreamTestCase.java:400)
>>> >> [junit4] 2> at
>>>
>org.apache.lucene.analysis.BaseTokenStreamTestCase.assertAnalyzesTo(Bas
>>> eTokenStreamTestCase.java:352)
>>> >> [junit4] 2> at
>>>
>org.apache.lucene.analysis.BaseTokenStreamTestCase.assertAnalyzesTo(Bas
>>> eTokenStreamTestCase.java:362)
>>> >> [junit4] 2> at
>>> org.apache.lucene.analysis.BaseTokenStreamTestCase.checkOneTerm(Base
>>> TokenStreamTestCase.java:423)
>>> >> [junit4] 2> at
>>>
>org.apache.lucene.analysis.VocabularyAssert.assertVocabulary(VocabularyA
>>> ssert.java:47)
>>> >> [junit4] 2> at
>>>
>org.apache.lucene.analysis.VocabularyAssert.assertVocabulary(VocabularyA
>>> ssert.java:73)
>>> >> [junit4] 2> at
>>>
>org.apache.lucene.analysis.snowball.TestSnowballVocab.assertCorrectOutpu
>>> t(TestSnowballVocab.java:80)
>>> >> [junit4] 2> at
>>>
>org.apache.lucene.analysis.snowball.TestSnowballVocab.testStemmers(Test
>>> SnowballVocab.java:45)
>>> >> [junit4] 2> at
>>> sun.reflect.NativeMethodAccessorImpl.invoke0(Native Method)
>>> >> [junit4] 2> at
>>>
>sun.reflect.NativeMethodAccessorImpl.invoke(NativeMethodAccessorImpl.j
>>> ava:62)
>>> >> [junit4] 2> at
>>>
>sun.reflect.DelegatingMethodAccessorImpl.invoke(DelegatingMethodAcces
>>> sorImpl.java:43)
>>> >> [junit4] 2> at
>java.lang.reflect.Method.invoke(Method.java:502)
>>> >> [junit4] 2> at
>>> com.carrotsearch.randomizedtesting.RandomizedRunner.invoke(Randomize
>>> dRunner.java:1627)
>>> >> [junit4] 2> at
>>> com.carrotsearch.randomizedtesting.RandomizedRunner$6.evaluate(Rando
>>> mizedRunner.java:836)
>>> >> [junit4] 2> at
>>> com.carrotsearch.randomizedtesting.RandomizedRunner$7.evaluate(Rando
>>> mizedRunner.java:872)
>>> >> [junit4] 2> at
>>> com.carrotsearch.randomizedtesting.RandomizedRunner$8.evaluate(Rando
>>> mizedRunner.java:886)
>>> >> [junit4] 2> at
>>>
>org.apache.lucene.util.TestRuleSetupTeardownChained$1.evaluate(TestRule
>>> SetupTeardownChained.java:50)
>>> >> [junit4] 2> at
>>>
>org.apache.lucene.util.AbstractBeforeAfterRule$1.evaluate(AbstractBeforeA
>>> fterRule.java:46)
>>> >> [junit4] 2> at
>>>
>org.apache.lucene.util.TestRuleThreadAndTestName$1.evaluate(TestRuleTh
>>> readAndTestName.java:49)
>>> >> [junit4] 2> at
>>>
>org.apache.lucene.util.TestRuleIgnoreAfterMaxFailures$1.evaluate(TestRule
>>> IgnoreAfterMaxFailures.java:65)
>>> >> [junit4] 2> at
>>>
>org.apache.lucene.util.TestRuleMarkFailure$1.evaluate(TestRuleMarkFailure
>>> .java:48)
>>> >> [junit4] 2> at
>>>
>com.carrotsearch.randomizedtesting.rules.StatementAdapter.evaluate(Stat
>>> ementAdapter.java:36)
>>> >> [junit4] 2> at
>>>
>com.carrotsearch.randomizedtesting.ThreadLeakControl$StatementRunner.
>>> run(ThreadLeakControl.java:365)
>>> >> [junit4] 2> at
>>>
>com.carrotsearch.randomizedtesting.ThreadLeakControl.forkTimeoutingTask
>>> (ThreadLeakControl.java:798)
>>> >> [junit4] 2> at
>>>
>com.carrotsearch.randomizedtesting.ThreadLeakControl$3.evaluate(ThreadL
>>> eakControl.java:458)
>>> >> [junit4] 2> at
>>>
>com.carrotsearch.randomizedtesting.RandomizedRunner.runSingleTest(Ran
>>> domizedRunner.java:845)
>>> >> [junit4] 2> at
>>> com.carrotsearch.randomizedtesting.RandomizedRunner$3.evaluate(Rando
>>> mizedRunner.java:747)
>>> >> [junit4] 2> at
>>> com.carrotsearch.randomizedtesting.RandomizedRunner$4.evaluate(Rando
>>> mizedRunner.java:781)
>>> >> [junit4] 2> at
>>> com.carrotsearch.randomizedtesting.RandomizedRunner$5.evaluate(Rando
>>> mizedRunner.java:792)
>>> >> [junit4] 2> at
>>>
>org.apache.lucene.util.AbstractBeforeAfterRule$1.evaluate(AbstractBeforeA
>>> fterRule.java:46)
>>> >> [junit4] 2> at
>>>
>com.carrotsearch.randomizedtesting.rules.StatementAdapter.evaluate(Stat
>>> ementAdapter.java:36)
>>> >> [junit4] 2> at
>>>
>org.apache.lucene.util.TestRuleStoreClassName$1.evaluate(TestRuleStoreCl
>>> assName.java:42)
>>> >> [junit4] 2> at
>>> com.carrotsearch.randomizedtesting.rules.NoShadowingOrOverridesOnMet
>>> hodsRule$1.evaluate(NoShadowingOrOverridesOnMethodsRule.java:39)
>>> >> [junit4] 2> at
>>> com.carrotsearch.randomizedtesting.rules.NoShadowingOrOverridesOnMet
>>> hodsRule$1.evaluate(NoShadowingOrOverridesOnMethodsRule.java:39)
>>> >> [junit4] 2> at
>>>
>com.carrotsearch.randomizedtesting.rules.StatementAdapter.evaluate(Stat
>>> ementAdapter.java:36)
>>> >> [junit4] 2> at
>>>
>com.carrotsearch.randomizedtesting.rules.StatementAdapter.evaluate(Stat
>>> ementAdapter.java:36)
>>> >> [junit4] 2> at
>>>
>com.carrotsearch.randomizedtesting.rules.StatementAdapter.evaluate(Stat
>>> ementAdapter.java:36)
>>> >> [junit4] 2> at
>>>
>org.apache.lucene.util.TestRuleAssertionsRequired$1.evaluate(TestRuleAss
>>> ertionsRequired.java:54)
>>> >> [junit4] 2> at
>>>
>org.apache.lucene.util.TestRuleMarkFailure$1.evaluate(TestRuleMarkFailure
>>> .java:48)
>>> >> [junit4] 2> at
>>>
>org.apache.lucene.util.TestRuleIgnoreAfterMaxFailures$1.evaluate(TestRule
>>> IgnoreAfterMaxFailures.java:65)
>>> >> [junit4] 2> at
>>>
>org.apache.lucene.util.TestRuleIgnoreTestSuites$1.evaluate(TestRuleIgnore
>>> TestSuites.java:55)
>>> >> [junit4] 2> at
>>>
>com.carrotsearch.randomizedtesting.rules.StatementAdapter.evaluate(Stat
>>> ementAdapter.java:36)
>>> >> [junit4] 2> at
>>>
>com.carrotsearch.randomizedtesting.ThreadLeakControl$StatementRunner.
>>> run(ThreadLeakControl.java:365)
>>> >> [junit4] 2> at java.lang.Thread.run(Thread.java:745)
>>> >> [junit4] 2> NOTE: reproduce with: ant test -
>>> Dtestcase=TestSnowballVocab -Dtests.method=testStemmers -
>>> Dtests.seed=7FBAD445ED608074 -Dtests.multiplier=3 -Dtests.slow=true
>-
>>> Dtests.locale=it -Dtests.timezone=America/Cordoba
>-Dtests.asserts=true -
>>> Dtests.file.encoding=US-ASCII
>>> >> [junit4] ERROR 7200s J2 | TestSnowballVocab.testStemmers <<<
>>> >> [junit4] > Throwable #1: java.lang.Exception: Test
>abandoned because
>>> suite timeout was reached.
>>> >> [junit4] > at
>>> __randomizedtesting.SeedInfo.seed([7FBAD445ED608074]:0)
>>> >> [junit4] 2> mag 19, 2015 6:51:40 PM
>>> com.carrotsearch.randomizedtesting.ThreadLeakControl
>checkThreadLeaks
>>> >> [junit4] 2> WARNING: Will linger awaiting termination of 1
>leaked
>>> thread(s).
>>> >> [junit4] 2> mag 19, 2015 6:52:00 PM
>>> com.carrotsearch.randomizedtesting.ThreadLeakControl
>checkThreadLeaks
>>> >> [junit4] 2> SEVERE: 1 thread leaked from SUITE scope at
>>> org.apache.lucene.analysis.snowball.TestSnowballVocab:
>>> >> [junit4] 2> 1) Thread[id=149, name=TEST-
>>> TestSnowballVocab.testStemmers-seed#[7FBAD445ED608074],
>>> state=RUNNABLE, group=TGRP-TestSnowballVocab]
>>> >> [junit4] 2> at
>>>
>org.tartarus.snowball.ext.FrenchStemmer.stem(FrenchStemmer.java:1379)
>>> >> [junit4] 2> at
>>>
>org.apache.lucene.analysis.snowball.SnowballFilter.incrementToken(Snowb
>>> allFilter.java:95)
>>> >> [junit4] 2> at
>>>
>org.apache.lucene.analysis.BaseTokenStreamTestCase.checkResetException
>>> (BaseTokenStreamTestCase.java:400)
>>> >> [junit4] 2> at
>>>
>org.apache.lucene.analysis.BaseTokenStreamTestCase.assertAnalyzesTo(Bas
>>> eTokenStreamTestCase.java:352)
>>> >> [junit4] 2> at
>>>
>org.apache.lucene.analysis.BaseTokenStreamTestCase.assertAnalyzesTo(Bas
>>> eTokenStreamTestCase.java:362)
>>> >> [junit4] 2> at
>>> org.apache.lucene.analysis.BaseTokenStreamTestCase.checkOneTerm(Base
>>> TokenStreamTestCase.java:423)
>>> >> [junit4] 2> at
>>>
>org.apache.lucene.analysis.VocabularyAssert.assertVocabulary(VocabularyA
>>> ssert.java:47)
>>> >> [junit4] 2> at
>>>
>org.apache.lucene.analysis.VocabularyAssert.assertVocabulary(VocabularyA
>>> ssert.java:73)
>>> >> [junit4] 2> at
>>>
>org.apache.lucene.analysis.snowball.TestSnowballVocab.assertCorrectOutpu
>>> t(TestSnowballVocab.java:80)
>>> >> [junit4] 2> at
>>>
>org.apache.lucene.analysis.snowball.TestSnowballVocab.testStemmers(Test
>>> SnowballVocab.java:45)
>>> >> [junit4] 2> at
>>> sun.reflect.NativeMethodAccessorImpl.invoke0(Native Method)
>>> >> [junit4] 2> at
>>>
>sun.reflect.NativeMethodAccessorImpl.invoke(NativeMethodAccessorImpl.j
>>> ava:62)
>>> >> [junit4] 2> at
>>>
>sun.reflect.DelegatingMethodAccessorImpl.invoke(DelegatingMethodAcces
>>> sorImpl.java:43)
>>> >> [junit4] 2> at
>java.lang.reflect.Method.invoke(Method.java:502)
>>> >> [junit4] 2> at
>>> com.carrotsearch.randomizedtesting.RandomizedRunner.invoke(Randomize
>>> dRunner.java:1627)
>>> >> [junit4] 2> at
>>> com.carrotsearch.randomizedtesting.RandomizedRunner$6.evaluate(Rando
>>> mizedRunner.java:836)
>>> >> [junit4] 2> at
>>> com.carrotsearch.randomizedtesting.RandomizedRunner$7.evaluate(Rando
>>> mizedRunner.java:872)
>>> >> [junit4] 2> at
>>> com.carrotsearch.randomizedtesting.RandomizedRunner$8.evaluate(Rando
>>> mizedRunner.java:886)
>>> >> [junit4] 2> at
>>>
>org.apache.lucene.util.TestRuleSetupTeardownChained$1.evaluate(TestRule
>>> SetupTeardownChained.java:50)
>>> >> [junit4] 2> at
>>>
>org.apache.lucene.util.AbstractBeforeAfterRule$1.evaluate(AbstractBeforeA
>>> fterRule.java:46)
>>> >> [junit4] 2> at
>>>
>org.apache.lucene.util.TestRuleThreadAndTestName$1.evaluate(TestRuleTh
>>> readAndTestName.java:49)
>>> >> [junit4] 2> at
>>>
>org.apache.lucene.util.TestRuleIgnoreAfterMaxFailures$1.evaluate(TestRule
>>> IgnoreAfterMaxFailures.java:65)
>>> >> [junit4] 2> at
>>>
>org.apache.lucene.util.TestRuleMarkFailure$1.evaluate(TestRuleMarkFailure
>>> .java:48)
>>> >> [junit4] 2> at
>>>
>com.carrotsearch.randomizedtesting.rules.StatementAdapter.evaluate(Stat
>>> ementAdapter.java:36)
>>> >> [junit4] 2> at
>>>
>com.carrotsearch.randomizedtesting.ThreadLeakControl$StatementRunner.
>>> run(ThreadLeakControl.java:365)
>>> >> [junit4] 2> at
>>>
>com.carrotsearch.randomizedtesting.ThreadLeakControl.forkTimeoutingTask
>>> (ThreadLeakControl.java:798)
>>> >> [junit4] 2> at
>>>
>com.carrotsearch.randomizedtesting.ThreadLeakControl$3.evaluate(ThreadL
>>> eakControl.java:458)
>>> >> [junit4] 2> at
>>>
>com.carrotsearch.randomizedtesting.RandomizedRunner.runSingleTest(Ran
>>> domizedRunner.java:845)
>>> >> [junit4] 2> at
>>> com.carrotsearch.randomizedtesting.RandomizedRunner$3.evaluate(Rando
>>> mizedRunner.java:747)
>>> >> [junit4] 2> at
>>> com.carrotsearch.randomizedtesting.RandomizedRunner$4.evaluate(Rando
>>> mizedRunner.java:781)
>>> >> [junit4] 2> at
>>> com.carrotsearch.randomizedtesting.RandomizedRunner$5.evaluate(Rando
>>> mizedRunner.java:792)
>>> >> [junit4] 2> at
>>>
>org.apache.lucene.util.AbstractBeforeAfterRule$1.evaluate(AbstractBeforeA
>>> fterRule.java:46)
>>> >> [junit4] 2> at
>>>
>com.carrotsearch.randomizedtesting.rules.StatementAdapter.evaluate(Stat
>>> ementAdapter.java:36)
>>> >> [junit4] 2> at
>>>
>org.apache.lucene.util.TestRuleStoreClassName$1.evaluate(TestRuleStoreCl
>>> assName.java:42)
>>> >> [junit4] 2> at
>>> com.carrotsearch.randomizedtesting.rules.NoShadowingOrOverridesOnMet
>>> hodsRule$1.evaluate(NoShadowingOrOverridesOnMethodsRule.java:39)
>>> >> [junit4] 2> at
>>> com.carrotsearch.randomizedtesting.rules.NoShadowingOrOverridesOnMet
>>> hodsRule$1.evaluate(NoShadowingOrOverridesOnMethodsRule.java:39)
>>> >> [junit4] 2> at
>>>
>com.carrotsearch.randomizedtesting.rules.StatementAdapter.evaluate(Stat
>>> ementAdapter.java:36)
>>> >> [junit4] 2> at
>>>
>com.carrotsearch.randomizedtesting.rules.StatementAdapter.evaluate(Stat
>>> ementAdapter.java:36)
>>> >> [junit4] 2> at
>>>
>com.carrotsearch.randomizedtesting.rules.StatementAdapter.evaluate(Stat
>>> ementAdapter.java:36)
>>> >> [junit4] 2> at
>>>
>org.apache.lucene.util.TestRuleAssertionsRequired$1.evaluate(TestRuleAss
>>> ertionsRequired.java:54)
>>> >> [junit4] 2> at
>>>
>org.apache.lucene.util.TestRuleMarkFailure$1.evaluate(TestRuleMarkFailure
>>> .java:48)
>>> >> [junit4] 2> at
>>>
>org.apache.lucene.util.TestRuleIgnoreAfterMaxFailures$1.evaluate(TestRule
>>> IgnoreAfterMaxFailures.java:65)
>>> >> [junit4] 2> at
>>>
>org.apache.lucene.util.TestRuleIgnoreTestSuites$1.evaluate(TestRuleIgnore
>>> TestSuites.java:55)
>>> >> [junit4] 2> at
>>>
>com.carrotsearch.randomizedtesting.rules.StatementAdapter.evaluate(Stat
>>> ementAdapter.java:36)
>>> >> [junit4] 2> at
>>>
>com.carrotsearch.randomizedtesting.ThreadLeakControl$StatementRunner.
>>> run(ThreadLeakControl.java:365)
>>> >> [junit4] 2> at java.lang.Thread.run(Thread.java:745)
>>> >> [junit4] 2> mag 19, 2015 6:52:00 PM
>>> com.carrotsearch.randomizedtesting.ThreadLeakControl
>tryToInterruptAll
>>> >> [junit4] 2> INFO: Starting to interrupt leaked threads:
>>> >> [junit4] 2> 1) Thread[id=149, name=TEST-
>>> TestSnowballVocab.testStemmers-seed#[7FBAD445ED608074],
>>> state=RUNNABLE, group=TGRP-TestSnowballVocab]
>>> >> [junit4] 2> mag 19, 2015 6:52:03 PM
>>> com.carrotsearch.randomizedtesting.ThreadLeakControl
>tryToInterruptAll
>>> >> [junit4] 2> SEVERE: There are still zombie threads that
>couldn't be
>>> terminated:
>>> >> [junit4] 2> 1) Thread[id=149, name=TEST-
>>> TestSnowballVocab.testStemmers-seed#[7FBAD445ED608074],
>>> state=RUNNABLE, group=TGRP-TestSnowballVocab]
>>> >> [junit4] 2> at
>>>
>org.tartarus.snowball.ext.FrenchStemmer.stem(FrenchStemmer.java:1379)
>>> >> [junit4] 2> at
>>>
>org.apache.lucene.analysis.snowball.SnowballFilter.incrementToken(Snowb
>>> allFilter.java:95)
>>> >> [junit4] 2> at
>>>
>org.apache.lucene.analysis.BaseTokenStreamTestCase.checkResetException
>>> (BaseTokenStreamTestCase.java:400)
>>> >> [junit4] 2> at
>>>
>org.apache.lucene.analysis.BaseTokenStreamTestCase.assertAnalyzesTo(Bas
>>> eTokenStreamTestCase.java:352)
>>> >> [junit4] 2> at
>>>
>org.apache.lucene.analysis.BaseTokenStreamTestCase.assertAnalyzesTo(Bas
>>> eTokenStreamTestCase.java:362)
>>> >> [junit4] 2> at
>>> org.apache.lucene.analysis.BaseTokenStreamTestCase.checkOneTerm(Base
>>> TokenStreamTestCase.java:423)
>>> >> [junit4] 2> at
>>>
>org.apache.lucene.analysis.VocabularyAssert.assertVocabulary(VocabularyA
>>> ssert.java:47)
>>> >> [junit4] 2> at
>>>
>org.apache.lucene.analysis.VocabularyAssert.assertVocabulary(VocabularyA
>>> ssert.java:73)
>>> >> [junit4] 2> at
>>>
>org.apache.lucene.analysis.snowball.TestSnowballVocab.assertCorrectOutpu
>>> t(TestSnowballVocab.java:80)
>>> >> [junit4] 2> at
>>>
>org.apache.lucene.analysis.snowball.TestSnowballVocab.testStemmers(Test
>>> SnowballVocab.java:45)
>>> >> [junit4] 2> at
>>> sun.reflect.NativeMethodAccessorImpl.invoke0(Native Method)
>>> >> [junit4] 2> at
>>>
>sun.reflect.NativeMethodAccessorImpl.invoke(NativeMethodAccessorImpl.j
>>> ava:62)
>>> >> [junit4] 2> at
>>>
>sun.reflect.DelegatingMethodAccessorImpl.invoke(DelegatingMethodAcces
>>> sorImpl.java:43)
>>> >> [junit4] 2> at
>java.lang.reflect.Method.invoke(Method.java:502)
>>> >> [junit4] 2> at
>>> com.carrotsearch.randomizedtesting.RandomizedRunner.invoke(Randomize
>>> dRunner.java:1627)
>>> >> [junit4] 2> at
>>> com.carrotsearch.randomizedtesting.RandomizedRunner$6.evaluate(Rando
>>> mizedRunner.java:836)
>>> >> [junit4] 2> at
>>> com.carrotsearch.randomizedtesting.RandomizedRunner$7.evaluate(Rando
>>> mizedRunner.java:872)
>>> >> [junit4] 2> at
>>> com.carrotsearch.randomizedtesting.RandomizedRunner$8.evaluate(Rando
>>> mizedRunner.java:886)
>>> >> [junit4] 2> at
>>>
>org.apache.lucene.util.TestRuleSetupTeardownChained$1.evaluate(TestRule
>>> SetupTeardownChained.java:50)
>>> >> [junit4] 2> at
>>>
>org.apache.lucene.util.AbstractBeforeAfterRule$1.evaluate(AbstractBeforeA
>>> fterRule.java:46)
>>> >> [junit4] 2> at
>>>
>org.apache.lucene.util.TestRuleThreadAndTestName$1.evaluate(TestRuleTh
>>> readAndTestName.java:49)
>>> >> [junit4] 2> at
>>>
>org.apache.lucene.util.TestRuleIgnoreAfterMaxFailures$1.evaluate(TestRule
>>> IgnoreAfterMaxFailures.java:65)
>>> >> [junit4] 2> at
>>>
>org.apache.lucene.util.TestRuleMarkFailure$1.evaluate(TestRuleMarkFailure
>>> .java:48)
>>> >> [junit4] 2> at
>>>
>com.carrotsearch.randomizedtesting.rules.StatementAdapter.evaluate(Stat
>>> ementAdapter.java:36)
>>> >> [junit4] 2> at
>>>
>com.carrotsearch.randomizedtesting.ThreadLeakControl$StatementRunner.
>>> run(ThreadLeakControl.java:365)
>>> >> [junit4] 2> at
>>>
>com.carrotsearch.randomizedtesting.ThreadLeakControl.forkTimeoutingTask
>>> (ThreadLeakControl.java:798)
>>> >> [junit4] 2> at
>>>
>com.carrotsearch.randomizedtesting.ThreadLeakControl$3.evaluate(ThreadL
>>> eakControl.java:458)
>>> >> [junit4] 2> at
>>>
>com.carrotsearch.randomizedtesting.RandomizedRunner.runSingleTest(Ran
>>> domizedRunner.java:845)
>>> >> [junit4] 2> at
>>> com.carrotsearch.randomizedtesting.RandomizedRunner$3.evaluate(Rando
>>> mizedRunner.java:747)
>>> >> [junit4] 2> at
>>> com.carrotsearch.randomizedtesting.RandomizedRunner$4.evaluate(Rando
>>> mizedRunner.java:781)
>>> >> [junit4] 2> at
>>> com.carrotsearch.randomizedtesting.RandomizedRunner$5.evaluate(Rando
>>> mizedRunner.java:792)
>>> >> [junit4] 2> at
>>>
>org.apache.lucene.util.AbstractBeforeAfterRule$1.evaluate(AbstractBeforeA
>>> fterRule.java:46)
>>> >> [junit4] 2> at
>>>
>com.carrotsearch.randomizedtesting.rules.StatementAdapter.evaluate(Stat
>>> ementAdapter.java:36)
>>> >> [junit4] 2> at
>>>
>org.apache.lucene.util.TestRuleStoreClassName$1.evaluate(TestRuleStoreCl
>>> assName.java:42)
>>> >> [junit4] 2> at
>>> com.carrotsearch.randomizedtesting.rules.NoShadowingOrOverridesOnMet
>>> hodsRule$1.evaluate(NoShadowingOrOverridesOnMethodsRule.java:39)
>>> >> [junit4] 2> at
>>> com.carrotsearch.randomizedtesting.rules.NoShadowingOrOverridesOnMet
>>> hodsRule$1.evaluate(NoShadowingOrOverridesOnMethodsRule.java:39)
>>> >> [junit4] 2> at
>>>
>com.carrotsearch.randomizedtesting.rules.StatementAdapter.evaluate(Stat
>>> ementAdapter.java:36)
>>> >> [junit4] 2> at
>>>
>com.carrotsearch.randomizedtesting.rules.StatementAdapter.evaluate(Stat
>>> ementAdapter.java:36)
>>> >> [junit4] 2> at
>>>
>com.carrotsearch.randomizedtesting.rules.StatementAdapter.evaluate(Stat
>>> ementAdapter.java:36)
>>> >> [junit4] 2> at
>>>
>org.apache.lucene.util.TestRuleAssertionsRequired$1.evaluate(TestRuleAss
>>> ertionsRequired.java:54)
>>> >> [junit4] 2> at
>>>
>org.apache.lucene.util.TestRuleMarkFailure$1.evaluate(TestRuleMarkFailure
>>> .java:48)
>>> >> [junit4] 2> at
>>>
>org.apache.lucene.util.TestRuleIgnoreAfterMaxFailures$1.evaluate(TestRule
>>> IgnoreAfterMaxFailures.java:65)
>>> >> [junit4] 2> at
>>>
>org.apache.lucene.util.TestRuleIgnoreTestSuites$1.evaluate(TestRuleIgnore
>>> TestSuites.java:55)
>>> >> [junit4] 2> at
>>>
>com.carrotsearch.randomizedtesting.rules.StatementAdapter.evaluate(Stat
>>> ementAdapter.java:36)
>>> >> [junit4] 2> at
>>>
>com.carrotsearch.randomizedtesting.ThreadLeakControl$StatementRunner.
>>> run(ThreadLeakControl.java:365)
>>> >> [junit4] 2> at java.lang.Thread.run(Thread.java:745)
>>> >> [junit4] 2> NOTE: test params are:
>codec=Asserting(Lucene50): {},
>>> docValues:{}, sim=RandomSimilarityProvider(queryNorm=true,coord=no):
>{},
>>> locale=it, timezone=America/Cordoba
>>> >> [junit4] 2> NOTE: Linux 3.13.0-52-generic amd64/Oracle
>Corporation
>>> 1.9.0-ea (64-bit)/cpus=12,threads=2,free=245344712,total=530579456
>>> >> [junit4] 2> NOTE: All tests run in this JVM:
>[TestCondition2,
>>> TestHyphenatedWordsFilter, TestUAX29URLEmailAnalyzer,
>>> TestFrenchLightStemFilter, TokenRangeSinkTokenizerTest,
>TestCJKAnalyzer,
>>> TestOnlyInCompound, TestDutchAnalyzer, TestEmptyTokenStream,
>>> Test64kAffixes, TestIndonesianStemmer,
>TestItalianLightStemFilterFactory,
>>> TestTurkishLowerCaseFilterFactory, TestRandomChains,
>>> TestBasqueAnalyzer, TestArabicNormalizationFilter,
>>> TestNorwegianMinimalStemFilterFactory, TestCaseInsensitive,
>>> TestGermanMinimalStemFilterFactory, TestDanishAnalyzer,
>>> TestStemmerOverrideFilter, TestKStemFilterFactory,
>TestHunspellStemFilter,
>>> TestCustomAnalyzer, TestCJKWidthFilter,
>>> TestScandinavianNormalizationFilterFactory, TestArmenianAnalyzer,
>>> TestHTMLStripCharFilterFactory, TestFullStrip, NGramTokenizerTest,
>>> TestGermanLightStemFilter,
>>> TestDictionaryCompoundWordTokenFilterFactory,
>>> TestSynonymFilterFactory, CommonGramsFilterTest, TestHomonyms,
>>> TestSnowballVocab]
>>> >> [junit4] 2> NOTE: reproduce with: ant test -
>>> Dtestcase=TestSnowballVocab -Dtests.seed=7FBAD445ED608074 -
>>> Dtests.multiplier=3 -Dtests.slow=true -Dtests.locale=it -
>>> Dtests.timezone=America/Cordoba -Dtests.asserts=true -
>>> Dtests.file.encoding=US-ASCII
>>> >> [junit4] ERROR 0.00s J2 | TestSnowballVocab (suite) <<<
>>> >> [junit4] > Throwable #1: java.lang.Exception: Suite timeout
>exceeded
>>> (>= 7200000 msec).
>>> >> [junit4] > at
>>> __randomizedtesting.SeedInfo.seed([7FBAD445ED608074]:0)
>>> >> [junit4] Completed [261/270] on J2 in 7223.12s, 1 test, 2
>errors <<<
>>> FAILURES!
>>> >>
>>> >> [...truncated 39 lines...]
>>> >> BUILD FAILED
>>> >> /home/jenkins/workspace/Lucene-Solr-trunk-Linux/build.xml:526:
>The
>>> following error occurred while executing this line:
>>> >> /home/jenkins/workspace/Lucene-Solr-trunk-Linux/build.xml:474:
>The
>>> following error occurred while executing this line:
>>> >> /home/jenkins/workspace/Lucene-Solr-trunk-Linux/build.xml:61: The
>>> following error occurred while executing this line:
>>> >>
>/home/jenkins/workspace/Lucene-Solr-trunk-Linux/extra-targets.xml:39:
>>> The following error occurred while executing this line:
>>> >> /home/jenkins/workspace/Lucene-Solr-trunk-
>>> Linux/lucene/build.xml:466: The following error occurred while
>executing this
>>> line:
>>> >> /home/jenkins/workspace/Lucene-Solr-trunk-Linux/lucene/common-
>>> build.xml:2145: The following error occurred while executing this
>line:
>>> >> /home/jenkins/workspace/Lucene-Solr-trunk-
>>> Linux/lucene/analysis/build.xml:106: The following error occurred
>while
>>> executing this line:
>>> >> /home/jenkins/workspace/Lucene-Solr-trunk-
>>> Linux/lucene/analysis/build.xml:38: The following error occurred
>while
>>> executing this line:
>>> >> /home/jenkins/workspace/Lucene-Solr-trunk-Linux/lucene/module-
>>> build.xml:58: The following error occurred while executing this
>line:
>>> >> /home/jenkins/workspace/Lucene-Solr-trunk-Linux/lucene/common-
>>> build.xml:1415: The following error occurred while executing this
>line:
>>> >> /home/jenkins/workspace/Lucene-Solr-trunk-Linux/lucene/common-
>>> build.x
>>> >> ml:973: There were test failures: 270 suites, 1376 tests, 1
>>> >> suite-level error, 1 error, 40 ignored
>>> >>
>>> >> Total time: 129 minutes 18 seconds
>>> >> Build step 'Invoke Ant' marked build as failure Archiving
>artifacts
>>> >> Recording test results Email was triggered for: Failure - Any
>Sending
>>> >> email for trigger: Failure - Any
>>> >>
>>> >>
>>> >>
>>> >>
>>> >>
>---------------------------------------------------------------------
>>> >> To unsubscribe, e-mail: dev-unsubscribe@lucene.apache.org For
>>> >> additional commands, e-mail: dev-help@lucene.apache.org
>>> >
>>> >
>---------------------------------------------------------------------
>>> > To unsubscribe, e-mail: dev-unsubscribe@lucene.apache.org For
>>> > additional commands, e-mail: dev-help@lucene.apache.org
>>> >
>>>
>>>
>---------------------------------------------------------------------
>>> To unsubscribe, e-mail: dev-unsubscribe@lucene.apache.org For
>additional
>>> commands, e-mail: dev-help@lucene.apache.org
>>
>>
>> ---------------------------------------------------------------------
>> To unsubscribe, e-mail: dev-unsubscribe@lucene.apache.org
>> For additional commands, e-mail: dev-help@lucene.apache.org
>>
>
>---------------------------------------------------------------------
>To unsubscribe, e-mail: dev-unsubscribe@lucene.apache.org
>For additional commands, e-mail: dev-help@lucene.apache.org
--
Uwe Schindler
H.-H.-Meier-Allee 63, 28213 Bremen
http://www.thetaphi.de
Re: [JENKINS] Lucene-Solr-trunk-Linux (64bit/jdk1.9.0-ea-b60) - Build
# 12746 - Failure!
Posted by Michael McCandless <lu...@mikemccandless.com>.
Hrmph, OK, that's before the bug showed up (3.14) ...
Mike McCandless
http://blog.mikemccandless.com
On Wed, May 20, 2015 at 2:41 PM, Uwe Schindler <uw...@thetaphi.de> wrote:
> This is the very latest kernel from Ubuntu 14.04:
>
> serv1:~# uname -a
> Linux serv1 3.13.0-52-generic #86-Ubuntu SMP Mon May 4 04:32:59 UTC 2015 x86_64 x86_64 x86_64 GNU/Linux
>
> Uwe
>
> -----
> Uwe Schindler
> H.-H.-Meier-Allee 63, D-28213 Bremen
> http://www.thetaphi.de
> eMail: uwe@thetaphi.de
>
>
>> -----Original Message-----
>> From: Michael McCandless [mailto:lucene@mikemccandless.com]
>> Sent: Wednesday, May 20, 2015 3:35 PM
>> To: Lucene/Solr dev
>> Subject: Re: [JENKINS] Lucene-Solr-trunk-Linux (64bit/jdk1.9.0-ea-b60) -
>> Build # 12746 - Failure!
>>
>> Uwe, which exact Linux kernel version and CPU is this build box? I'm
>> wondering if we're maybe hitting this crazy Linux kernel bug:
>> https://groups.google.com/forum/#!msg/mechanical-
>> sympathy/QbmpZxp6C64/BonaHiVbEmsJ
>>
>> I wish the HEARTBEAT would give us more info, e.g. how much CPU is the
>> JVM process using (are we hung or spinning?), and thread stack traces ... I
>> know I sound like a broken record Dawid!
>>
>> Mike McCandless
>>
>> http://blog.mikemccandless.com
>>
>>
>> On Wed, May 20, 2015 at 6:05 AM, Dawid Weiss
>> <da...@cs.put.poznan.pl> wrote:
>> > Does not reproduce for me.
>> >
>> > Dawid
>> >
>> > On Tue, May 19, 2015 at 11:52 PM, Policeman Jenkins Server
>> > <je...@thetaphi.de> wrote:
>> >> Build: http://jenkins.thetaphi.de/job/Lucene-Solr-trunk-Linux/12746/
>> >> Java: 64bit/jdk1.9.0-ea-b60 -XX:-UseCompressedOops -XX:+UseG1GC
>> >>
>> >> 2 tests failed.
>> >> FAILED:
>> >> junit.framework.TestSuite.org.apache.lucene.analysis.snowball.TestSno
>> >> wballVocab
>> >>
>> >> Error Message:
>> >> Suite timeout exceeded (>= 7200000 msec).
>> >>
>> >> Stack Trace:
>> >> java.lang.Exception: Suite timeout exceeded (>= 7200000 msec).
>> >> at __randomizedtesting.SeedInfo.seed([7FBAD445ED608074]:0)
>> >>
>> >>
>> >> FAILED:
>> >> org.apache.lucene.analysis.snowball.TestSnowballVocab.testStemmers
>> >>
>> >> Error Message:
>> >> Test abandoned because suite timeout was reached.
>> >>
>> >> Stack Trace:
>> >> java.lang.Exception: Test abandoned because suite timeout was reached.
>> >> at __randomizedtesting.SeedInfo.seed([7FBAD445ED608074]:0)
>> >>
>> >>
>> >>
>> >>
>> >> Build Log:
>> >> [...truncated 3199 lines...]
>> >> [junit4] Suite: org.apache.lucene.analysis.snowball.TestSnowballVocab
>> >> [junit4] 2> mag 19, 2015 6:51:40 PM
>> com.carrotsearch.randomizedtesting.ThreadLeakControl$2 evaluate
>> >> [junit4] 2> WARNING: Suite execution timed out:
>> org.apache.lucene.analysis.snowball.TestSnowballVocab
>> >> [junit4] 2> 1) Thread[id=13, name=JUnit4-serializer-daemon,
>> state=TIMED_WAITING, group=main]
>> >> [junit4] 2> at java.lang.Thread.sleep(Native Method)
>> >> [junit4] 2> at
>> com.carrotsearch.ant.tasks.junit4.events.Serializer$1.run(Serializer.java:47)
>> >> [junit4] 2> 2) Thread[id=1, name=main, state=WAITING, group=main]
>> >> [junit4] 2> at java.lang.Object.wait(Native Method)
>> >> [junit4] 2> at java.lang.Thread.join(Thread.java:1249)
>> >> [junit4] 2> at java.lang.Thread.join(Thread.java:1323)
>> >> [junit4] 2> at
>> com.carrotsearch.randomizedtesting.RandomizedRunner.runSuite(Randomi
>> zedRunner.java:578)
>> >> [junit4] 2> at
>> com.carrotsearch.randomizedtesting.RandomizedRunner.run(RandomizedR
>> unner.java:444)
>> >> [junit4] 2> at
>> com.carrotsearch.ant.tasks.junit4.slave.SlaveMain.execute(SlaveMain.java:1
>> 99)
>> >> [junit4] 2> at
>> com.carrotsearch.ant.tasks.junit4.slave.SlaveMain.main(SlaveMain.java:310)
>> >> [junit4] 2> at
>> com.carrotsearch.ant.tasks.junit4.slave.SlaveMainSafe.main(SlaveMainSafe.j
>> ava:12)
>> >> [junit4] 2> 3) Thread[id=148, name=SUITE-TestSnowballVocab-
>> seed#[7FBAD445ED608074], state=RUNNABLE, group=TGRP-
>> TestSnowballVocab]
>> >> [junit4] 2> at java.lang.Thread.getStackTrace(Thread.java:1556)
>> >> [junit4] 2> at
>> com.carrotsearch.randomizedtesting.ThreadLeakControl.getThreadsWithTra
>> ces(ThreadLeakControl.java:690)
>> >> [junit4] 2> at
>> com.carrotsearch.randomizedtesting.ThreadLeakControl.formatThreadStack
>> sFull(ThreadLeakControl.java:679)
>> >> [junit4] 2> at
>> com.carrotsearch.randomizedtesting.ThreadLeakControl.access$900(ThreadL
>> eakControl.java:62)
>> >> [junit4] 2> at
>> com.carrotsearch.randomizedtesting.ThreadLeakControl$2.evaluate(ThreadL
>> eakControl.java:412)
>> >> [junit4] 2> at
>> com.carrotsearch.randomizedtesting.RandomizedRunner.runSuite(Randomi
>> zedRunner.java:651)
>> >> [junit4] 2> at
>> com.carrotsearch.randomizedtesting.RandomizedRunner.access$200(Rando
>> mizedRunner.java:138)
>> >> [junit4] 2> at
>> com.carrotsearch.randomizedtesting.RandomizedRunner$1.run(Randomized
>> Runner.java:568)
>> >> [junit4] 2> 4) Thread[id=149, name=TEST-
>> TestSnowballVocab.testStemmers-seed#[7FBAD445ED608074],
>> state=RUNNABLE, group=TGRP-TestSnowballVocab]
>> >> [junit4] 2> at
>> org.tartarus.snowball.ext.FrenchStemmer.stem(FrenchStemmer.java:1379)
>> >> [junit4] 2> at
>> org.apache.lucene.analysis.snowball.SnowballFilter.incrementToken(Snowb
>> allFilter.java:95)
>> >> [junit4] 2> at
>> org.apache.lucene.analysis.BaseTokenStreamTestCase.checkResetException
>> (BaseTokenStreamTestCase.java:400)
>> >> [junit4] 2> at
>> org.apache.lucene.analysis.BaseTokenStreamTestCase.assertAnalyzesTo(Bas
>> eTokenStreamTestCase.java:352)
>> >> [junit4] 2> at
>> org.apache.lucene.analysis.BaseTokenStreamTestCase.assertAnalyzesTo(Bas
>> eTokenStreamTestCase.java:362)
>> >> [junit4] 2> at
>> org.apache.lucene.analysis.BaseTokenStreamTestCase.checkOneTerm(Base
>> TokenStreamTestCase.java:423)
>> >> [junit4] 2> at
>> org.apache.lucene.analysis.VocabularyAssert.assertVocabulary(VocabularyA
>> ssert.java:47)
>> >> [junit4] 2> at
>> org.apache.lucene.analysis.VocabularyAssert.assertVocabulary(VocabularyA
>> ssert.java:73)
>> >> [junit4] 2> at
>> org.apache.lucene.analysis.snowball.TestSnowballVocab.assertCorrectOutpu
>> t(TestSnowballVocab.java:80)
>> >> [junit4] 2> at
>> org.apache.lucene.analysis.snowball.TestSnowballVocab.testStemmers(Test
>> SnowballVocab.java:45)
>> >> [junit4] 2> at
>> sun.reflect.NativeMethodAccessorImpl.invoke0(Native Method)
>> >> [junit4] 2> at
>> sun.reflect.NativeMethodAccessorImpl.invoke(NativeMethodAccessorImpl.j
>> ava:62)
>> >> [junit4] 2> at
>> sun.reflect.DelegatingMethodAccessorImpl.invoke(DelegatingMethodAcces
>> sorImpl.java:43)
>> >> [junit4] 2> at java.lang.reflect.Method.invoke(Method.java:502)
>> >> [junit4] 2> at
>> com.carrotsearch.randomizedtesting.RandomizedRunner.invoke(Randomize
>> dRunner.java:1627)
>> >> [junit4] 2> at
>> com.carrotsearch.randomizedtesting.RandomizedRunner$6.evaluate(Rando
>> mizedRunner.java:836)
>> >> [junit4] 2> at
>> com.carrotsearch.randomizedtesting.RandomizedRunner$7.evaluate(Rando
>> mizedRunner.java:872)
>> >> [junit4] 2> at
>> com.carrotsearch.randomizedtesting.RandomizedRunner$8.evaluate(Rando
>> mizedRunner.java:886)
>> >> [junit4] 2> at
>> org.apache.lucene.util.TestRuleSetupTeardownChained$1.evaluate(TestRule
>> SetupTeardownChained.java:50)
>> >> [junit4] 2> at
>> org.apache.lucene.util.AbstractBeforeAfterRule$1.evaluate(AbstractBeforeA
>> fterRule.java:46)
>> >> [junit4] 2> at
>> org.apache.lucene.util.TestRuleThreadAndTestName$1.evaluate(TestRuleTh
>> readAndTestName.java:49)
>> >> [junit4] 2> at
>> org.apache.lucene.util.TestRuleIgnoreAfterMaxFailures$1.evaluate(TestRule
>> IgnoreAfterMaxFailures.java:65)
>> >> [junit4] 2> at
>> org.apache.lucene.util.TestRuleMarkFailure$1.evaluate(TestRuleMarkFailure
>> .java:48)
>> >> [junit4] 2> at
>> com.carrotsearch.randomizedtesting.rules.StatementAdapter.evaluate(Stat
>> ementAdapter.java:36)
>> >> [junit4] 2> at
>> com.carrotsearch.randomizedtesting.ThreadLeakControl$StatementRunner.
>> run(ThreadLeakControl.java:365)
>> >> [junit4] 2> at
>> com.carrotsearch.randomizedtesting.ThreadLeakControl.forkTimeoutingTask
>> (ThreadLeakControl.java:798)
>> >> [junit4] 2> at
>> com.carrotsearch.randomizedtesting.ThreadLeakControl$3.evaluate(ThreadL
>> eakControl.java:458)
>> >> [junit4] 2> at
>> com.carrotsearch.randomizedtesting.RandomizedRunner.runSingleTest(Ran
>> domizedRunner.java:845)
>> >> [junit4] 2> at
>> com.carrotsearch.randomizedtesting.RandomizedRunner$3.evaluate(Rando
>> mizedRunner.java:747)
>> >> [junit4] 2> at
>> com.carrotsearch.randomizedtesting.RandomizedRunner$4.evaluate(Rando
>> mizedRunner.java:781)
>> >> [junit4] 2> at
>> com.carrotsearch.randomizedtesting.RandomizedRunner$5.evaluate(Rando
>> mizedRunner.java:792)
>> >> [junit4] 2> at
>> org.apache.lucene.util.AbstractBeforeAfterRule$1.evaluate(AbstractBeforeA
>> fterRule.java:46)
>> >> [junit4] 2> at
>> com.carrotsearch.randomizedtesting.rules.StatementAdapter.evaluate(Stat
>> ementAdapter.java:36)
>> >> [junit4] 2> at
>> org.apache.lucene.util.TestRuleStoreClassName$1.evaluate(TestRuleStoreCl
>> assName.java:42)
>> >> [junit4] 2> at
>> com.carrotsearch.randomizedtesting.rules.NoShadowingOrOverridesOnMet
>> hodsRule$1.evaluate(NoShadowingOrOverridesOnMethodsRule.java:39)
>> >> [junit4] 2> at
>> com.carrotsearch.randomizedtesting.rules.NoShadowingOrOverridesOnMet
>> hodsRule$1.evaluate(NoShadowingOrOverridesOnMethodsRule.java:39)
>> >> [junit4] 2> at
>> com.carrotsearch.randomizedtesting.rules.StatementAdapter.evaluate(Stat
>> ementAdapter.java:36)
>> >> [junit4] 2> at
>> com.carrotsearch.randomizedtesting.rules.StatementAdapter.evaluate(Stat
>> ementAdapter.java:36)
>> >> [junit4] 2> at
>> com.carrotsearch.randomizedtesting.rules.StatementAdapter.evaluate(Stat
>> ementAdapter.java:36)
>> >> [junit4] 2> at
>> org.apache.lucene.util.TestRuleAssertionsRequired$1.evaluate(TestRuleAss
>> ertionsRequired.java:54)
>> >> [junit4] 2> at
>> org.apache.lucene.util.TestRuleMarkFailure$1.evaluate(TestRuleMarkFailure
>> .java:48)
>> >> [junit4] 2> at
>> org.apache.lucene.util.TestRuleIgnoreAfterMaxFailures$1.evaluate(TestRule
>> IgnoreAfterMaxFailures.java:65)
>> >> [junit4] 2> at
>> org.apache.lucene.util.TestRuleIgnoreTestSuites$1.evaluate(TestRuleIgnore
>> TestSuites.java:55)
>> >> [junit4] 2> at
>> com.carrotsearch.randomizedtesting.rules.StatementAdapter.evaluate(Stat
>> ementAdapter.java:36)
>> >> [junit4] 2> at
>> com.carrotsearch.randomizedtesting.ThreadLeakControl$StatementRunner.
>> run(ThreadLeakControl.java:365)
>> >> [junit4] 2> at java.lang.Thread.run(Thread.java:745)
>> >> [junit4] 2> NOTE: reproduce with: ant test -
>> Dtestcase=TestSnowballVocab -Dtests.method=testStemmers -
>> Dtests.seed=7FBAD445ED608074 -Dtests.multiplier=3 -Dtests.slow=true -
>> Dtests.locale=it -Dtests.timezone=America/Cordoba -Dtests.asserts=true -
>> Dtests.file.encoding=US-ASCII
>> >> [junit4] ERROR 7200s J2 | TestSnowballVocab.testStemmers <<<
>> >> [junit4] > Throwable #1: java.lang.Exception: Test abandoned because
>> suite timeout was reached.
>> >> [junit4] > at
>> __randomizedtesting.SeedInfo.seed([7FBAD445ED608074]:0)
>> >> [junit4] 2> mag 19, 2015 6:51:40 PM
>> com.carrotsearch.randomizedtesting.ThreadLeakControl checkThreadLeaks
>> >> [junit4] 2> WARNING: Will linger awaiting termination of 1 leaked
>> thread(s).
>> >> [junit4] 2> mag 19, 2015 6:52:00 PM
>> com.carrotsearch.randomizedtesting.ThreadLeakControl checkThreadLeaks
>> >> [junit4] 2> SEVERE: 1 thread leaked from SUITE scope at
>> org.apache.lucene.analysis.snowball.TestSnowballVocab:
>> >> [junit4] 2> 1) Thread[id=149, name=TEST-
>> TestSnowballVocab.testStemmers-seed#[7FBAD445ED608074],
>> state=RUNNABLE, group=TGRP-TestSnowballVocab]
>> >> [junit4] 2> at
>> org.tartarus.snowball.ext.FrenchStemmer.stem(FrenchStemmer.java:1379)
>> >> [junit4] 2> at
>> org.apache.lucene.analysis.snowball.SnowballFilter.incrementToken(Snowb
>> allFilter.java:95)
>> >> [junit4] 2> at
>> org.apache.lucene.analysis.BaseTokenStreamTestCase.checkResetException
>> (BaseTokenStreamTestCase.java:400)
>> >> [junit4] 2> at
>> org.apache.lucene.analysis.BaseTokenStreamTestCase.assertAnalyzesTo(Bas
>> eTokenStreamTestCase.java:352)
>> >> [junit4] 2> at
>> org.apache.lucene.analysis.BaseTokenStreamTestCase.assertAnalyzesTo(Bas
>> eTokenStreamTestCase.java:362)
>> >> [junit4] 2> at
>> org.apache.lucene.analysis.BaseTokenStreamTestCase.checkOneTerm(Base
>> TokenStreamTestCase.java:423)
>> >> [junit4] 2> at
>> org.apache.lucene.analysis.VocabularyAssert.assertVocabulary(VocabularyA
>> ssert.java:47)
>> >> [junit4] 2> at
>> org.apache.lucene.analysis.VocabularyAssert.assertVocabulary(VocabularyA
>> ssert.java:73)
>> >> [junit4] 2> at
>> org.apache.lucene.analysis.snowball.TestSnowballVocab.assertCorrectOutpu
>> t(TestSnowballVocab.java:80)
>> >> [junit4] 2> at
>> org.apache.lucene.analysis.snowball.TestSnowballVocab.testStemmers(Test
>> SnowballVocab.java:45)
>> >> [junit4] 2> at
>> sun.reflect.NativeMethodAccessorImpl.invoke0(Native Method)
>> >> [junit4] 2> at
>> sun.reflect.NativeMethodAccessorImpl.invoke(NativeMethodAccessorImpl.j
>> ava:62)
>> >> [junit4] 2> at
>> sun.reflect.DelegatingMethodAccessorImpl.invoke(DelegatingMethodAcces
>> sorImpl.java:43)
>> >> [junit4] 2> at java.lang.reflect.Method.invoke(Method.java:502)
>> >> [junit4] 2> at
>> com.carrotsearch.randomizedtesting.RandomizedRunner.invoke(Randomize
>> dRunner.java:1627)
>> >> [junit4] 2> at
>> com.carrotsearch.randomizedtesting.RandomizedRunner$6.evaluate(Rando
>> mizedRunner.java:836)
>> >> [junit4] 2> at
>> com.carrotsearch.randomizedtesting.RandomizedRunner$7.evaluate(Rando
>> mizedRunner.java:872)
>> >> [junit4] 2> at
>> com.carrotsearch.randomizedtesting.RandomizedRunner$8.evaluate(Rando
>> mizedRunner.java:886)
>> >> [junit4] 2> at
>> org.apache.lucene.util.TestRuleSetupTeardownChained$1.evaluate(TestRule
>> SetupTeardownChained.java:50)
>> >> [junit4] 2> at
>> org.apache.lucene.util.AbstractBeforeAfterRule$1.evaluate(AbstractBeforeA
>> fterRule.java:46)
>> >> [junit4] 2> at
>> org.apache.lucene.util.TestRuleThreadAndTestName$1.evaluate(TestRuleTh
>> readAndTestName.java:49)
>> >> [junit4] 2> at
>> org.apache.lucene.util.TestRuleIgnoreAfterMaxFailures$1.evaluate(TestRule
>> IgnoreAfterMaxFailures.java:65)
>> >> [junit4] 2> at
>> org.apache.lucene.util.TestRuleMarkFailure$1.evaluate(TestRuleMarkFailure
>> .java:48)
>> >> [junit4] 2> at
>> com.carrotsearch.randomizedtesting.rules.StatementAdapter.evaluate(Stat
>> ementAdapter.java:36)
>> >> [junit4] 2> at
>> com.carrotsearch.randomizedtesting.ThreadLeakControl$StatementRunner.
>> run(ThreadLeakControl.java:365)
>> >> [junit4] 2> at
>> com.carrotsearch.randomizedtesting.ThreadLeakControl.forkTimeoutingTask
>> (ThreadLeakControl.java:798)
>> >> [junit4] 2> at
>> com.carrotsearch.randomizedtesting.ThreadLeakControl$3.evaluate(ThreadL
>> eakControl.java:458)
>> >> [junit4] 2> at
>> com.carrotsearch.randomizedtesting.RandomizedRunner.runSingleTest(Ran
>> domizedRunner.java:845)
>> >> [junit4] 2> at
>> com.carrotsearch.randomizedtesting.RandomizedRunner$3.evaluate(Rando
>> mizedRunner.java:747)
>> >> [junit4] 2> at
>> com.carrotsearch.randomizedtesting.RandomizedRunner$4.evaluate(Rando
>> mizedRunner.java:781)
>> >> [junit4] 2> at
>> com.carrotsearch.randomizedtesting.RandomizedRunner$5.evaluate(Rando
>> mizedRunner.java:792)
>> >> [junit4] 2> at
>> org.apache.lucene.util.AbstractBeforeAfterRule$1.evaluate(AbstractBeforeA
>> fterRule.java:46)
>> >> [junit4] 2> at
>> com.carrotsearch.randomizedtesting.rules.StatementAdapter.evaluate(Stat
>> ementAdapter.java:36)
>> >> [junit4] 2> at
>> org.apache.lucene.util.TestRuleStoreClassName$1.evaluate(TestRuleStoreCl
>> assName.java:42)
>> >> [junit4] 2> at
>> com.carrotsearch.randomizedtesting.rules.NoShadowingOrOverridesOnMet
>> hodsRule$1.evaluate(NoShadowingOrOverridesOnMethodsRule.java:39)
>> >> [junit4] 2> at
>> com.carrotsearch.randomizedtesting.rules.NoShadowingOrOverridesOnMet
>> hodsRule$1.evaluate(NoShadowingOrOverridesOnMethodsRule.java:39)
>> >> [junit4] 2> at
>> com.carrotsearch.randomizedtesting.rules.StatementAdapter.evaluate(Stat
>> ementAdapter.java:36)
>> >> [junit4] 2> at
>> com.carrotsearch.randomizedtesting.rules.StatementAdapter.evaluate(Stat
>> ementAdapter.java:36)
>> >> [junit4] 2> at
>> com.carrotsearch.randomizedtesting.rules.StatementAdapter.evaluate(Stat
>> ementAdapter.java:36)
>> >> [junit4] 2> at
>> org.apache.lucene.util.TestRuleAssertionsRequired$1.evaluate(TestRuleAss
>> ertionsRequired.java:54)
>> >> [junit4] 2> at
>> org.apache.lucene.util.TestRuleMarkFailure$1.evaluate(TestRuleMarkFailure
>> .java:48)
>> >> [junit4] 2> at
>> org.apache.lucene.util.TestRuleIgnoreAfterMaxFailures$1.evaluate(TestRule
>> IgnoreAfterMaxFailures.java:65)
>> >> [junit4] 2> at
>> org.apache.lucene.util.TestRuleIgnoreTestSuites$1.evaluate(TestRuleIgnore
>> TestSuites.java:55)
>> >> [junit4] 2> at
>> com.carrotsearch.randomizedtesting.rules.StatementAdapter.evaluate(Stat
>> ementAdapter.java:36)
>> >> [junit4] 2> at
>> com.carrotsearch.randomizedtesting.ThreadLeakControl$StatementRunner.
>> run(ThreadLeakControl.java:365)
>> >> [junit4] 2> at java.lang.Thread.run(Thread.java:745)
>> >> [junit4] 2> mag 19, 2015 6:52:00 PM
>> com.carrotsearch.randomizedtesting.ThreadLeakControl tryToInterruptAll
>> >> [junit4] 2> INFO: Starting to interrupt leaked threads:
>> >> [junit4] 2> 1) Thread[id=149, name=TEST-
>> TestSnowballVocab.testStemmers-seed#[7FBAD445ED608074],
>> state=RUNNABLE, group=TGRP-TestSnowballVocab]
>> >> [junit4] 2> mag 19, 2015 6:52:03 PM
>> com.carrotsearch.randomizedtesting.ThreadLeakControl tryToInterruptAll
>> >> [junit4] 2> SEVERE: There are still zombie threads that couldn't be
>> terminated:
>> >> [junit4] 2> 1) Thread[id=149, name=TEST-
>> TestSnowballVocab.testStemmers-seed#[7FBAD445ED608074],
>> state=RUNNABLE, group=TGRP-TestSnowballVocab]
>> >> [junit4] 2> at
>> org.tartarus.snowball.ext.FrenchStemmer.stem(FrenchStemmer.java:1379)
>> >> [junit4] 2> at
>> org.apache.lucene.analysis.snowball.SnowballFilter.incrementToken(Snowb
>> allFilter.java:95)
>> >> [junit4] 2> at
>> org.apache.lucene.analysis.BaseTokenStreamTestCase.checkResetException
>> (BaseTokenStreamTestCase.java:400)
>> >> [junit4] 2> at
>> org.apache.lucene.analysis.BaseTokenStreamTestCase.assertAnalyzesTo(Bas
>> eTokenStreamTestCase.java:352)
>> >> [junit4] 2> at
>> org.apache.lucene.analysis.BaseTokenStreamTestCase.assertAnalyzesTo(Bas
>> eTokenStreamTestCase.java:362)
>> >> [junit4] 2> at
>> org.apache.lucene.analysis.BaseTokenStreamTestCase.checkOneTerm(Base
>> TokenStreamTestCase.java:423)
>> >> [junit4] 2> at
>> org.apache.lucene.analysis.VocabularyAssert.assertVocabulary(VocabularyA
>> ssert.java:47)
>> >> [junit4] 2> at
>> org.apache.lucene.analysis.VocabularyAssert.assertVocabulary(VocabularyA
>> ssert.java:73)
>> >> [junit4] 2> at
>> org.apache.lucene.analysis.snowball.TestSnowballVocab.assertCorrectOutpu
>> t(TestSnowballVocab.java:80)
>> >> [junit4] 2> at
>> org.apache.lucene.analysis.snowball.TestSnowballVocab.testStemmers(Test
>> SnowballVocab.java:45)
>> >> [junit4] 2> at
>> sun.reflect.NativeMethodAccessorImpl.invoke0(Native Method)
>> >> [junit4] 2> at
>> sun.reflect.NativeMethodAccessorImpl.invoke(NativeMethodAccessorImpl.j
>> ava:62)
>> >> [junit4] 2> at
>> sun.reflect.DelegatingMethodAccessorImpl.invoke(DelegatingMethodAcces
>> sorImpl.java:43)
>> >> [junit4] 2> at java.lang.reflect.Method.invoke(Method.java:502)
>> >> [junit4] 2> at
>> com.carrotsearch.randomizedtesting.RandomizedRunner.invoke(Randomize
>> dRunner.java:1627)
>> >> [junit4] 2> at
>> com.carrotsearch.randomizedtesting.RandomizedRunner$6.evaluate(Rando
>> mizedRunner.java:836)
>> >> [junit4] 2> at
>> com.carrotsearch.randomizedtesting.RandomizedRunner$7.evaluate(Rando
>> mizedRunner.java:872)
>> >> [junit4] 2> at
>> com.carrotsearch.randomizedtesting.RandomizedRunner$8.evaluate(Rando
>> mizedRunner.java:886)
>> >> [junit4] 2> at
>> org.apache.lucene.util.TestRuleSetupTeardownChained$1.evaluate(TestRule
>> SetupTeardownChained.java:50)
>> >> [junit4] 2> at
>> org.apache.lucene.util.AbstractBeforeAfterRule$1.evaluate(AbstractBeforeA
>> fterRule.java:46)
>> >> [junit4] 2> at
>> org.apache.lucene.util.TestRuleThreadAndTestName$1.evaluate(TestRuleTh
>> readAndTestName.java:49)
>> >> [junit4] 2> at
>> org.apache.lucene.util.TestRuleIgnoreAfterMaxFailures$1.evaluate(TestRule
>> IgnoreAfterMaxFailures.java:65)
>> >> [junit4] 2> at
>> org.apache.lucene.util.TestRuleMarkFailure$1.evaluate(TestRuleMarkFailure
>> .java:48)
>> >> [junit4] 2> at
>> com.carrotsearch.randomizedtesting.rules.StatementAdapter.evaluate(Stat
>> ementAdapter.java:36)
>> >> [junit4] 2> at
>> com.carrotsearch.randomizedtesting.ThreadLeakControl$StatementRunner.
>> run(ThreadLeakControl.java:365)
>> >> [junit4] 2> at
>> com.carrotsearch.randomizedtesting.ThreadLeakControl.forkTimeoutingTask
>> (ThreadLeakControl.java:798)
>> >> [junit4] 2> at
>> com.carrotsearch.randomizedtesting.ThreadLeakControl$3.evaluate(ThreadL
>> eakControl.java:458)
>> >> [junit4] 2> at
>> com.carrotsearch.randomizedtesting.RandomizedRunner.runSingleTest(Ran
>> domizedRunner.java:845)
>> >> [junit4] 2> at
>> com.carrotsearch.randomizedtesting.RandomizedRunner$3.evaluate(Rando
>> mizedRunner.java:747)
>> >> [junit4] 2> at
>> com.carrotsearch.randomizedtesting.RandomizedRunner$4.evaluate(Rando
>> mizedRunner.java:781)
>> >> [junit4] 2> at
>> com.carrotsearch.randomizedtesting.RandomizedRunner$5.evaluate(Rando
>> mizedRunner.java:792)
>> >> [junit4] 2> at
>> org.apache.lucene.util.AbstractBeforeAfterRule$1.evaluate(AbstractBeforeA
>> fterRule.java:46)
>> >> [junit4] 2> at
>> com.carrotsearch.randomizedtesting.rules.StatementAdapter.evaluate(Stat
>> ementAdapter.java:36)
>> >> [junit4] 2> at
>> org.apache.lucene.util.TestRuleStoreClassName$1.evaluate(TestRuleStoreCl
>> assName.java:42)
>> >> [junit4] 2> at
>> com.carrotsearch.randomizedtesting.rules.NoShadowingOrOverridesOnMet
>> hodsRule$1.evaluate(NoShadowingOrOverridesOnMethodsRule.java:39)
>> >> [junit4] 2> at
>> com.carrotsearch.randomizedtesting.rules.NoShadowingOrOverridesOnMet
>> hodsRule$1.evaluate(NoShadowingOrOverridesOnMethodsRule.java:39)
>> >> [junit4] 2> at
>> com.carrotsearch.randomizedtesting.rules.StatementAdapter.evaluate(Stat
>> ementAdapter.java:36)
>> >> [junit4] 2> at
>> com.carrotsearch.randomizedtesting.rules.StatementAdapter.evaluate(Stat
>> ementAdapter.java:36)
>> >> [junit4] 2> at
>> com.carrotsearch.randomizedtesting.rules.StatementAdapter.evaluate(Stat
>> ementAdapter.java:36)
>> >> [junit4] 2> at
>> org.apache.lucene.util.TestRuleAssertionsRequired$1.evaluate(TestRuleAss
>> ertionsRequired.java:54)
>> >> [junit4] 2> at
>> org.apache.lucene.util.TestRuleMarkFailure$1.evaluate(TestRuleMarkFailure
>> .java:48)
>> >> [junit4] 2> at
>> org.apache.lucene.util.TestRuleIgnoreAfterMaxFailures$1.evaluate(TestRule
>> IgnoreAfterMaxFailures.java:65)
>> >> [junit4] 2> at
>> org.apache.lucene.util.TestRuleIgnoreTestSuites$1.evaluate(TestRuleIgnore
>> TestSuites.java:55)
>> >> [junit4] 2> at
>> com.carrotsearch.randomizedtesting.rules.StatementAdapter.evaluate(Stat
>> ementAdapter.java:36)
>> >> [junit4] 2> at
>> com.carrotsearch.randomizedtesting.ThreadLeakControl$StatementRunner.
>> run(ThreadLeakControl.java:365)
>> >> [junit4] 2> at java.lang.Thread.run(Thread.java:745)
>> >> [junit4] 2> NOTE: test params are: codec=Asserting(Lucene50): {},
>> docValues:{}, sim=RandomSimilarityProvider(queryNorm=true,coord=no): {},
>> locale=it, timezone=America/Cordoba
>> >> [junit4] 2> NOTE: Linux 3.13.0-52-generic amd64/Oracle Corporation
>> 1.9.0-ea (64-bit)/cpus=12,threads=2,free=245344712,total=530579456
>> >> [junit4] 2> NOTE: All tests run in this JVM: [TestCondition2,
>> TestHyphenatedWordsFilter, TestUAX29URLEmailAnalyzer,
>> TestFrenchLightStemFilter, TokenRangeSinkTokenizerTest, TestCJKAnalyzer,
>> TestOnlyInCompound, TestDutchAnalyzer, TestEmptyTokenStream,
>> Test64kAffixes, TestIndonesianStemmer, TestItalianLightStemFilterFactory,
>> TestTurkishLowerCaseFilterFactory, TestRandomChains,
>> TestBasqueAnalyzer, TestArabicNormalizationFilter,
>> TestNorwegianMinimalStemFilterFactory, TestCaseInsensitive,
>> TestGermanMinimalStemFilterFactory, TestDanishAnalyzer,
>> TestStemmerOverrideFilter, TestKStemFilterFactory, TestHunspellStemFilter,
>> TestCustomAnalyzer, TestCJKWidthFilter,
>> TestScandinavianNormalizationFilterFactory, TestArmenianAnalyzer,
>> TestHTMLStripCharFilterFactory, TestFullStrip, NGramTokenizerTest,
>> TestGermanLightStemFilter,
>> TestDictionaryCompoundWordTokenFilterFactory,
>> TestSynonymFilterFactory, CommonGramsFilterTest, TestHomonyms,
>> TestSnowballVocab]
>> >> [junit4] 2> NOTE: reproduce with: ant test -
>> Dtestcase=TestSnowballVocab -Dtests.seed=7FBAD445ED608074 -
>> Dtests.multiplier=3 -Dtests.slow=true -Dtests.locale=it -
>> Dtests.timezone=America/Cordoba -Dtests.asserts=true -
>> Dtests.file.encoding=US-ASCII
>> >> [junit4] ERROR 0.00s J2 | TestSnowballVocab (suite) <<<
>> >> [junit4] > Throwable #1: java.lang.Exception: Suite timeout exceeded
>> (>= 7200000 msec).
>> >> [junit4] > at
>> __randomizedtesting.SeedInfo.seed([7FBAD445ED608074]:0)
>> >> [junit4] Completed [261/270] on J2 in 7223.12s, 1 test, 2 errors <<<
>> FAILURES!
>> >>
>> >> [...truncated 39 lines...]
>> >> BUILD FAILED
>> >> /home/jenkins/workspace/Lucene-Solr-trunk-Linux/build.xml:526: The
>> following error occurred while executing this line:
>> >> /home/jenkins/workspace/Lucene-Solr-trunk-Linux/build.xml:474: The
>> following error occurred while executing this line:
>> >> /home/jenkins/workspace/Lucene-Solr-trunk-Linux/build.xml:61: The
>> following error occurred while executing this line:
>> >> /home/jenkins/workspace/Lucene-Solr-trunk-Linux/extra-targets.xml:39:
>> The following error occurred while executing this line:
>> >> /home/jenkins/workspace/Lucene-Solr-trunk-
>> Linux/lucene/build.xml:466: The following error occurred while executing this
>> line:
>> >> /home/jenkins/workspace/Lucene-Solr-trunk-Linux/lucene/common-
>> build.xml:2145: The following error occurred while executing this line:
>> >> /home/jenkins/workspace/Lucene-Solr-trunk-
>> Linux/lucene/analysis/build.xml:106: The following error occurred while
>> executing this line:
>> >> /home/jenkins/workspace/Lucene-Solr-trunk-
>> Linux/lucene/analysis/build.xml:38: The following error occurred while
>> executing this line:
>> >> /home/jenkins/workspace/Lucene-Solr-trunk-Linux/lucene/module-
>> build.xml:58: The following error occurred while executing this line:
>> >> /home/jenkins/workspace/Lucene-Solr-trunk-Linux/lucene/common-
>> build.xml:1415: The following error occurred while executing this line:
>> >> /home/jenkins/workspace/Lucene-Solr-trunk-Linux/lucene/common-
>> build.x
>> >> ml:973: There were test failures: 270 suites, 1376 tests, 1
>> >> suite-level error, 1 error, 40 ignored
>> >>
>> >> Total time: 129 minutes 18 seconds
>> >> Build step 'Invoke Ant' marked build as failure Archiving artifacts
>> >> Recording test results Email was triggered for: Failure - Any Sending
>> >> email for trigger: Failure - Any
>> >>
>> >>
>> >>
>> >>
>> >> ---------------------------------------------------------------------
>> >> To unsubscribe, e-mail: dev-unsubscribe@lucene.apache.org For
>> >> additional commands, e-mail: dev-help@lucene.apache.org
>> >
>> > ---------------------------------------------------------------------
>> > To unsubscribe, e-mail: dev-unsubscribe@lucene.apache.org For
>> > additional commands, e-mail: dev-help@lucene.apache.org
>> >
>>
>> ---------------------------------------------------------------------
>> To unsubscribe, e-mail: dev-unsubscribe@lucene.apache.org For additional
>> commands, e-mail: dev-help@lucene.apache.org
>
>
> ---------------------------------------------------------------------
> To unsubscribe, e-mail: dev-unsubscribe@lucene.apache.org
> For additional commands, e-mail: dev-help@lucene.apache.org
>
---------------------------------------------------------------------
To unsubscribe, e-mail: dev-unsubscribe@lucene.apache.org
For additional commands, e-mail: dev-help@lucene.apache.org
RE: [JENKINS] Lucene-Solr-trunk-Linux (64bit/jdk1.9.0-ea-b60) - Build # 12746 - Failure!
Posted by Uwe Schindler <uw...@thetaphi.de>.
This is the very latest kernel from Ubuntu 14.04:
serv1:~# uname -a
Linux serv1 3.13.0-52-generic #86-Ubuntu SMP Mon May 4 04:32:59 UTC 2015 x86_64 x86_64 x86_64 GNU/Linux
Uwe
-----
Uwe Schindler
H.-H.-Meier-Allee 63, D-28213 Bremen
http://www.thetaphi.de
eMail: uwe@thetaphi.de
> -----Original Message-----
> From: Michael McCandless [mailto:lucene@mikemccandless.com]
> Sent: Wednesday, May 20, 2015 3:35 PM
> To: Lucene/Solr dev
> Subject: Re: [JENKINS] Lucene-Solr-trunk-Linux (64bit/jdk1.9.0-ea-b60) -
> Build # 12746 - Failure!
>
> Uwe, which exact Linux kernel version and CPU is this build box? I'm
> wondering if we're maybe hitting this crazy Linux kernel bug:
> https://groups.google.com/forum/#!msg/mechanical-
> sympathy/QbmpZxp6C64/BonaHiVbEmsJ
>
> I wish the HEARTBEAT would give us more info, e.g. how much CPU is the
> JVM process using (are we hung or spinning?), and thread stack traces ... I
> know I sound like a broken record Dawid!
>
> Mike McCandless
>
> http://blog.mikemccandless.com
>
>
> On Wed, May 20, 2015 at 6:05 AM, Dawid Weiss
> <da...@cs.put.poznan.pl> wrote:
> > Does not reproduce for me.
> >
> > Dawid
> >
> > On Tue, May 19, 2015 at 11:52 PM, Policeman Jenkins Server
> > <je...@thetaphi.de> wrote:
> >> Build: http://jenkins.thetaphi.de/job/Lucene-Solr-trunk-Linux/12746/
> >> Java: 64bit/jdk1.9.0-ea-b60 -XX:-UseCompressedOops -XX:+UseG1GC
> >>
> >> 2 tests failed.
> >> FAILED:
> >> junit.framework.TestSuite.org.apache.lucene.analysis.snowball.TestSno
> >> wballVocab
> >>
> >> Error Message:
> >> Suite timeout exceeded (>= 7200000 msec).
> >>
> >> Stack Trace:
> >> java.lang.Exception: Suite timeout exceeded (>= 7200000 msec).
> >> at __randomizedtesting.SeedInfo.seed([7FBAD445ED608074]:0)
> >>
> >>
> >> FAILED:
> >> org.apache.lucene.analysis.snowball.TestSnowballVocab.testStemmers
> >>
> >> Error Message:
> >> Test abandoned because suite timeout was reached.
> >>
> >> Stack Trace:
> >> java.lang.Exception: Test abandoned because suite timeout was reached.
> >> at __randomizedtesting.SeedInfo.seed([7FBAD445ED608074]:0)
> >>
> >>
> >>
> >>
> >> Build Log:
> >> [...truncated 3199 lines...]
> >> [junit4] Suite: org.apache.lucene.analysis.snowball.TestSnowballVocab
> >> [junit4] 2> mag 19, 2015 6:51:40 PM
> com.carrotsearch.randomizedtesting.ThreadLeakControl$2 evaluate
> >> [junit4] 2> WARNING: Suite execution timed out:
> org.apache.lucene.analysis.snowball.TestSnowballVocab
> >> [junit4] 2> 1) Thread[id=13, name=JUnit4-serializer-daemon,
> state=TIMED_WAITING, group=main]
> >> [junit4] 2> at java.lang.Thread.sleep(Native Method)
> >> [junit4] 2> at
> com.carrotsearch.ant.tasks.junit4.events.Serializer$1.run(Serializer.java:47)
> >> [junit4] 2> 2) Thread[id=1, name=main, state=WAITING, group=main]
> >> [junit4] 2> at java.lang.Object.wait(Native Method)
> >> [junit4] 2> at java.lang.Thread.join(Thread.java:1249)
> >> [junit4] 2> at java.lang.Thread.join(Thread.java:1323)
> >> [junit4] 2> at
> com.carrotsearch.randomizedtesting.RandomizedRunner.runSuite(Randomi
> zedRunner.java:578)
> >> [junit4] 2> at
> com.carrotsearch.randomizedtesting.RandomizedRunner.run(RandomizedR
> unner.java:444)
> >> [junit4] 2> at
> com.carrotsearch.ant.tasks.junit4.slave.SlaveMain.execute(SlaveMain.java:1
> 99)
> >> [junit4] 2> at
> com.carrotsearch.ant.tasks.junit4.slave.SlaveMain.main(SlaveMain.java:310)
> >> [junit4] 2> at
> com.carrotsearch.ant.tasks.junit4.slave.SlaveMainSafe.main(SlaveMainSafe.j
> ava:12)
> >> [junit4] 2> 3) Thread[id=148, name=SUITE-TestSnowballVocab-
> seed#[7FBAD445ED608074], state=RUNNABLE, group=TGRP-
> TestSnowballVocab]
> >> [junit4] 2> at java.lang.Thread.getStackTrace(Thread.java:1556)
> >> [junit4] 2> at
> com.carrotsearch.randomizedtesting.ThreadLeakControl.getThreadsWithTra
> ces(ThreadLeakControl.java:690)
> >> [junit4] 2> at
> com.carrotsearch.randomizedtesting.ThreadLeakControl.formatThreadStack
> sFull(ThreadLeakControl.java:679)
> >> [junit4] 2> at
> com.carrotsearch.randomizedtesting.ThreadLeakControl.access$900(ThreadL
> eakControl.java:62)
> >> [junit4] 2> at
> com.carrotsearch.randomizedtesting.ThreadLeakControl$2.evaluate(ThreadL
> eakControl.java:412)
> >> [junit4] 2> at
> com.carrotsearch.randomizedtesting.RandomizedRunner.runSuite(Randomi
> zedRunner.java:651)
> >> [junit4] 2> at
> com.carrotsearch.randomizedtesting.RandomizedRunner.access$200(Rando
> mizedRunner.java:138)
> >> [junit4] 2> at
> com.carrotsearch.randomizedtesting.RandomizedRunner$1.run(Randomized
> Runner.java:568)
> >> [junit4] 2> 4) Thread[id=149, name=TEST-
> TestSnowballVocab.testStemmers-seed#[7FBAD445ED608074],
> state=RUNNABLE, group=TGRP-TestSnowballVocab]
> >> [junit4] 2> at
> org.tartarus.snowball.ext.FrenchStemmer.stem(FrenchStemmer.java:1379)
> >> [junit4] 2> at
> org.apache.lucene.analysis.snowball.SnowballFilter.incrementToken(Snowb
> allFilter.java:95)
> >> [junit4] 2> at
> org.apache.lucene.analysis.BaseTokenStreamTestCase.checkResetException
> (BaseTokenStreamTestCase.java:400)
> >> [junit4] 2> at
> org.apache.lucene.analysis.BaseTokenStreamTestCase.assertAnalyzesTo(Bas
> eTokenStreamTestCase.java:352)
> >> [junit4] 2> at
> org.apache.lucene.analysis.BaseTokenStreamTestCase.assertAnalyzesTo(Bas
> eTokenStreamTestCase.java:362)
> >> [junit4] 2> at
> org.apache.lucene.analysis.BaseTokenStreamTestCase.checkOneTerm(Base
> TokenStreamTestCase.java:423)
> >> [junit4] 2> at
> org.apache.lucene.analysis.VocabularyAssert.assertVocabulary(VocabularyA
> ssert.java:47)
> >> [junit4] 2> at
> org.apache.lucene.analysis.VocabularyAssert.assertVocabulary(VocabularyA
> ssert.java:73)
> >> [junit4] 2> at
> org.apache.lucene.analysis.snowball.TestSnowballVocab.assertCorrectOutpu
> t(TestSnowballVocab.java:80)
> >> [junit4] 2> at
> org.apache.lucene.analysis.snowball.TestSnowballVocab.testStemmers(Test
> SnowballVocab.java:45)
> >> [junit4] 2> at
> sun.reflect.NativeMethodAccessorImpl.invoke0(Native Method)
> >> [junit4] 2> at
> sun.reflect.NativeMethodAccessorImpl.invoke(NativeMethodAccessorImpl.j
> ava:62)
> >> [junit4] 2> at
> sun.reflect.DelegatingMethodAccessorImpl.invoke(DelegatingMethodAcces
> sorImpl.java:43)
> >> [junit4] 2> at java.lang.reflect.Method.invoke(Method.java:502)
> >> [junit4] 2> at
> com.carrotsearch.randomizedtesting.RandomizedRunner.invoke(Randomize
> dRunner.java:1627)
> >> [junit4] 2> at
> com.carrotsearch.randomizedtesting.RandomizedRunner$6.evaluate(Rando
> mizedRunner.java:836)
> >> [junit4] 2> at
> com.carrotsearch.randomizedtesting.RandomizedRunner$7.evaluate(Rando
> mizedRunner.java:872)
> >> [junit4] 2> at
> com.carrotsearch.randomizedtesting.RandomizedRunner$8.evaluate(Rando
> mizedRunner.java:886)
> >> [junit4] 2> at
> org.apache.lucene.util.TestRuleSetupTeardownChained$1.evaluate(TestRule
> SetupTeardownChained.java:50)
> >> [junit4] 2> at
> org.apache.lucene.util.AbstractBeforeAfterRule$1.evaluate(AbstractBeforeA
> fterRule.java:46)
> >> [junit4] 2> at
> org.apache.lucene.util.TestRuleThreadAndTestName$1.evaluate(TestRuleTh
> readAndTestName.java:49)
> >> [junit4] 2> at
> org.apache.lucene.util.TestRuleIgnoreAfterMaxFailures$1.evaluate(TestRule
> IgnoreAfterMaxFailures.java:65)
> >> [junit4] 2> at
> org.apache.lucene.util.TestRuleMarkFailure$1.evaluate(TestRuleMarkFailure
> .java:48)
> >> [junit4] 2> at
> com.carrotsearch.randomizedtesting.rules.StatementAdapter.evaluate(Stat
> ementAdapter.java:36)
> >> [junit4] 2> at
> com.carrotsearch.randomizedtesting.ThreadLeakControl$StatementRunner.
> run(ThreadLeakControl.java:365)
> >> [junit4] 2> at
> com.carrotsearch.randomizedtesting.ThreadLeakControl.forkTimeoutingTask
> (ThreadLeakControl.java:798)
> >> [junit4] 2> at
> com.carrotsearch.randomizedtesting.ThreadLeakControl$3.evaluate(ThreadL
> eakControl.java:458)
> >> [junit4] 2> at
> com.carrotsearch.randomizedtesting.RandomizedRunner.runSingleTest(Ran
> domizedRunner.java:845)
> >> [junit4] 2> at
> com.carrotsearch.randomizedtesting.RandomizedRunner$3.evaluate(Rando
> mizedRunner.java:747)
> >> [junit4] 2> at
> com.carrotsearch.randomizedtesting.RandomizedRunner$4.evaluate(Rando
> mizedRunner.java:781)
> >> [junit4] 2> at
> com.carrotsearch.randomizedtesting.RandomizedRunner$5.evaluate(Rando
> mizedRunner.java:792)
> >> [junit4] 2> at
> org.apache.lucene.util.AbstractBeforeAfterRule$1.evaluate(AbstractBeforeA
> fterRule.java:46)
> >> [junit4] 2> at
> com.carrotsearch.randomizedtesting.rules.StatementAdapter.evaluate(Stat
> ementAdapter.java:36)
> >> [junit4] 2> at
> org.apache.lucene.util.TestRuleStoreClassName$1.evaluate(TestRuleStoreCl
> assName.java:42)
> >> [junit4] 2> at
> com.carrotsearch.randomizedtesting.rules.NoShadowingOrOverridesOnMet
> hodsRule$1.evaluate(NoShadowingOrOverridesOnMethodsRule.java:39)
> >> [junit4] 2> at
> com.carrotsearch.randomizedtesting.rules.NoShadowingOrOverridesOnMet
> hodsRule$1.evaluate(NoShadowingOrOverridesOnMethodsRule.java:39)
> >> [junit4] 2> at
> com.carrotsearch.randomizedtesting.rules.StatementAdapter.evaluate(Stat
> ementAdapter.java:36)
> >> [junit4] 2> at
> com.carrotsearch.randomizedtesting.rules.StatementAdapter.evaluate(Stat
> ementAdapter.java:36)
> >> [junit4] 2> at
> com.carrotsearch.randomizedtesting.rules.StatementAdapter.evaluate(Stat
> ementAdapter.java:36)
> >> [junit4] 2> at
> org.apache.lucene.util.TestRuleAssertionsRequired$1.evaluate(TestRuleAss
> ertionsRequired.java:54)
> >> [junit4] 2> at
> org.apache.lucene.util.TestRuleMarkFailure$1.evaluate(TestRuleMarkFailure
> .java:48)
> >> [junit4] 2> at
> org.apache.lucene.util.TestRuleIgnoreAfterMaxFailures$1.evaluate(TestRule
> IgnoreAfterMaxFailures.java:65)
> >> [junit4] 2> at
> org.apache.lucene.util.TestRuleIgnoreTestSuites$1.evaluate(TestRuleIgnore
> TestSuites.java:55)
> >> [junit4] 2> at
> com.carrotsearch.randomizedtesting.rules.StatementAdapter.evaluate(Stat
> ementAdapter.java:36)
> >> [junit4] 2> at
> com.carrotsearch.randomizedtesting.ThreadLeakControl$StatementRunner.
> run(ThreadLeakControl.java:365)
> >> [junit4] 2> at java.lang.Thread.run(Thread.java:745)
> >> [junit4] 2> NOTE: reproduce with: ant test -
> Dtestcase=TestSnowballVocab -Dtests.method=testStemmers -
> Dtests.seed=7FBAD445ED608074 -Dtests.multiplier=3 -Dtests.slow=true -
> Dtests.locale=it -Dtests.timezone=America/Cordoba -Dtests.asserts=true -
> Dtests.file.encoding=US-ASCII
> >> [junit4] ERROR 7200s J2 | TestSnowballVocab.testStemmers <<<
> >> [junit4] > Throwable #1: java.lang.Exception: Test abandoned because
> suite timeout was reached.
> >> [junit4] > at
> __randomizedtesting.SeedInfo.seed([7FBAD445ED608074]:0)
> >> [junit4] 2> mag 19, 2015 6:51:40 PM
> com.carrotsearch.randomizedtesting.ThreadLeakControl checkThreadLeaks
> >> [junit4] 2> WARNING: Will linger awaiting termination of 1 leaked
> thread(s).
> >> [junit4] 2> mag 19, 2015 6:52:00 PM
> com.carrotsearch.randomizedtesting.ThreadLeakControl checkThreadLeaks
> >> [junit4] 2> SEVERE: 1 thread leaked from SUITE scope at
> org.apache.lucene.analysis.snowball.TestSnowballVocab:
> >> [junit4] 2> 1) Thread[id=149, name=TEST-
> TestSnowballVocab.testStemmers-seed#[7FBAD445ED608074],
> state=RUNNABLE, group=TGRP-TestSnowballVocab]
> >> [junit4] 2> at
> org.tartarus.snowball.ext.FrenchStemmer.stem(FrenchStemmer.java:1379)
> >> [junit4] 2> at
> org.apache.lucene.analysis.snowball.SnowballFilter.incrementToken(Snowb
> allFilter.java:95)
> >> [junit4] 2> at
> org.apache.lucene.analysis.BaseTokenStreamTestCase.checkResetException
> (BaseTokenStreamTestCase.java:400)
> >> [junit4] 2> at
> org.apache.lucene.analysis.BaseTokenStreamTestCase.assertAnalyzesTo(Bas
> eTokenStreamTestCase.java:352)
> >> [junit4] 2> at
> org.apache.lucene.analysis.BaseTokenStreamTestCase.assertAnalyzesTo(Bas
> eTokenStreamTestCase.java:362)
> >> [junit4] 2> at
> org.apache.lucene.analysis.BaseTokenStreamTestCase.checkOneTerm(Base
> TokenStreamTestCase.java:423)
> >> [junit4] 2> at
> org.apache.lucene.analysis.VocabularyAssert.assertVocabulary(VocabularyA
> ssert.java:47)
> >> [junit4] 2> at
> org.apache.lucene.analysis.VocabularyAssert.assertVocabulary(VocabularyA
> ssert.java:73)
> >> [junit4] 2> at
> org.apache.lucene.analysis.snowball.TestSnowballVocab.assertCorrectOutpu
> t(TestSnowballVocab.java:80)
> >> [junit4] 2> at
> org.apache.lucene.analysis.snowball.TestSnowballVocab.testStemmers(Test
> SnowballVocab.java:45)
> >> [junit4] 2> at
> sun.reflect.NativeMethodAccessorImpl.invoke0(Native Method)
> >> [junit4] 2> at
> sun.reflect.NativeMethodAccessorImpl.invoke(NativeMethodAccessorImpl.j
> ava:62)
> >> [junit4] 2> at
> sun.reflect.DelegatingMethodAccessorImpl.invoke(DelegatingMethodAcces
> sorImpl.java:43)
> >> [junit4] 2> at java.lang.reflect.Method.invoke(Method.java:502)
> >> [junit4] 2> at
> com.carrotsearch.randomizedtesting.RandomizedRunner.invoke(Randomize
> dRunner.java:1627)
> >> [junit4] 2> at
> com.carrotsearch.randomizedtesting.RandomizedRunner$6.evaluate(Rando
> mizedRunner.java:836)
> >> [junit4] 2> at
> com.carrotsearch.randomizedtesting.RandomizedRunner$7.evaluate(Rando
> mizedRunner.java:872)
> >> [junit4] 2> at
> com.carrotsearch.randomizedtesting.RandomizedRunner$8.evaluate(Rando
> mizedRunner.java:886)
> >> [junit4] 2> at
> org.apache.lucene.util.TestRuleSetupTeardownChained$1.evaluate(TestRule
> SetupTeardownChained.java:50)
> >> [junit4] 2> at
> org.apache.lucene.util.AbstractBeforeAfterRule$1.evaluate(AbstractBeforeA
> fterRule.java:46)
> >> [junit4] 2> at
> org.apache.lucene.util.TestRuleThreadAndTestName$1.evaluate(TestRuleTh
> readAndTestName.java:49)
> >> [junit4] 2> at
> org.apache.lucene.util.TestRuleIgnoreAfterMaxFailures$1.evaluate(TestRule
> IgnoreAfterMaxFailures.java:65)
> >> [junit4] 2> at
> org.apache.lucene.util.TestRuleMarkFailure$1.evaluate(TestRuleMarkFailure
> .java:48)
> >> [junit4] 2> at
> com.carrotsearch.randomizedtesting.rules.StatementAdapter.evaluate(Stat
> ementAdapter.java:36)
> >> [junit4] 2> at
> com.carrotsearch.randomizedtesting.ThreadLeakControl$StatementRunner.
> run(ThreadLeakControl.java:365)
> >> [junit4] 2> at
> com.carrotsearch.randomizedtesting.ThreadLeakControl.forkTimeoutingTask
> (ThreadLeakControl.java:798)
> >> [junit4] 2> at
> com.carrotsearch.randomizedtesting.ThreadLeakControl$3.evaluate(ThreadL
> eakControl.java:458)
> >> [junit4] 2> at
> com.carrotsearch.randomizedtesting.RandomizedRunner.runSingleTest(Ran
> domizedRunner.java:845)
> >> [junit4] 2> at
> com.carrotsearch.randomizedtesting.RandomizedRunner$3.evaluate(Rando
> mizedRunner.java:747)
> >> [junit4] 2> at
> com.carrotsearch.randomizedtesting.RandomizedRunner$4.evaluate(Rando
> mizedRunner.java:781)
> >> [junit4] 2> at
> com.carrotsearch.randomizedtesting.RandomizedRunner$5.evaluate(Rando
> mizedRunner.java:792)
> >> [junit4] 2> at
> org.apache.lucene.util.AbstractBeforeAfterRule$1.evaluate(AbstractBeforeA
> fterRule.java:46)
> >> [junit4] 2> at
> com.carrotsearch.randomizedtesting.rules.StatementAdapter.evaluate(Stat
> ementAdapter.java:36)
> >> [junit4] 2> at
> org.apache.lucene.util.TestRuleStoreClassName$1.evaluate(TestRuleStoreCl
> assName.java:42)
> >> [junit4] 2> at
> com.carrotsearch.randomizedtesting.rules.NoShadowingOrOverridesOnMet
> hodsRule$1.evaluate(NoShadowingOrOverridesOnMethodsRule.java:39)
> >> [junit4] 2> at
> com.carrotsearch.randomizedtesting.rules.NoShadowingOrOverridesOnMet
> hodsRule$1.evaluate(NoShadowingOrOverridesOnMethodsRule.java:39)
> >> [junit4] 2> at
> com.carrotsearch.randomizedtesting.rules.StatementAdapter.evaluate(Stat
> ementAdapter.java:36)
> >> [junit4] 2> at
> com.carrotsearch.randomizedtesting.rules.StatementAdapter.evaluate(Stat
> ementAdapter.java:36)
> >> [junit4] 2> at
> com.carrotsearch.randomizedtesting.rules.StatementAdapter.evaluate(Stat
> ementAdapter.java:36)
> >> [junit4] 2> at
> org.apache.lucene.util.TestRuleAssertionsRequired$1.evaluate(TestRuleAss
> ertionsRequired.java:54)
> >> [junit4] 2> at
> org.apache.lucene.util.TestRuleMarkFailure$1.evaluate(TestRuleMarkFailure
> .java:48)
> >> [junit4] 2> at
> org.apache.lucene.util.TestRuleIgnoreAfterMaxFailures$1.evaluate(TestRule
> IgnoreAfterMaxFailures.java:65)
> >> [junit4] 2> at
> org.apache.lucene.util.TestRuleIgnoreTestSuites$1.evaluate(TestRuleIgnore
> TestSuites.java:55)
> >> [junit4] 2> at
> com.carrotsearch.randomizedtesting.rules.StatementAdapter.evaluate(Stat
> ementAdapter.java:36)
> >> [junit4] 2> at
> com.carrotsearch.randomizedtesting.ThreadLeakControl$StatementRunner.
> run(ThreadLeakControl.java:365)
> >> [junit4] 2> at java.lang.Thread.run(Thread.java:745)
> >> [junit4] 2> mag 19, 2015 6:52:00 PM
> com.carrotsearch.randomizedtesting.ThreadLeakControl tryToInterruptAll
> >> [junit4] 2> INFO: Starting to interrupt leaked threads:
> >> [junit4] 2> 1) Thread[id=149, name=TEST-
> TestSnowballVocab.testStemmers-seed#[7FBAD445ED608074],
> state=RUNNABLE, group=TGRP-TestSnowballVocab]
> >> [junit4] 2> mag 19, 2015 6:52:03 PM
> com.carrotsearch.randomizedtesting.ThreadLeakControl tryToInterruptAll
> >> [junit4] 2> SEVERE: There are still zombie threads that couldn't be
> terminated:
> >> [junit4] 2> 1) Thread[id=149, name=TEST-
> TestSnowballVocab.testStemmers-seed#[7FBAD445ED608074],
> state=RUNNABLE, group=TGRP-TestSnowballVocab]
> >> [junit4] 2> at
> org.tartarus.snowball.ext.FrenchStemmer.stem(FrenchStemmer.java:1379)
> >> [junit4] 2> at
> org.apache.lucene.analysis.snowball.SnowballFilter.incrementToken(Snowb
> allFilter.java:95)
> >> [junit4] 2> at
> org.apache.lucene.analysis.BaseTokenStreamTestCase.checkResetException
> (BaseTokenStreamTestCase.java:400)
> >> [junit4] 2> at
> org.apache.lucene.analysis.BaseTokenStreamTestCase.assertAnalyzesTo(Bas
> eTokenStreamTestCase.java:352)
> >> [junit4] 2> at
> org.apache.lucene.analysis.BaseTokenStreamTestCase.assertAnalyzesTo(Bas
> eTokenStreamTestCase.java:362)
> >> [junit4] 2> at
> org.apache.lucene.analysis.BaseTokenStreamTestCase.checkOneTerm(Base
> TokenStreamTestCase.java:423)
> >> [junit4] 2> at
> org.apache.lucene.analysis.VocabularyAssert.assertVocabulary(VocabularyA
> ssert.java:47)
> >> [junit4] 2> at
> org.apache.lucene.analysis.VocabularyAssert.assertVocabulary(VocabularyA
> ssert.java:73)
> >> [junit4] 2> at
> org.apache.lucene.analysis.snowball.TestSnowballVocab.assertCorrectOutpu
> t(TestSnowballVocab.java:80)
> >> [junit4] 2> at
> org.apache.lucene.analysis.snowball.TestSnowballVocab.testStemmers(Test
> SnowballVocab.java:45)
> >> [junit4] 2> at
> sun.reflect.NativeMethodAccessorImpl.invoke0(Native Method)
> >> [junit4] 2> at
> sun.reflect.NativeMethodAccessorImpl.invoke(NativeMethodAccessorImpl.j
> ava:62)
> >> [junit4] 2> at
> sun.reflect.DelegatingMethodAccessorImpl.invoke(DelegatingMethodAcces
> sorImpl.java:43)
> >> [junit4] 2> at java.lang.reflect.Method.invoke(Method.java:502)
> >> [junit4] 2> at
> com.carrotsearch.randomizedtesting.RandomizedRunner.invoke(Randomize
> dRunner.java:1627)
> >> [junit4] 2> at
> com.carrotsearch.randomizedtesting.RandomizedRunner$6.evaluate(Rando
> mizedRunner.java:836)
> >> [junit4] 2> at
> com.carrotsearch.randomizedtesting.RandomizedRunner$7.evaluate(Rando
> mizedRunner.java:872)
> >> [junit4] 2> at
> com.carrotsearch.randomizedtesting.RandomizedRunner$8.evaluate(Rando
> mizedRunner.java:886)
> >> [junit4] 2> at
> org.apache.lucene.util.TestRuleSetupTeardownChained$1.evaluate(TestRule
> SetupTeardownChained.java:50)
> >> [junit4] 2> at
> org.apache.lucene.util.AbstractBeforeAfterRule$1.evaluate(AbstractBeforeA
> fterRule.java:46)
> >> [junit4] 2> at
> org.apache.lucene.util.TestRuleThreadAndTestName$1.evaluate(TestRuleTh
> readAndTestName.java:49)
> >> [junit4] 2> at
> org.apache.lucene.util.TestRuleIgnoreAfterMaxFailures$1.evaluate(TestRule
> IgnoreAfterMaxFailures.java:65)
> >> [junit4] 2> at
> org.apache.lucene.util.TestRuleMarkFailure$1.evaluate(TestRuleMarkFailure
> .java:48)
> >> [junit4] 2> at
> com.carrotsearch.randomizedtesting.rules.StatementAdapter.evaluate(Stat
> ementAdapter.java:36)
> >> [junit4] 2> at
> com.carrotsearch.randomizedtesting.ThreadLeakControl$StatementRunner.
> run(ThreadLeakControl.java:365)
> >> [junit4] 2> at
> com.carrotsearch.randomizedtesting.ThreadLeakControl.forkTimeoutingTask
> (ThreadLeakControl.java:798)
> >> [junit4] 2> at
> com.carrotsearch.randomizedtesting.ThreadLeakControl$3.evaluate(ThreadL
> eakControl.java:458)
> >> [junit4] 2> at
> com.carrotsearch.randomizedtesting.RandomizedRunner.runSingleTest(Ran
> domizedRunner.java:845)
> >> [junit4] 2> at
> com.carrotsearch.randomizedtesting.RandomizedRunner$3.evaluate(Rando
> mizedRunner.java:747)
> >> [junit4] 2> at
> com.carrotsearch.randomizedtesting.RandomizedRunner$4.evaluate(Rando
> mizedRunner.java:781)
> >> [junit4] 2> at
> com.carrotsearch.randomizedtesting.RandomizedRunner$5.evaluate(Rando
> mizedRunner.java:792)
> >> [junit4] 2> at
> org.apache.lucene.util.AbstractBeforeAfterRule$1.evaluate(AbstractBeforeA
> fterRule.java:46)
> >> [junit4] 2> at
> com.carrotsearch.randomizedtesting.rules.StatementAdapter.evaluate(Stat
> ementAdapter.java:36)
> >> [junit4] 2> at
> org.apache.lucene.util.TestRuleStoreClassName$1.evaluate(TestRuleStoreCl
> assName.java:42)
> >> [junit4] 2> at
> com.carrotsearch.randomizedtesting.rules.NoShadowingOrOverridesOnMet
> hodsRule$1.evaluate(NoShadowingOrOverridesOnMethodsRule.java:39)
> >> [junit4] 2> at
> com.carrotsearch.randomizedtesting.rules.NoShadowingOrOverridesOnMet
> hodsRule$1.evaluate(NoShadowingOrOverridesOnMethodsRule.java:39)
> >> [junit4] 2> at
> com.carrotsearch.randomizedtesting.rules.StatementAdapter.evaluate(Stat
> ementAdapter.java:36)
> >> [junit4] 2> at
> com.carrotsearch.randomizedtesting.rules.StatementAdapter.evaluate(Stat
> ementAdapter.java:36)
> >> [junit4] 2> at
> com.carrotsearch.randomizedtesting.rules.StatementAdapter.evaluate(Stat
> ementAdapter.java:36)
> >> [junit4] 2> at
> org.apache.lucene.util.TestRuleAssertionsRequired$1.evaluate(TestRuleAss
> ertionsRequired.java:54)
> >> [junit4] 2> at
> org.apache.lucene.util.TestRuleMarkFailure$1.evaluate(TestRuleMarkFailure
> .java:48)
> >> [junit4] 2> at
> org.apache.lucene.util.TestRuleIgnoreAfterMaxFailures$1.evaluate(TestRule
> IgnoreAfterMaxFailures.java:65)
> >> [junit4] 2> at
> org.apache.lucene.util.TestRuleIgnoreTestSuites$1.evaluate(TestRuleIgnore
> TestSuites.java:55)
> >> [junit4] 2> at
> com.carrotsearch.randomizedtesting.rules.StatementAdapter.evaluate(Stat
> ementAdapter.java:36)
> >> [junit4] 2> at
> com.carrotsearch.randomizedtesting.ThreadLeakControl$StatementRunner.
> run(ThreadLeakControl.java:365)
> >> [junit4] 2> at java.lang.Thread.run(Thread.java:745)
> >> [junit4] 2> NOTE: test params are: codec=Asserting(Lucene50): {},
> docValues:{}, sim=RandomSimilarityProvider(queryNorm=true,coord=no): {},
> locale=it, timezone=America/Cordoba
> >> [junit4] 2> NOTE: Linux 3.13.0-52-generic amd64/Oracle Corporation
> 1.9.0-ea (64-bit)/cpus=12,threads=2,free=245344712,total=530579456
> >> [junit4] 2> NOTE: All tests run in this JVM: [TestCondition2,
> TestHyphenatedWordsFilter, TestUAX29URLEmailAnalyzer,
> TestFrenchLightStemFilter, TokenRangeSinkTokenizerTest, TestCJKAnalyzer,
> TestOnlyInCompound, TestDutchAnalyzer, TestEmptyTokenStream,
> Test64kAffixes, TestIndonesianStemmer, TestItalianLightStemFilterFactory,
> TestTurkishLowerCaseFilterFactory, TestRandomChains,
> TestBasqueAnalyzer, TestArabicNormalizationFilter,
> TestNorwegianMinimalStemFilterFactory, TestCaseInsensitive,
> TestGermanMinimalStemFilterFactory, TestDanishAnalyzer,
> TestStemmerOverrideFilter, TestKStemFilterFactory, TestHunspellStemFilter,
> TestCustomAnalyzer, TestCJKWidthFilter,
> TestScandinavianNormalizationFilterFactory, TestArmenianAnalyzer,
> TestHTMLStripCharFilterFactory, TestFullStrip, NGramTokenizerTest,
> TestGermanLightStemFilter,
> TestDictionaryCompoundWordTokenFilterFactory,
> TestSynonymFilterFactory, CommonGramsFilterTest, TestHomonyms,
> TestSnowballVocab]
> >> [junit4] 2> NOTE: reproduce with: ant test -
> Dtestcase=TestSnowballVocab -Dtests.seed=7FBAD445ED608074 -
> Dtests.multiplier=3 -Dtests.slow=true -Dtests.locale=it -
> Dtests.timezone=America/Cordoba -Dtests.asserts=true -
> Dtests.file.encoding=US-ASCII
> >> [junit4] ERROR 0.00s J2 | TestSnowballVocab (suite) <<<
> >> [junit4] > Throwable #1: java.lang.Exception: Suite timeout exceeded
> (>= 7200000 msec).
> >> [junit4] > at
> __randomizedtesting.SeedInfo.seed([7FBAD445ED608074]:0)
> >> [junit4] Completed [261/270] on J2 in 7223.12s, 1 test, 2 errors <<<
> FAILURES!
> >>
> >> [...truncated 39 lines...]
> >> BUILD FAILED
> >> /home/jenkins/workspace/Lucene-Solr-trunk-Linux/build.xml:526: The
> following error occurred while executing this line:
> >> /home/jenkins/workspace/Lucene-Solr-trunk-Linux/build.xml:474: The
> following error occurred while executing this line:
> >> /home/jenkins/workspace/Lucene-Solr-trunk-Linux/build.xml:61: The
> following error occurred while executing this line:
> >> /home/jenkins/workspace/Lucene-Solr-trunk-Linux/extra-targets.xml:39:
> The following error occurred while executing this line:
> >> /home/jenkins/workspace/Lucene-Solr-trunk-
> Linux/lucene/build.xml:466: The following error occurred while executing this
> line:
> >> /home/jenkins/workspace/Lucene-Solr-trunk-Linux/lucene/common-
> build.xml:2145: The following error occurred while executing this line:
> >> /home/jenkins/workspace/Lucene-Solr-trunk-
> Linux/lucene/analysis/build.xml:106: The following error occurred while
> executing this line:
> >> /home/jenkins/workspace/Lucene-Solr-trunk-
> Linux/lucene/analysis/build.xml:38: The following error occurred while
> executing this line:
> >> /home/jenkins/workspace/Lucene-Solr-trunk-Linux/lucene/module-
> build.xml:58: The following error occurred while executing this line:
> >> /home/jenkins/workspace/Lucene-Solr-trunk-Linux/lucene/common-
> build.xml:1415: The following error occurred while executing this line:
> >> /home/jenkins/workspace/Lucene-Solr-trunk-Linux/lucene/common-
> build.x
> >> ml:973: There were test failures: 270 suites, 1376 tests, 1
> >> suite-level error, 1 error, 40 ignored
> >>
> >> Total time: 129 minutes 18 seconds
> >> Build step 'Invoke Ant' marked build as failure Archiving artifacts
> >> Recording test results Email was triggered for: Failure - Any Sending
> >> email for trigger: Failure - Any
> >>
> >>
> >>
> >>
> >> ---------------------------------------------------------------------
> >> To unsubscribe, e-mail: dev-unsubscribe@lucene.apache.org For
> >> additional commands, e-mail: dev-help@lucene.apache.org
> >
> > ---------------------------------------------------------------------
> > To unsubscribe, e-mail: dev-unsubscribe@lucene.apache.org For
> > additional commands, e-mail: dev-help@lucene.apache.org
> >
>
> ---------------------------------------------------------------------
> To unsubscribe, e-mail: dev-unsubscribe@lucene.apache.org For additional
> commands, e-mail: dev-help@lucene.apache.org
---------------------------------------------------------------------
To unsubscribe, e-mail: dev-unsubscribe@lucene.apache.org
For additional commands, e-mail: dev-help@lucene.apache.org
Re: [JENKINS] Lucene-Solr-trunk-Linux (64bit/jdk1.9.0-ea-b60) - Build
# 12746 - Failure!
Posted by Michael McCandless <lu...@mikemccandless.com>.
Uwe, which exact Linux kernel version and CPU is this build box? I'm
wondering if we're maybe hitting this crazy Linux kernel bug:
https://groups.google.com/forum/#!msg/mechanical-sympathy/QbmpZxp6C64/BonaHiVbEmsJ
I wish the HEARTBEAT would give us more info, e.g. how much CPU is the
JVM process using (are we hung or spinning?), and thread stack traces
... I know I sound like a broken record Dawid!
Mike McCandless
http://blog.mikemccandless.com
On Wed, May 20, 2015 at 6:05 AM, Dawid Weiss
<da...@cs.put.poznan.pl> wrote:
> Does not reproduce for me.
>
> Dawid
>
> On Tue, May 19, 2015 at 11:52 PM, Policeman Jenkins Server
> <je...@thetaphi.de> wrote:
>> Build: http://jenkins.thetaphi.de/job/Lucene-Solr-trunk-Linux/12746/
>> Java: 64bit/jdk1.9.0-ea-b60 -XX:-UseCompressedOops -XX:+UseG1GC
>>
>> 2 tests failed.
>> FAILED: junit.framework.TestSuite.org.apache.lucene.analysis.snowball.TestSnowballVocab
>>
>> Error Message:
>> Suite timeout exceeded (>= 7200000 msec).
>>
>> Stack Trace:
>> java.lang.Exception: Suite timeout exceeded (>= 7200000 msec).
>> at __randomizedtesting.SeedInfo.seed([7FBAD445ED608074]:0)
>>
>>
>> FAILED: org.apache.lucene.analysis.snowball.TestSnowballVocab.testStemmers
>>
>> Error Message:
>> Test abandoned because suite timeout was reached.
>>
>> Stack Trace:
>> java.lang.Exception: Test abandoned because suite timeout was reached.
>> at __randomizedtesting.SeedInfo.seed([7FBAD445ED608074]:0)
>>
>>
>>
>>
>> Build Log:
>> [...truncated 3199 lines...]
>> [junit4] Suite: org.apache.lucene.analysis.snowball.TestSnowballVocab
>> [junit4] 2> mag 19, 2015 6:51:40 PM com.carrotsearch.randomizedtesting.ThreadLeakControl$2 evaluate
>> [junit4] 2> WARNING: Suite execution timed out: org.apache.lucene.analysis.snowball.TestSnowballVocab
>> [junit4] 2> 1) Thread[id=13, name=JUnit4-serializer-daemon, state=TIMED_WAITING, group=main]
>> [junit4] 2> at java.lang.Thread.sleep(Native Method)
>> [junit4] 2> at com.carrotsearch.ant.tasks.junit4.events.Serializer$1.run(Serializer.java:47)
>> [junit4] 2> 2) Thread[id=1, name=main, state=WAITING, group=main]
>> [junit4] 2> at java.lang.Object.wait(Native Method)
>> [junit4] 2> at java.lang.Thread.join(Thread.java:1249)
>> [junit4] 2> at java.lang.Thread.join(Thread.java:1323)
>> [junit4] 2> at com.carrotsearch.randomizedtesting.RandomizedRunner.runSuite(RandomizedRunner.java:578)
>> [junit4] 2> at com.carrotsearch.randomizedtesting.RandomizedRunner.run(RandomizedRunner.java:444)
>> [junit4] 2> at com.carrotsearch.ant.tasks.junit4.slave.SlaveMain.execute(SlaveMain.java:199)
>> [junit4] 2> at com.carrotsearch.ant.tasks.junit4.slave.SlaveMain.main(SlaveMain.java:310)
>> [junit4] 2> at com.carrotsearch.ant.tasks.junit4.slave.SlaveMainSafe.main(SlaveMainSafe.java:12)
>> [junit4] 2> 3) Thread[id=148, name=SUITE-TestSnowballVocab-seed#[7FBAD445ED608074], state=RUNNABLE, group=TGRP-TestSnowballVocab]
>> [junit4] 2> at java.lang.Thread.getStackTrace(Thread.java:1556)
>> [junit4] 2> at com.carrotsearch.randomizedtesting.ThreadLeakControl.getThreadsWithTraces(ThreadLeakControl.java:690)
>> [junit4] 2> at com.carrotsearch.randomizedtesting.ThreadLeakControl.formatThreadStacksFull(ThreadLeakControl.java:679)
>> [junit4] 2> at com.carrotsearch.randomizedtesting.ThreadLeakControl.access$900(ThreadLeakControl.java:62)
>> [junit4] 2> at com.carrotsearch.randomizedtesting.ThreadLeakControl$2.evaluate(ThreadLeakControl.java:412)
>> [junit4] 2> at com.carrotsearch.randomizedtesting.RandomizedRunner.runSuite(RandomizedRunner.java:651)
>> [junit4] 2> at com.carrotsearch.randomizedtesting.RandomizedRunner.access$200(RandomizedRunner.java:138)
>> [junit4] 2> at com.carrotsearch.randomizedtesting.RandomizedRunner$1.run(RandomizedRunner.java:568)
>> [junit4] 2> 4) Thread[id=149, name=TEST-TestSnowballVocab.testStemmers-seed#[7FBAD445ED608074], state=RUNNABLE, group=TGRP-TestSnowballVocab]
>> [junit4] 2> at org.tartarus.snowball.ext.FrenchStemmer.stem(FrenchStemmer.java:1379)
>> [junit4] 2> at org.apache.lucene.analysis.snowball.SnowballFilter.incrementToken(SnowballFilter.java:95)
>> [junit4] 2> at org.apache.lucene.analysis.BaseTokenStreamTestCase.checkResetException(BaseTokenStreamTestCase.java:400)
>> [junit4] 2> at org.apache.lucene.analysis.BaseTokenStreamTestCase.assertAnalyzesTo(BaseTokenStreamTestCase.java:352)
>> [junit4] 2> at org.apache.lucene.analysis.BaseTokenStreamTestCase.assertAnalyzesTo(BaseTokenStreamTestCase.java:362)
>> [junit4] 2> at org.apache.lucene.analysis.BaseTokenStreamTestCase.checkOneTerm(BaseTokenStreamTestCase.java:423)
>> [junit4] 2> at org.apache.lucene.analysis.VocabularyAssert.assertVocabulary(VocabularyAssert.java:47)
>> [junit4] 2> at org.apache.lucene.analysis.VocabularyAssert.assertVocabulary(VocabularyAssert.java:73)
>> [junit4] 2> at org.apache.lucene.analysis.snowball.TestSnowballVocab.assertCorrectOutput(TestSnowballVocab.java:80)
>> [junit4] 2> at org.apache.lucene.analysis.snowball.TestSnowballVocab.testStemmers(TestSnowballVocab.java:45)
>> [junit4] 2> at sun.reflect.NativeMethodAccessorImpl.invoke0(Native Method)
>> [junit4] 2> at sun.reflect.NativeMethodAccessorImpl.invoke(NativeMethodAccessorImpl.java:62)
>> [junit4] 2> at sun.reflect.DelegatingMethodAccessorImpl.invoke(DelegatingMethodAccessorImpl.java:43)
>> [junit4] 2> at java.lang.reflect.Method.invoke(Method.java:502)
>> [junit4] 2> at com.carrotsearch.randomizedtesting.RandomizedRunner.invoke(RandomizedRunner.java:1627)
>> [junit4] 2> at com.carrotsearch.randomizedtesting.RandomizedRunner$6.evaluate(RandomizedRunner.java:836)
>> [junit4] 2> at com.carrotsearch.randomizedtesting.RandomizedRunner$7.evaluate(RandomizedRunner.java:872)
>> [junit4] 2> at com.carrotsearch.randomizedtesting.RandomizedRunner$8.evaluate(RandomizedRunner.java:886)
>> [junit4] 2> at org.apache.lucene.util.TestRuleSetupTeardownChained$1.evaluate(TestRuleSetupTeardownChained.java:50)
>> [junit4] 2> at org.apache.lucene.util.AbstractBeforeAfterRule$1.evaluate(AbstractBeforeAfterRule.java:46)
>> [junit4] 2> at org.apache.lucene.util.TestRuleThreadAndTestName$1.evaluate(TestRuleThreadAndTestName.java:49)
>> [junit4] 2> at org.apache.lucene.util.TestRuleIgnoreAfterMaxFailures$1.evaluate(TestRuleIgnoreAfterMaxFailures.java:65)
>> [junit4] 2> at org.apache.lucene.util.TestRuleMarkFailure$1.evaluate(TestRuleMarkFailure.java:48)
>> [junit4] 2> at com.carrotsearch.randomizedtesting.rules.StatementAdapter.evaluate(StatementAdapter.java:36)
>> [junit4] 2> at com.carrotsearch.randomizedtesting.ThreadLeakControl$StatementRunner.run(ThreadLeakControl.java:365)
>> [junit4] 2> at com.carrotsearch.randomizedtesting.ThreadLeakControl.forkTimeoutingTask(ThreadLeakControl.java:798)
>> [junit4] 2> at com.carrotsearch.randomizedtesting.ThreadLeakControl$3.evaluate(ThreadLeakControl.java:458)
>> [junit4] 2> at com.carrotsearch.randomizedtesting.RandomizedRunner.runSingleTest(RandomizedRunner.java:845)
>> [junit4] 2> at com.carrotsearch.randomizedtesting.RandomizedRunner$3.evaluate(RandomizedRunner.java:747)
>> [junit4] 2> at com.carrotsearch.randomizedtesting.RandomizedRunner$4.evaluate(RandomizedRunner.java:781)
>> [junit4] 2> at com.carrotsearch.randomizedtesting.RandomizedRunner$5.evaluate(RandomizedRunner.java:792)
>> [junit4] 2> at org.apache.lucene.util.AbstractBeforeAfterRule$1.evaluate(AbstractBeforeAfterRule.java:46)
>> [junit4] 2> at com.carrotsearch.randomizedtesting.rules.StatementAdapter.evaluate(StatementAdapter.java:36)
>> [junit4] 2> at org.apache.lucene.util.TestRuleStoreClassName$1.evaluate(TestRuleStoreClassName.java:42)
>> [junit4] 2> at com.carrotsearch.randomizedtesting.rules.NoShadowingOrOverridesOnMethodsRule$1.evaluate(NoShadowingOrOverridesOnMethodsRule.java:39)
>> [junit4] 2> at com.carrotsearch.randomizedtesting.rules.NoShadowingOrOverridesOnMethodsRule$1.evaluate(NoShadowingOrOverridesOnMethodsRule.java:39)
>> [junit4] 2> at com.carrotsearch.randomizedtesting.rules.StatementAdapter.evaluate(StatementAdapter.java:36)
>> [junit4] 2> at com.carrotsearch.randomizedtesting.rules.StatementAdapter.evaluate(StatementAdapter.java:36)
>> [junit4] 2> at com.carrotsearch.randomizedtesting.rules.StatementAdapter.evaluate(StatementAdapter.java:36)
>> [junit4] 2> at org.apache.lucene.util.TestRuleAssertionsRequired$1.evaluate(TestRuleAssertionsRequired.java:54)
>> [junit4] 2> at org.apache.lucene.util.TestRuleMarkFailure$1.evaluate(TestRuleMarkFailure.java:48)
>> [junit4] 2> at org.apache.lucene.util.TestRuleIgnoreAfterMaxFailures$1.evaluate(TestRuleIgnoreAfterMaxFailures.java:65)
>> [junit4] 2> at org.apache.lucene.util.TestRuleIgnoreTestSuites$1.evaluate(TestRuleIgnoreTestSuites.java:55)
>> [junit4] 2> at com.carrotsearch.randomizedtesting.rules.StatementAdapter.evaluate(StatementAdapter.java:36)
>> [junit4] 2> at com.carrotsearch.randomizedtesting.ThreadLeakControl$StatementRunner.run(ThreadLeakControl.java:365)
>> [junit4] 2> at java.lang.Thread.run(Thread.java:745)
>> [junit4] 2> NOTE: reproduce with: ant test -Dtestcase=TestSnowballVocab -Dtests.method=testStemmers -Dtests.seed=7FBAD445ED608074 -Dtests.multiplier=3 -Dtests.slow=true -Dtests.locale=it -Dtests.timezone=America/Cordoba -Dtests.asserts=true -Dtests.file.encoding=US-ASCII
>> [junit4] ERROR 7200s J2 | TestSnowballVocab.testStemmers <<<
>> [junit4] > Throwable #1: java.lang.Exception: Test abandoned because suite timeout was reached.
>> [junit4] > at __randomizedtesting.SeedInfo.seed([7FBAD445ED608074]:0)
>> [junit4] 2> mag 19, 2015 6:51:40 PM com.carrotsearch.randomizedtesting.ThreadLeakControl checkThreadLeaks
>> [junit4] 2> WARNING: Will linger awaiting termination of 1 leaked thread(s).
>> [junit4] 2> mag 19, 2015 6:52:00 PM com.carrotsearch.randomizedtesting.ThreadLeakControl checkThreadLeaks
>> [junit4] 2> SEVERE: 1 thread leaked from SUITE scope at org.apache.lucene.analysis.snowball.TestSnowballVocab:
>> [junit4] 2> 1) Thread[id=149, name=TEST-TestSnowballVocab.testStemmers-seed#[7FBAD445ED608074], state=RUNNABLE, group=TGRP-TestSnowballVocab]
>> [junit4] 2> at org.tartarus.snowball.ext.FrenchStemmer.stem(FrenchStemmer.java:1379)
>> [junit4] 2> at org.apache.lucene.analysis.snowball.SnowballFilter.incrementToken(SnowballFilter.java:95)
>> [junit4] 2> at org.apache.lucene.analysis.BaseTokenStreamTestCase.checkResetException(BaseTokenStreamTestCase.java:400)
>> [junit4] 2> at org.apache.lucene.analysis.BaseTokenStreamTestCase.assertAnalyzesTo(BaseTokenStreamTestCase.java:352)
>> [junit4] 2> at org.apache.lucene.analysis.BaseTokenStreamTestCase.assertAnalyzesTo(BaseTokenStreamTestCase.java:362)
>> [junit4] 2> at org.apache.lucene.analysis.BaseTokenStreamTestCase.checkOneTerm(BaseTokenStreamTestCase.java:423)
>> [junit4] 2> at org.apache.lucene.analysis.VocabularyAssert.assertVocabulary(VocabularyAssert.java:47)
>> [junit4] 2> at org.apache.lucene.analysis.VocabularyAssert.assertVocabulary(VocabularyAssert.java:73)
>> [junit4] 2> at org.apache.lucene.analysis.snowball.TestSnowballVocab.assertCorrectOutput(TestSnowballVocab.java:80)
>> [junit4] 2> at org.apache.lucene.analysis.snowball.TestSnowballVocab.testStemmers(TestSnowballVocab.java:45)
>> [junit4] 2> at sun.reflect.NativeMethodAccessorImpl.invoke0(Native Method)
>> [junit4] 2> at sun.reflect.NativeMethodAccessorImpl.invoke(NativeMethodAccessorImpl.java:62)
>> [junit4] 2> at sun.reflect.DelegatingMethodAccessorImpl.invoke(DelegatingMethodAccessorImpl.java:43)
>> [junit4] 2> at java.lang.reflect.Method.invoke(Method.java:502)
>> [junit4] 2> at com.carrotsearch.randomizedtesting.RandomizedRunner.invoke(RandomizedRunner.java:1627)
>> [junit4] 2> at com.carrotsearch.randomizedtesting.RandomizedRunner$6.evaluate(RandomizedRunner.java:836)
>> [junit4] 2> at com.carrotsearch.randomizedtesting.RandomizedRunner$7.evaluate(RandomizedRunner.java:872)
>> [junit4] 2> at com.carrotsearch.randomizedtesting.RandomizedRunner$8.evaluate(RandomizedRunner.java:886)
>> [junit4] 2> at org.apache.lucene.util.TestRuleSetupTeardownChained$1.evaluate(TestRuleSetupTeardownChained.java:50)
>> [junit4] 2> at org.apache.lucene.util.AbstractBeforeAfterRule$1.evaluate(AbstractBeforeAfterRule.java:46)
>> [junit4] 2> at org.apache.lucene.util.TestRuleThreadAndTestName$1.evaluate(TestRuleThreadAndTestName.java:49)
>> [junit4] 2> at org.apache.lucene.util.TestRuleIgnoreAfterMaxFailures$1.evaluate(TestRuleIgnoreAfterMaxFailures.java:65)
>> [junit4] 2> at org.apache.lucene.util.TestRuleMarkFailure$1.evaluate(TestRuleMarkFailure.java:48)
>> [junit4] 2> at com.carrotsearch.randomizedtesting.rules.StatementAdapter.evaluate(StatementAdapter.java:36)
>> [junit4] 2> at com.carrotsearch.randomizedtesting.ThreadLeakControl$StatementRunner.run(ThreadLeakControl.java:365)
>> [junit4] 2> at com.carrotsearch.randomizedtesting.ThreadLeakControl.forkTimeoutingTask(ThreadLeakControl.java:798)
>> [junit4] 2> at com.carrotsearch.randomizedtesting.ThreadLeakControl$3.evaluate(ThreadLeakControl.java:458)
>> [junit4] 2> at com.carrotsearch.randomizedtesting.RandomizedRunner.runSingleTest(RandomizedRunner.java:845)
>> [junit4] 2> at com.carrotsearch.randomizedtesting.RandomizedRunner$3.evaluate(RandomizedRunner.java:747)
>> [junit4] 2> at com.carrotsearch.randomizedtesting.RandomizedRunner$4.evaluate(RandomizedRunner.java:781)
>> [junit4] 2> at com.carrotsearch.randomizedtesting.RandomizedRunner$5.evaluate(RandomizedRunner.java:792)
>> [junit4] 2> at org.apache.lucene.util.AbstractBeforeAfterRule$1.evaluate(AbstractBeforeAfterRule.java:46)
>> [junit4] 2> at com.carrotsearch.randomizedtesting.rules.StatementAdapter.evaluate(StatementAdapter.java:36)
>> [junit4] 2> at org.apache.lucene.util.TestRuleStoreClassName$1.evaluate(TestRuleStoreClassName.java:42)
>> [junit4] 2> at com.carrotsearch.randomizedtesting.rules.NoShadowingOrOverridesOnMethodsRule$1.evaluate(NoShadowingOrOverridesOnMethodsRule.java:39)
>> [junit4] 2> at com.carrotsearch.randomizedtesting.rules.NoShadowingOrOverridesOnMethodsRule$1.evaluate(NoShadowingOrOverridesOnMethodsRule.java:39)
>> [junit4] 2> at com.carrotsearch.randomizedtesting.rules.StatementAdapter.evaluate(StatementAdapter.java:36)
>> [junit4] 2> at com.carrotsearch.randomizedtesting.rules.StatementAdapter.evaluate(StatementAdapter.java:36)
>> [junit4] 2> at com.carrotsearch.randomizedtesting.rules.StatementAdapter.evaluate(StatementAdapter.java:36)
>> [junit4] 2> at org.apache.lucene.util.TestRuleAssertionsRequired$1.evaluate(TestRuleAssertionsRequired.java:54)
>> [junit4] 2> at org.apache.lucene.util.TestRuleMarkFailure$1.evaluate(TestRuleMarkFailure.java:48)
>> [junit4] 2> at org.apache.lucene.util.TestRuleIgnoreAfterMaxFailures$1.evaluate(TestRuleIgnoreAfterMaxFailures.java:65)
>> [junit4] 2> at org.apache.lucene.util.TestRuleIgnoreTestSuites$1.evaluate(TestRuleIgnoreTestSuites.java:55)
>> [junit4] 2> at com.carrotsearch.randomizedtesting.rules.StatementAdapter.evaluate(StatementAdapter.java:36)
>> [junit4] 2> at com.carrotsearch.randomizedtesting.ThreadLeakControl$StatementRunner.run(ThreadLeakControl.java:365)
>> [junit4] 2> at java.lang.Thread.run(Thread.java:745)
>> [junit4] 2> mag 19, 2015 6:52:00 PM com.carrotsearch.randomizedtesting.ThreadLeakControl tryToInterruptAll
>> [junit4] 2> INFO: Starting to interrupt leaked threads:
>> [junit4] 2> 1) Thread[id=149, name=TEST-TestSnowballVocab.testStemmers-seed#[7FBAD445ED608074], state=RUNNABLE, group=TGRP-TestSnowballVocab]
>> [junit4] 2> mag 19, 2015 6:52:03 PM com.carrotsearch.randomizedtesting.ThreadLeakControl tryToInterruptAll
>> [junit4] 2> SEVERE: There are still zombie threads that couldn't be terminated:
>> [junit4] 2> 1) Thread[id=149, name=TEST-TestSnowballVocab.testStemmers-seed#[7FBAD445ED608074], state=RUNNABLE, group=TGRP-TestSnowballVocab]
>> [junit4] 2> at org.tartarus.snowball.ext.FrenchStemmer.stem(FrenchStemmer.java:1379)
>> [junit4] 2> at org.apache.lucene.analysis.snowball.SnowballFilter.incrementToken(SnowballFilter.java:95)
>> [junit4] 2> at org.apache.lucene.analysis.BaseTokenStreamTestCase.checkResetException(BaseTokenStreamTestCase.java:400)
>> [junit4] 2> at org.apache.lucene.analysis.BaseTokenStreamTestCase.assertAnalyzesTo(BaseTokenStreamTestCase.java:352)
>> [junit4] 2> at org.apache.lucene.analysis.BaseTokenStreamTestCase.assertAnalyzesTo(BaseTokenStreamTestCase.java:362)
>> [junit4] 2> at org.apache.lucene.analysis.BaseTokenStreamTestCase.checkOneTerm(BaseTokenStreamTestCase.java:423)
>> [junit4] 2> at org.apache.lucene.analysis.VocabularyAssert.assertVocabulary(VocabularyAssert.java:47)
>> [junit4] 2> at org.apache.lucene.analysis.VocabularyAssert.assertVocabulary(VocabularyAssert.java:73)
>> [junit4] 2> at org.apache.lucene.analysis.snowball.TestSnowballVocab.assertCorrectOutput(TestSnowballVocab.java:80)
>> [junit4] 2> at org.apache.lucene.analysis.snowball.TestSnowballVocab.testStemmers(TestSnowballVocab.java:45)
>> [junit4] 2> at sun.reflect.NativeMethodAccessorImpl.invoke0(Native Method)
>> [junit4] 2> at sun.reflect.NativeMethodAccessorImpl.invoke(NativeMethodAccessorImpl.java:62)
>> [junit4] 2> at sun.reflect.DelegatingMethodAccessorImpl.invoke(DelegatingMethodAccessorImpl.java:43)
>> [junit4] 2> at java.lang.reflect.Method.invoke(Method.java:502)
>> [junit4] 2> at com.carrotsearch.randomizedtesting.RandomizedRunner.invoke(RandomizedRunner.java:1627)
>> [junit4] 2> at com.carrotsearch.randomizedtesting.RandomizedRunner$6.evaluate(RandomizedRunner.java:836)
>> [junit4] 2> at com.carrotsearch.randomizedtesting.RandomizedRunner$7.evaluate(RandomizedRunner.java:872)
>> [junit4] 2> at com.carrotsearch.randomizedtesting.RandomizedRunner$8.evaluate(RandomizedRunner.java:886)
>> [junit4] 2> at org.apache.lucene.util.TestRuleSetupTeardownChained$1.evaluate(TestRuleSetupTeardownChained.java:50)
>> [junit4] 2> at org.apache.lucene.util.AbstractBeforeAfterRule$1.evaluate(AbstractBeforeAfterRule.java:46)
>> [junit4] 2> at org.apache.lucene.util.TestRuleThreadAndTestName$1.evaluate(TestRuleThreadAndTestName.java:49)
>> [junit4] 2> at org.apache.lucene.util.TestRuleIgnoreAfterMaxFailures$1.evaluate(TestRuleIgnoreAfterMaxFailures.java:65)
>> [junit4] 2> at org.apache.lucene.util.TestRuleMarkFailure$1.evaluate(TestRuleMarkFailure.java:48)
>> [junit4] 2> at com.carrotsearch.randomizedtesting.rules.StatementAdapter.evaluate(StatementAdapter.java:36)
>> [junit4] 2> at com.carrotsearch.randomizedtesting.ThreadLeakControl$StatementRunner.run(ThreadLeakControl.java:365)
>> [junit4] 2> at com.carrotsearch.randomizedtesting.ThreadLeakControl.forkTimeoutingTask(ThreadLeakControl.java:798)
>> [junit4] 2> at com.carrotsearch.randomizedtesting.ThreadLeakControl$3.evaluate(ThreadLeakControl.java:458)
>> [junit4] 2> at com.carrotsearch.randomizedtesting.RandomizedRunner.runSingleTest(RandomizedRunner.java:845)
>> [junit4] 2> at com.carrotsearch.randomizedtesting.RandomizedRunner$3.evaluate(RandomizedRunner.java:747)
>> [junit4] 2> at com.carrotsearch.randomizedtesting.RandomizedRunner$4.evaluate(RandomizedRunner.java:781)
>> [junit4] 2> at com.carrotsearch.randomizedtesting.RandomizedRunner$5.evaluate(RandomizedRunner.java:792)
>> [junit4] 2> at org.apache.lucene.util.AbstractBeforeAfterRule$1.evaluate(AbstractBeforeAfterRule.java:46)
>> [junit4] 2> at com.carrotsearch.randomizedtesting.rules.StatementAdapter.evaluate(StatementAdapter.java:36)
>> [junit4] 2> at org.apache.lucene.util.TestRuleStoreClassName$1.evaluate(TestRuleStoreClassName.java:42)
>> [junit4] 2> at com.carrotsearch.randomizedtesting.rules.NoShadowingOrOverridesOnMethodsRule$1.evaluate(NoShadowingOrOverridesOnMethodsRule.java:39)
>> [junit4] 2> at com.carrotsearch.randomizedtesting.rules.NoShadowingOrOverridesOnMethodsRule$1.evaluate(NoShadowingOrOverridesOnMethodsRule.java:39)
>> [junit4] 2> at com.carrotsearch.randomizedtesting.rules.StatementAdapter.evaluate(StatementAdapter.java:36)
>> [junit4] 2> at com.carrotsearch.randomizedtesting.rules.StatementAdapter.evaluate(StatementAdapter.java:36)
>> [junit4] 2> at com.carrotsearch.randomizedtesting.rules.StatementAdapter.evaluate(StatementAdapter.java:36)
>> [junit4] 2> at org.apache.lucene.util.TestRuleAssertionsRequired$1.evaluate(TestRuleAssertionsRequired.java:54)
>> [junit4] 2> at org.apache.lucene.util.TestRuleMarkFailure$1.evaluate(TestRuleMarkFailure.java:48)
>> [junit4] 2> at org.apache.lucene.util.TestRuleIgnoreAfterMaxFailures$1.evaluate(TestRuleIgnoreAfterMaxFailures.java:65)
>> [junit4] 2> at org.apache.lucene.util.TestRuleIgnoreTestSuites$1.evaluate(TestRuleIgnoreTestSuites.java:55)
>> [junit4] 2> at com.carrotsearch.randomizedtesting.rules.StatementAdapter.evaluate(StatementAdapter.java:36)
>> [junit4] 2> at com.carrotsearch.randomizedtesting.ThreadLeakControl$StatementRunner.run(ThreadLeakControl.java:365)
>> [junit4] 2> at java.lang.Thread.run(Thread.java:745)
>> [junit4] 2> NOTE: test params are: codec=Asserting(Lucene50): {}, docValues:{}, sim=RandomSimilarityProvider(queryNorm=true,coord=no): {}, locale=it, timezone=America/Cordoba
>> [junit4] 2> NOTE: Linux 3.13.0-52-generic amd64/Oracle Corporation 1.9.0-ea (64-bit)/cpus=12,threads=2,free=245344712,total=530579456
>> [junit4] 2> NOTE: All tests run in this JVM: [TestCondition2, TestHyphenatedWordsFilter, TestUAX29URLEmailAnalyzer, TestFrenchLightStemFilter, TokenRangeSinkTokenizerTest, TestCJKAnalyzer, TestOnlyInCompound, TestDutchAnalyzer, TestEmptyTokenStream, Test64kAffixes, TestIndonesianStemmer, TestItalianLightStemFilterFactory, TestTurkishLowerCaseFilterFactory, TestRandomChains, TestBasqueAnalyzer, TestArabicNormalizationFilter, TestNorwegianMinimalStemFilterFactory, TestCaseInsensitive, TestGermanMinimalStemFilterFactory, TestDanishAnalyzer, TestStemmerOverrideFilter, TestKStemFilterFactory, TestHunspellStemFilter, TestCustomAnalyzer, TestCJKWidthFilter, TestScandinavianNormalizationFilterFactory, TestArmenianAnalyzer, TestHTMLStripCharFilterFactory, TestFullStrip, NGramTokenizerTest, TestGermanLightStemFilter, TestDictionaryCompoundWordTokenFilterFactory, TestSynonymFilterFactory, CommonGramsFilterTest, TestHomonyms, TestSnowballVocab]
>> [junit4] 2> NOTE: reproduce with: ant test -Dtestcase=TestSnowballVocab -Dtests.seed=7FBAD445ED608074 -Dtests.multiplier=3 -Dtests.slow=true -Dtests.locale=it -Dtests.timezone=America/Cordoba -Dtests.asserts=true -Dtests.file.encoding=US-ASCII
>> [junit4] ERROR 0.00s J2 | TestSnowballVocab (suite) <<<
>> [junit4] > Throwable #1: java.lang.Exception: Suite timeout exceeded (>= 7200000 msec).
>> [junit4] > at __randomizedtesting.SeedInfo.seed([7FBAD445ED608074]:0)
>> [junit4] Completed [261/270] on J2 in 7223.12s, 1 test, 2 errors <<< FAILURES!
>>
>> [...truncated 39 lines...]
>> BUILD FAILED
>> /home/jenkins/workspace/Lucene-Solr-trunk-Linux/build.xml:526: The following error occurred while executing this line:
>> /home/jenkins/workspace/Lucene-Solr-trunk-Linux/build.xml:474: The following error occurred while executing this line:
>> /home/jenkins/workspace/Lucene-Solr-trunk-Linux/build.xml:61: The following error occurred while executing this line:
>> /home/jenkins/workspace/Lucene-Solr-trunk-Linux/extra-targets.xml:39: The following error occurred while executing this line:
>> /home/jenkins/workspace/Lucene-Solr-trunk-Linux/lucene/build.xml:466: The following error occurred while executing this line:
>> /home/jenkins/workspace/Lucene-Solr-trunk-Linux/lucene/common-build.xml:2145: The following error occurred while executing this line:
>> /home/jenkins/workspace/Lucene-Solr-trunk-Linux/lucene/analysis/build.xml:106: The following error occurred while executing this line:
>> /home/jenkins/workspace/Lucene-Solr-trunk-Linux/lucene/analysis/build.xml:38: The following error occurred while executing this line:
>> /home/jenkins/workspace/Lucene-Solr-trunk-Linux/lucene/module-build.xml:58: The following error occurred while executing this line:
>> /home/jenkins/workspace/Lucene-Solr-trunk-Linux/lucene/common-build.xml:1415: The following error occurred while executing this line:
>> /home/jenkins/workspace/Lucene-Solr-trunk-Linux/lucene/common-build.xml:973: There were test failures: 270 suites, 1376 tests, 1 suite-level error, 1 error, 40 ignored
>>
>> Total time: 129 minutes 18 seconds
>> Build step 'Invoke Ant' marked build as failure
>> Archiving artifacts
>> Recording test results
>> Email was triggered for: Failure - Any
>> Sending email for trigger: Failure - Any
>>
>>
>>
>>
>> ---------------------------------------------------------------------
>> To unsubscribe, e-mail: dev-unsubscribe@lucene.apache.org
>> For additional commands, e-mail: dev-help@lucene.apache.org
>
> ---------------------------------------------------------------------
> To unsubscribe, e-mail: dev-unsubscribe@lucene.apache.org
> For additional commands, e-mail: dev-help@lucene.apache.org
>
---------------------------------------------------------------------
To unsubscribe, e-mail: dev-unsubscribe@lucene.apache.org
For additional commands, e-mail: dev-help@lucene.apache.org
Re: [JENKINS] Lucene-Solr-trunk-Linux (64bit/jdk1.9.0-ea-b60) - Build
# 12746 - Failure!
Posted by Dawid Weiss <da...@cs.put.poznan.pl>.
Does not reproduce for me.
Dawid
On Tue, May 19, 2015 at 11:52 PM, Policeman Jenkins Server
<je...@thetaphi.de> wrote:
> Build: http://jenkins.thetaphi.de/job/Lucene-Solr-trunk-Linux/12746/
> Java: 64bit/jdk1.9.0-ea-b60 -XX:-UseCompressedOops -XX:+UseG1GC
>
> 2 tests failed.
> FAILED: junit.framework.TestSuite.org.apache.lucene.analysis.snowball.TestSnowballVocab
>
> Error Message:
> Suite timeout exceeded (>= 7200000 msec).
>
> Stack Trace:
> java.lang.Exception: Suite timeout exceeded (>= 7200000 msec).
> at __randomizedtesting.SeedInfo.seed([7FBAD445ED608074]:0)
>
>
> FAILED: org.apache.lucene.analysis.snowball.TestSnowballVocab.testStemmers
>
> Error Message:
> Test abandoned because suite timeout was reached.
>
> Stack Trace:
> java.lang.Exception: Test abandoned because suite timeout was reached.
> at __randomizedtesting.SeedInfo.seed([7FBAD445ED608074]:0)
>
>
>
>
> Build Log:
> [...truncated 3199 lines...]
> [junit4] Suite: org.apache.lucene.analysis.snowball.TestSnowballVocab
> [junit4] 2> mag 19, 2015 6:51:40 PM com.carrotsearch.randomizedtesting.ThreadLeakControl$2 evaluate
> [junit4] 2> WARNING: Suite execution timed out: org.apache.lucene.analysis.snowball.TestSnowballVocab
> [junit4] 2> 1) Thread[id=13, name=JUnit4-serializer-daemon, state=TIMED_WAITING, group=main]
> [junit4] 2> at java.lang.Thread.sleep(Native Method)
> [junit4] 2> at com.carrotsearch.ant.tasks.junit4.events.Serializer$1.run(Serializer.java:47)
> [junit4] 2> 2) Thread[id=1, name=main, state=WAITING, group=main]
> [junit4] 2> at java.lang.Object.wait(Native Method)
> [junit4] 2> at java.lang.Thread.join(Thread.java:1249)
> [junit4] 2> at java.lang.Thread.join(Thread.java:1323)
> [junit4] 2> at com.carrotsearch.randomizedtesting.RandomizedRunner.runSuite(RandomizedRunner.java:578)
> [junit4] 2> at com.carrotsearch.randomizedtesting.RandomizedRunner.run(RandomizedRunner.java:444)
> [junit4] 2> at com.carrotsearch.ant.tasks.junit4.slave.SlaveMain.execute(SlaveMain.java:199)
> [junit4] 2> at com.carrotsearch.ant.tasks.junit4.slave.SlaveMain.main(SlaveMain.java:310)
> [junit4] 2> at com.carrotsearch.ant.tasks.junit4.slave.SlaveMainSafe.main(SlaveMainSafe.java:12)
> [junit4] 2> 3) Thread[id=148, name=SUITE-TestSnowballVocab-seed#[7FBAD445ED608074], state=RUNNABLE, group=TGRP-TestSnowballVocab]
> [junit4] 2> at java.lang.Thread.getStackTrace(Thread.java:1556)
> [junit4] 2> at com.carrotsearch.randomizedtesting.ThreadLeakControl.getThreadsWithTraces(ThreadLeakControl.java:690)
> [junit4] 2> at com.carrotsearch.randomizedtesting.ThreadLeakControl.formatThreadStacksFull(ThreadLeakControl.java:679)
> [junit4] 2> at com.carrotsearch.randomizedtesting.ThreadLeakControl.access$900(ThreadLeakControl.java:62)
> [junit4] 2> at com.carrotsearch.randomizedtesting.ThreadLeakControl$2.evaluate(ThreadLeakControl.java:412)
> [junit4] 2> at com.carrotsearch.randomizedtesting.RandomizedRunner.runSuite(RandomizedRunner.java:651)
> [junit4] 2> at com.carrotsearch.randomizedtesting.RandomizedRunner.access$200(RandomizedRunner.java:138)
> [junit4] 2> at com.carrotsearch.randomizedtesting.RandomizedRunner$1.run(RandomizedRunner.java:568)
> [junit4] 2> 4) Thread[id=149, name=TEST-TestSnowballVocab.testStemmers-seed#[7FBAD445ED608074], state=RUNNABLE, group=TGRP-TestSnowballVocab]
> [junit4] 2> at org.tartarus.snowball.ext.FrenchStemmer.stem(FrenchStemmer.java:1379)
> [junit4] 2> at org.apache.lucene.analysis.snowball.SnowballFilter.incrementToken(SnowballFilter.java:95)
> [junit4] 2> at org.apache.lucene.analysis.BaseTokenStreamTestCase.checkResetException(BaseTokenStreamTestCase.java:400)
> [junit4] 2> at org.apache.lucene.analysis.BaseTokenStreamTestCase.assertAnalyzesTo(BaseTokenStreamTestCase.java:352)
> [junit4] 2> at org.apache.lucene.analysis.BaseTokenStreamTestCase.assertAnalyzesTo(BaseTokenStreamTestCase.java:362)
> [junit4] 2> at org.apache.lucene.analysis.BaseTokenStreamTestCase.checkOneTerm(BaseTokenStreamTestCase.java:423)
> [junit4] 2> at org.apache.lucene.analysis.VocabularyAssert.assertVocabulary(VocabularyAssert.java:47)
> [junit4] 2> at org.apache.lucene.analysis.VocabularyAssert.assertVocabulary(VocabularyAssert.java:73)
> [junit4] 2> at org.apache.lucene.analysis.snowball.TestSnowballVocab.assertCorrectOutput(TestSnowballVocab.java:80)
> [junit4] 2> at org.apache.lucene.analysis.snowball.TestSnowballVocab.testStemmers(TestSnowballVocab.java:45)
> [junit4] 2> at sun.reflect.NativeMethodAccessorImpl.invoke0(Native Method)
> [junit4] 2> at sun.reflect.NativeMethodAccessorImpl.invoke(NativeMethodAccessorImpl.java:62)
> [junit4] 2> at sun.reflect.DelegatingMethodAccessorImpl.invoke(DelegatingMethodAccessorImpl.java:43)
> [junit4] 2> at java.lang.reflect.Method.invoke(Method.java:502)
> [junit4] 2> at com.carrotsearch.randomizedtesting.RandomizedRunner.invoke(RandomizedRunner.java:1627)
> [junit4] 2> at com.carrotsearch.randomizedtesting.RandomizedRunner$6.evaluate(RandomizedRunner.java:836)
> [junit4] 2> at com.carrotsearch.randomizedtesting.RandomizedRunner$7.evaluate(RandomizedRunner.java:872)
> [junit4] 2> at com.carrotsearch.randomizedtesting.RandomizedRunner$8.evaluate(RandomizedRunner.java:886)
> [junit4] 2> at org.apache.lucene.util.TestRuleSetupTeardownChained$1.evaluate(TestRuleSetupTeardownChained.java:50)
> [junit4] 2> at org.apache.lucene.util.AbstractBeforeAfterRule$1.evaluate(AbstractBeforeAfterRule.java:46)
> [junit4] 2> at org.apache.lucene.util.TestRuleThreadAndTestName$1.evaluate(TestRuleThreadAndTestName.java:49)
> [junit4] 2> at org.apache.lucene.util.TestRuleIgnoreAfterMaxFailures$1.evaluate(TestRuleIgnoreAfterMaxFailures.java:65)
> [junit4] 2> at org.apache.lucene.util.TestRuleMarkFailure$1.evaluate(TestRuleMarkFailure.java:48)
> [junit4] 2> at com.carrotsearch.randomizedtesting.rules.StatementAdapter.evaluate(StatementAdapter.java:36)
> [junit4] 2> at com.carrotsearch.randomizedtesting.ThreadLeakControl$StatementRunner.run(ThreadLeakControl.java:365)
> [junit4] 2> at com.carrotsearch.randomizedtesting.ThreadLeakControl.forkTimeoutingTask(ThreadLeakControl.java:798)
> [junit4] 2> at com.carrotsearch.randomizedtesting.ThreadLeakControl$3.evaluate(ThreadLeakControl.java:458)
> [junit4] 2> at com.carrotsearch.randomizedtesting.RandomizedRunner.runSingleTest(RandomizedRunner.java:845)
> [junit4] 2> at com.carrotsearch.randomizedtesting.RandomizedRunner$3.evaluate(RandomizedRunner.java:747)
> [junit4] 2> at com.carrotsearch.randomizedtesting.RandomizedRunner$4.evaluate(RandomizedRunner.java:781)
> [junit4] 2> at com.carrotsearch.randomizedtesting.RandomizedRunner$5.evaluate(RandomizedRunner.java:792)
> [junit4] 2> at org.apache.lucene.util.AbstractBeforeAfterRule$1.evaluate(AbstractBeforeAfterRule.java:46)
> [junit4] 2> at com.carrotsearch.randomizedtesting.rules.StatementAdapter.evaluate(StatementAdapter.java:36)
> [junit4] 2> at org.apache.lucene.util.TestRuleStoreClassName$1.evaluate(TestRuleStoreClassName.java:42)
> [junit4] 2> at com.carrotsearch.randomizedtesting.rules.NoShadowingOrOverridesOnMethodsRule$1.evaluate(NoShadowingOrOverridesOnMethodsRule.java:39)
> [junit4] 2> at com.carrotsearch.randomizedtesting.rules.NoShadowingOrOverridesOnMethodsRule$1.evaluate(NoShadowingOrOverridesOnMethodsRule.java:39)
> [junit4] 2> at com.carrotsearch.randomizedtesting.rules.StatementAdapter.evaluate(StatementAdapter.java:36)
> [junit4] 2> at com.carrotsearch.randomizedtesting.rules.StatementAdapter.evaluate(StatementAdapter.java:36)
> [junit4] 2> at com.carrotsearch.randomizedtesting.rules.StatementAdapter.evaluate(StatementAdapter.java:36)
> [junit4] 2> at org.apache.lucene.util.TestRuleAssertionsRequired$1.evaluate(TestRuleAssertionsRequired.java:54)
> [junit4] 2> at org.apache.lucene.util.TestRuleMarkFailure$1.evaluate(TestRuleMarkFailure.java:48)
> [junit4] 2> at org.apache.lucene.util.TestRuleIgnoreAfterMaxFailures$1.evaluate(TestRuleIgnoreAfterMaxFailures.java:65)
> [junit4] 2> at org.apache.lucene.util.TestRuleIgnoreTestSuites$1.evaluate(TestRuleIgnoreTestSuites.java:55)
> [junit4] 2> at com.carrotsearch.randomizedtesting.rules.StatementAdapter.evaluate(StatementAdapter.java:36)
> [junit4] 2> at com.carrotsearch.randomizedtesting.ThreadLeakControl$StatementRunner.run(ThreadLeakControl.java:365)
> [junit4] 2> at java.lang.Thread.run(Thread.java:745)
> [junit4] 2> NOTE: reproduce with: ant test -Dtestcase=TestSnowballVocab -Dtests.method=testStemmers -Dtests.seed=7FBAD445ED608074 -Dtests.multiplier=3 -Dtests.slow=true -Dtests.locale=it -Dtests.timezone=America/Cordoba -Dtests.asserts=true -Dtests.file.encoding=US-ASCII
> [junit4] ERROR 7200s J2 | TestSnowballVocab.testStemmers <<<
> [junit4] > Throwable #1: java.lang.Exception: Test abandoned because suite timeout was reached.
> [junit4] > at __randomizedtesting.SeedInfo.seed([7FBAD445ED608074]:0)
> [junit4] 2> mag 19, 2015 6:51:40 PM com.carrotsearch.randomizedtesting.ThreadLeakControl checkThreadLeaks
> [junit4] 2> WARNING: Will linger awaiting termination of 1 leaked thread(s).
> [junit4] 2> mag 19, 2015 6:52:00 PM com.carrotsearch.randomizedtesting.ThreadLeakControl checkThreadLeaks
> [junit4] 2> SEVERE: 1 thread leaked from SUITE scope at org.apache.lucene.analysis.snowball.TestSnowballVocab:
> [junit4] 2> 1) Thread[id=149, name=TEST-TestSnowballVocab.testStemmers-seed#[7FBAD445ED608074], state=RUNNABLE, group=TGRP-TestSnowballVocab]
> [junit4] 2> at org.tartarus.snowball.ext.FrenchStemmer.stem(FrenchStemmer.java:1379)
> [junit4] 2> at org.apache.lucene.analysis.snowball.SnowballFilter.incrementToken(SnowballFilter.java:95)
> [junit4] 2> at org.apache.lucene.analysis.BaseTokenStreamTestCase.checkResetException(BaseTokenStreamTestCase.java:400)
> [junit4] 2> at org.apache.lucene.analysis.BaseTokenStreamTestCase.assertAnalyzesTo(BaseTokenStreamTestCase.java:352)
> [junit4] 2> at org.apache.lucene.analysis.BaseTokenStreamTestCase.assertAnalyzesTo(BaseTokenStreamTestCase.java:362)
> [junit4] 2> at org.apache.lucene.analysis.BaseTokenStreamTestCase.checkOneTerm(BaseTokenStreamTestCase.java:423)
> [junit4] 2> at org.apache.lucene.analysis.VocabularyAssert.assertVocabulary(VocabularyAssert.java:47)
> [junit4] 2> at org.apache.lucene.analysis.VocabularyAssert.assertVocabulary(VocabularyAssert.java:73)
> [junit4] 2> at org.apache.lucene.analysis.snowball.TestSnowballVocab.assertCorrectOutput(TestSnowballVocab.java:80)
> [junit4] 2> at org.apache.lucene.analysis.snowball.TestSnowballVocab.testStemmers(TestSnowballVocab.java:45)
> [junit4] 2> at sun.reflect.NativeMethodAccessorImpl.invoke0(Native Method)
> [junit4] 2> at sun.reflect.NativeMethodAccessorImpl.invoke(NativeMethodAccessorImpl.java:62)
> [junit4] 2> at sun.reflect.DelegatingMethodAccessorImpl.invoke(DelegatingMethodAccessorImpl.java:43)
> [junit4] 2> at java.lang.reflect.Method.invoke(Method.java:502)
> [junit4] 2> at com.carrotsearch.randomizedtesting.RandomizedRunner.invoke(RandomizedRunner.java:1627)
> [junit4] 2> at com.carrotsearch.randomizedtesting.RandomizedRunner$6.evaluate(RandomizedRunner.java:836)
> [junit4] 2> at com.carrotsearch.randomizedtesting.RandomizedRunner$7.evaluate(RandomizedRunner.java:872)
> [junit4] 2> at com.carrotsearch.randomizedtesting.RandomizedRunner$8.evaluate(RandomizedRunner.java:886)
> [junit4] 2> at org.apache.lucene.util.TestRuleSetupTeardownChained$1.evaluate(TestRuleSetupTeardownChained.java:50)
> [junit4] 2> at org.apache.lucene.util.AbstractBeforeAfterRule$1.evaluate(AbstractBeforeAfterRule.java:46)
> [junit4] 2> at org.apache.lucene.util.TestRuleThreadAndTestName$1.evaluate(TestRuleThreadAndTestName.java:49)
> [junit4] 2> at org.apache.lucene.util.TestRuleIgnoreAfterMaxFailures$1.evaluate(TestRuleIgnoreAfterMaxFailures.java:65)
> [junit4] 2> at org.apache.lucene.util.TestRuleMarkFailure$1.evaluate(TestRuleMarkFailure.java:48)
> [junit4] 2> at com.carrotsearch.randomizedtesting.rules.StatementAdapter.evaluate(StatementAdapter.java:36)
> [junit4] 2> at com.carrotsearch.randomizedtesting.ThreadLeakControl$StatementRunner.run(ThreadLeakControl.java:365)
> [junit4] 2> at com.carrotsearch.randomizedtesting.ThreadLeakControl.forkTimeoutingTask(ThreadLeakControl.java:798)
> [junit4] 2> at com.carrotsearch.randomizedtesting.ThreadLeakControl$3.evaluate(ThreadLeakControl.java:458)
> [junit4] 2> at com.carrotsearch.randomizedtesting.RandomizedRunner.runSingleTest(RandomizedRunner.java:845)
> [junit4] 2> at com.carrotsearch.randomizedtesting.RandomizedRunner$3.evaluate(RandomizedRunner.java:747)
> [junit4] 2> at com.carrotsearch.randomizedtesting.RandomizedRunner$4.evaluate(RandomizedRunner.java:781)
> [junit4] 2> at com.carrotsearch.randomizedtesting.RandomizedRunner$5.evaluate(RandomizedRunner.java:792)
> [junit4] 2> at org.apache.lucene.util.AbstractBeforeAfterRule$1.evaluate(AbstractBeforeAfterRule.java:46)
> [junit4] 2> at com.carrotsearch.randomizedtesting.rules.StatementAdapter.evaluate(StatementAdapter.java:36)
> [junit4] 2> at org.apache.lucene.util.TestRuleStoreClassName$1.evaluate(TestRuleStoreClassName.java:42)
> [junit4] 2> at com.carrotsearch.randomizedtesting.rules.NoShadowingOrOverridesOnMethodsRule$1.evaluate(NoShadowingOrOverridesOnMethodsRule.java:39)
> [junit4] 2> at com.carrotsearch.randomizedtesting.rules.NoShadowingOrOverridesOnMethodsRule$1.evaluate(NoShadowingOrOverridesOnMethodsRule.java:39)
> [junit4] 2> at com.carrotsearch.randomizedtesting.rules.StatementAdapter.evaluate(StatementAdapter.java:36)
> [junit4] 2> at com.carrotsearch.randomizedtesting.rules.StatementAdapter.evaluate(StatementAdapter.java:36)
> [junit4] 2> at com.carrotsearch.randomizedtesting.rules.StatementAdapter.evaluate(StatementAdapter.java:36)
> [junit4] 2> at org.apache.lucene.util.TestRuleAssertionsRequired$1.evaluate(TestRuleAssertionsRequired.java:54)
> [junit4] 2> at org.apache.lucene.util.TestRuleMarkFailure$1.evaluate(TestRuleMarkFailure.java:48)
> [junit4] 2> at org.apache.lucene.util.TestRuleIgnoreAfterMaxFailures$1.evaluate(TestRuleIgnoreAfterMaxFailures.java:65)
> [junit4] 2> at org.apache.lucene.util.TestRuleIgnoreTestSuites$1.evaluate(TestRuleIgnoreTestSuites.java:55)
> [junit4] 2> at com.carrotsearch.randomizedtesting.rules.StatementAdapter.evaluate(StatementAdapter.java:36)
> [junit4] 2> at com.carrotsearch.randomizedtesting.ThreadLeakControl$StatementRunner.run(ThreadLeakControl.java:365)
> [junit4] 2> at java.lang.Thread.run(Thread.java:745)
> [junit4] 2> mag 19, 2015 6:52:00 PM com.carrotsearch.randomizedtesting.ThreadLeakControl tryToInterruptAll
> [junit4] 2> INFO: Starting to interrupt leaked threads:
> [junit4] 2> 1) Thread[id=149, name=TEST-TestSnowballVocab.testStemmers-seed#[7FBAD445ED608074], state=RUNNABLE, group=TGRP-TestSnowballVocab]
> [junit4] 2> mag 19, 2015 6:52:03 PM com.carrotsearch.randomizedtesting.ThreadLeakControl tryToInterruptAll
> [junit4] 2> SEVERE: There are still zombie threads that couldn't be terminated:
> [junit4] 2> 1) Thread[id=149, name=TEST-TestSnowballVocab.testStemmers-seed#[7FBAD445ED608074], state=RUNNABLE, group=TGRP-TestSnowballVocab]
> [junit4] 2> at org.tartarus.snowball.ext.FrenchStemmer.stem(FrenchStemmer.java:1379)
> [junit4] 2> at org.apache.lucene.analysis.snowball.SnowballFilter.incrementToken(SnowballFilter.java:95)
> [junit4] 2> at org.apache.lucene.analysis.BaseTokenStreamTestCase.checkResetException(BaseTokenStreamTestCase.java:400)
> [junit4] 2> at org.apache.lucene.analysis.BaseTokenStreamTestCase.assertAnalyzesTo(BaseTokenStreamTestCase.java:352)
> [junit4] 2> at org.apache.lucene.analysis.BaseTokenStreamTestCase.assertAnalyzesTo(BaseTokenStreamTestCase.java:362)
> [junit4] 2> at org.apache.lucene.analysis.BaseTokenStreamTestCase.checkOneTerm(BaseTokenStreamTestCase.java:423)
> [junit4] 2> at org.apache.lucene.analysis.VocabularyAssert.assertVocabulary(VocabularyAssert.java:47)
> [junit4] 2> at org.apache.lucene.analysis.VocabularyAssert.assertVocabulary(VocabularyAssert.java:73)
> [junit4] 2> at org.apache.lucene.analysis.snowball.TestSnowballVocab.assertCorrectOutput(TestSnowballVocab.java:80)
> [junit4] 2> at org.apache.lucene.analysis.snowball.TestSnowballVocab.testStemmers(TestSnowballVocab.java:45)
> [junit4] 2> at sun.reflect.NativeMethodAccessorImpl.invoke0(Native Method)
> [junit4] 2> at sun.reflect.NativeMethodAccessorImpl.invoke(NativeMethodAccessorImpl.java:62)
> [junit4] 2> at sun.reflect.DelegatingMethodAccessorImpl.invoke(DelegatingMethodAccessorImpl.java:43)
> [junit4] 2> at java.lang.reflect.Method.invoke(Method.java:502)
> [junit4] 2> at com.carrotsearch.randomizedtesting.RandomizedRunner.invoke(RandomizedRunner.java:1627)
> [junit4] 2> at com.carrotsearch.randomizedtesting.RandomizedRunner$6.evaluate(RandomizedRunner.java:836)
> [junit4] 2> at com.carrotsearch.randomizedtesting.RandomizedRunner$7.evaluate(RandomizedRunner.java:872)
> [junit4] 2> at com.carrotsearch.randomizedtesting.RandomizedRunner$8.evaluate(RandomizedRunner.java:886)
> [junit4] 2> at org.apache.lucene.util.TestRuleSetupTeardownChained$1.evaluate(TestRuleSetupTeardownChained.java:50)
> [junit4] 2> at org.apache.lucene.util.AbstractBeforeAfterRule$1.evaluate(AbstractBeforeAfterRule.java:46)
> [junit4] 2> at org.apache.lucene.util.TestRuleThreadAndTestName$1.evaluate(TestRuleThreadAndTestName.java:49)
> [junit4] 2> at org.apache.lucene.util.TestRuleIgnoreAfterMaxFailures$1.evaluate(TestRuleIgnoreAfterMaxFailures.java:65)
> [junit4] 2> at org.apache.lucene.util.TestRuleMarkFailure$1.evaluate(TestRuleMarkFailure.java:48)
> [junit4] 2> at com.carrotsearch.randomizedtesting.rules.StatementAdapter.evaluate(StatementAdapter.java:36)
> [junit4] 2> at com.carrotsearch.randomizedtesting.ThreadLeakControl$StatementRunner.run(ThreadLeakControl.java:365)
> [junit4] 2> at com.carrotsearch.randomizedtesting.ThreadLeakControl.forkTimeoutingTask(ThreadLeakControl.java:798)
> [junit4] 2> at com.carrotsearch.randomizedtesting.ThreadLeakControl$3.evaluate(ThreadLeakControl.java:458)
> [junit4] 2> at com.carrotsearch.randomizedtesting.RandomizedRunner.runSingleTest(RandomizedRunner.java:845)
> [junit4] 2> at com.carrotsearch.randomizedtesting.RandomizedRunner$3.evaluate(RandomizedRunner.java:747)
> [junit4] 2> at com.carrotsearch.randomizedtesting.RandomizedRunner$4.evaluate(RandomizedRunner.java:781)
> [junit4] 2> at com.carrotsearch.randomizedtesting.RandomizedRunner$5.evaluate(RandomizedRunner.java:792)
> [junit4] 2> at org.apache.lucene.util.AbstractBeforeAfterRule$1.evaluate(AbstractBeforeAfterRule.java:46)
> [junit4] 2> at com.carrotsearch.randomizedtesting.rules.StatementAdapter.evaluate(StatementAdapter.java:36)
> [junit4] 2> at org.apache.lucene.util.TestRuleStoreClassName$1.evaluate(TestRuleStoreClassName.java:42)
> [junit4] 2> at com.carrotsearch.randomizedtesting.rules.NoShadowingOrOverridesOnMethodsRule$1.evaluate(NoShadowingOrOverridesOnMethodsRule.java:39)
> [junit4] 2> at com.carrotsearch.randomizedtesting.rules.NoShadowingOrOverridesOnMethodsRule$1.evaluate(NoShadowingOrOverridesOnMethodsRule.java:39)
> [junit4] 2> at com.carrotsearch.randomizedtesting.rules.StatementAdapter.evaluate(StatementAdapter.java:36)
> [junit4] 2> at com.carrotsearch.randomizedtesting.rules.StatementAdapter.evaluate(StatementAdapter.java:36)
> [junit4] 2> at com.carrotsearch.randomizedtesting.rules.StatementAdapter.evaluate(StatementAdapter.java:36)
> [junit4] 2> at org.apache.lucene.util.TestRuleAssertionsRequired$1.evaluate(TestRuleAssertionsRequired.java:54)
> [junit4] 2> at org.apache.lucene.util.TestRuleMarkFailure$1.evaluate(TestRuleMarkFailure.java:48)
> [junit4] 2> at org.apache.lucene.util.TestRuleIgnoreAfterMaxFailures$1.evaluate(TestRuleIgnoreAfterMaxFailures.java:65)
> [junit4] 2> at org.apache.lucene.util.TestRuleIgnoreTestSuites$1.evaluate(TestRuleIgnoreTestSuites.java:55)
> [junit4] 2> at com.carrotsearch.randomizedtesting.rules.StatementAdapter.evaluate(StatementAdapter.java:36)
> [junit4] 2> at com.carrotsearch.randomizedtesting.ThreadLeakControl$StatementRunner.run(ThreadLeakControl.java:365)
> [junit4] 2> at java.lang.Thread.run(Thread.java:745)
> [junit4] 2> NOTE: test params are: codec=Asserting(Lucene50): {}, docValues:{}, sim=RandomSimilarityProvider(queryNorm=true,coord=no): {}, locale=it, timezone=America/Cordoba
> [junit4] 2> NOTE: Linux 3.13.0-52-generic amd64/Oracle Corporation 1.9.0-ea (64-bit)/cpus=12,threads=2,free=245344712,total=530579456
> [junit4] 2> NOTE: All tests run in this JVM: [TestCondition2, TestHyphenatedWordsFilter, TestUAX29URLEmailAnalyzer, TestFrenchLightStemFilter, TokenRangeSinkTokenizerTest, TestCJKAnalyzer, TestOnlyInCompound, TestDutchAnalyzer, TestEmptyTokenStream, Test64kAffixes, TestIndonesianStemmer, TestItalianLightStemFilterFactory, TestTurkishLowerCaseFilterFactory, TestRandomChains, TestBasqueAnalyzer, TestArabicNormalizationFilter, TestNorwegianMinimalStemFilterFactory, TestCaseInsensitive, TestGermanMinimalStemFilterFactory, TestDanishAnalyzer, TestStemmerOverrideFilter, TestKStemFilterFactory, TestHunspellStemFilter, TestCustomAnalyzer, TestCJKWidthFilter, TestScandinavianNormalizationFilterFactory, TestArmenianAnalyzer, TestHTMLStripCharFilterFactory, TestFullStrip, NGramTokenizerTest, TestGermanLightStemFilter, TestDictionaryCompoundWordTokenFilterFactory, TestSynonymFilterFactory, CommonGramsFilterTest, TestHomonyms, TestSnowballVocab]
> [junit4] 2> NOTE: reproduce with: ant test -Dtestcase=TestSnowballVocab -Dtests.seed=7FBAD445ED608074 -Dtests.multiplier=3 -Dtests.slow=true -Dtests.locale=it -Dtests.timezone=America/Cordoba -Dtests.asserts=true -Dtests.file.encoding=US-ASCII
> [junit4] ERROR 0.00s J2 | TestSnowballVocab (suite) <<<
> [junit4] > Throwable #1: java.lang.Exception: Suite timeout exceeded (>= 7200000 msec).
> [junit4] > at __randomizedtesting.SeedInfo.seed([7FBAD445ED608074]:0)
> [junit4] Completed [261/270] on J2 in 7223.12s, 1 test, 2 errors <<< FAILURES!
>
> [...truncated 39 lines...]
> BUILD FAILED
> /home/jenkins/workspace/Lucene-Solr-trunk-Linux/build.xml:526: The following error occurred while executing this line:
> /home/jenkins/workspace/Lucene-Solr-trunk-Linux/build.xml:474: The following error occurred while executing this line:
> /home/jenkins/workspace/Lucene-Solr-trunk-Linux/build.xml:61: The following error occurred while executing this line:
> /home/jenkins/workspace/Lucene-Solr-trunk-Linux/extra-targets.xml:39: The following error occurred while executing this line:
> /home/jenkins/workspace/Lucene-Solr-trunk-Linux/lucene/build.xml:466: The following error occurred while executing this line:
> /home/jenkins/workspace/Lucene-Solr-trunk-Linux/lucene/common-build.xml:2145: The following error occurred while executing this line:
> /home/jenkins/workspace/Lucene-Solr-trunk-Linux/lucene/analysis/build.xml:106: The following error occurred while executing this line:
> /home/jenkins/workspace/Lucene-Solr-trunk-Linux/lucene/analysis/build.xml:38: The following error occurred while executing this line:
> /home/jenkins/workspace/Lucene-Solr-trunk-Linux/lucene/module-build.xml:58: The following error occurred while executing this line:
> /home/jenkins/workspace/Lucene-Solr-trunk-Linux/lucene/common-build.xml:1415: The following error occurred while executing this line:
> /home/jenkins/workspace/Lucene-Solr-trunk-Linux/lucene/common-build.xml:973: There were test failures: 270 suites, 1376 tests, 1 suite-level error, 1 error, 40 ignored
>
> Total time: 129 minutes 18 seconds
> Build step 'Invoke Ant' marked build as failure
> Archiving artifacts
> Recording test results
> Email was triggered for: Failure - Any
> Sending email for trigger: Failure - Any
>
>
>
>
> ---------------------------------------------------------------------
> To unsubscribe, e-mail: dev-unsubscribe@lucene.apache.org
> For additional commands, e-mail: dev-help@lucene.apache.org
---------------------------------------------------------------------
To unsubscribe, e-mail: dev-unsubscribe@lucene.apache.org
For additional commands, e-mail: dev-help@lucene.apache.org
[JENKINS] Lucene-Solr-trunk-Linux (32bit/jdk1.9.0-ea-b60) - Build #
12747 - Still Failing!
Posted by Policeman Jenkins Server <je...@thetaphi.de>.
Build: http://jenkins.thetaphi.de/job/Lucene-Solr-trunk-Linux/12747/
Java: 32bit/jdk1.9.0-ea-b60 -server -XX:+UseConcMarkSweepGC
1 tests failed.
FAILED: org.apache.lucene.search.payloads.TestPayloadNearQuery.testPayloadNear
Error Message:
java.util.concurrent.ExecutionException: java.util.ConcurrentModificationException
Stack Trace:
java.lang.RuntimeException: java.util.concurrent.ExecutionException: java.util.ConcurrentModificationException
at __randomizedtesting.SeedInfo.seed([AA1A271682C7152A:C55D6E8A65CCDD6F]:0)
at org.apache.lucene.search.IndexSearcher.search(IndexSearcher.java:518)
at org.apache.lucene.search.IndexSearcher.searchAfter(IndexSearcher.java:344)
at org.apache.lucene.search.IndexSearcher.search(IndexSearcher.java:355)
at org.apache.lucene.search.payloads.TestPayloadNearQuery.testPayloadNear(TestPayloadNearQuery.java:182)
at sun.reflect.NativeMethodAccessorImpl.invoke0(Native Method)
at sun.reflect.NativeMethodAccessorImpl.invoke(NativeMethodAccessorImpl.java:62)
at sun.reflect.DelegatingMethodAccessorImpl.invoke(DelegatingMethodAccessorImpl.java:43)
at java.lang.reflect.Method.invoke(Method.java:502)
at com.carrotsearch.randomizedtesting.RandomizedRunner.invoke(RandomizedRunner.java:1627)
at com.carrotsearch.randomizedtesting.RandomizedRunner$6.evaluate(RandomizedRunner.java:836)
at com.carrotsearch.randomizedtesting.RandomizedRunner$7.evaluate(RandomizedRunner.java:872)
at com.carrotsearch.randomizedtesting.RandomizedRunner$8.evaluate(RandomizedRunner.java:886)
at org.apache.lucene.util.TestRuleSetupTeardownChained$1.evaluate(TestRuleSetupTeardownChained.java:50)
at org.apache.lucene.util.AbstractBeforeAfterRule$1.evaluate(AbstractBeforeAfterRule.java:46)
at org.apache.lucene.util.TestRuleThreadAndTestName$1.evaluate(TestRuleThreadAndTestName.java:49)
at org.apache.lucene.util.TestRuleIgnoreAfterMaxFailures$1.evaluate(TestRuleIgnoreAfterMaxFailures.java:65)
at org.apache.lucene.util.TestRuleMarkFailure$1.evaluate(TestRuleMarkFailure.java:48)
at com.carrotsearch.randomizedtesting.rules.StatementAdapter.evaluate(StatementAdapter.java:36)
at com.carrotsearch.randomizedtesting.ThreadLeakControl$StatementRunner.run(ThreadLeakControl.java:365)
at com.carrotsearch.randomizedtesting.ThreadLeakControl.forkTimeoutingTask(ThreadLeakControl.java:798)
at com.carrotsearch.randomizedtesting.ThreadLeakControl$3.evaluate(ThreadLeakControl.java:458)
at com.carrotsearch.randomizedtesting.RandomizedRunner.runSingleTest(RandomizedRunner.java:845)
at com.carrotsearch.randomizedtesting.RandomizedRunner$3.evaluate(RandomizedRunner.java:747)
at com.carrotsearch.randomizedtesting.RandomizedRunner$4.evaluate(RandomizedRunner.java:781)
at com.carrotsearch.randomizedtesting.RandomizedRunner$5.evaluate(RandomizedRunner.java:792)
at org.apache.lucene.util.AbstractBeforeAfterRule$1.evaluate(AbstractBeforeAfterRule.java:46)
at com.carrotsearch.randomizedtesting.rules.StatementAdapter.evaluate(StatementAdapter.java:36)
at org.apache.lucene.util.TestRuleStoreClassName$1.evaluate(TestRuleStoreClassName.java:42)
at com.carrotsearch.randomizedtesting.rules.NoShadowingOrOverridesOnMethodsRule$1.evaluate(NoShadowingOrOverridesOnMethodsRule.java:39)
at com.carrotsearch.randomizedtesting.rules.NoShadowingOrOverridesOnMethodsRule$1.evaluate(NoShadowingOrOverridesOnMethodsRule.java:39)
at com.carrotsearch.randomizedtesting.rules.StatementAdapter.evaluate(StatementAdapter.java:36)
at com.carrotsearch.randomizedtesting.rules.StatementAdapter.evaluate(StatementAdapter.java:36)
at com.carrotsearch.randomizedtesting.rules.StatementAdapter.evaluate(StatementAdapter.java:36)
at org.apache.lucene.util.TestRuleAssertionsRequired$1.evaluate(TestRuleAssertionsRequired.java:54)
at org.apache.lucene.util.TestRuleMarkFailure$1.evaluate(TestRuleMarkFailure.java:48)
at org.apache.lucene.util.TestRuleIgnoreAfterMaxFailures$1.evaluate(TestRuleIgnoreAfterMaxFailures.java:65)
at org.apache.lucene.util.TestRuleIgnoreTestSuites$1.evaluate(TestRuleIgnoreTestSuites.java:55)
at com.carrotsearch.randomizedtesting.rules.StatementAdapter.evaluate(StatementAdapter.java:36)
at com.carrotsearch.randomizedtesting.ThreadLeakControl$StatementRunner.run(ThreadLeakControl.java:365)
at java.lang.Thread.run(Thread.java:745)
Caused by: java.util.concurrent.ExecutionException: java.util.ConcurrentModificationException
at java.util.concurrent.FutureTask.report(FutureTask.java:122)
at java.util.concurrent.FutureTask.get(FutureTask.java:192)
at org.apache.lucene.search.IndexSearcher.search(IndexSearcher.java:514)
... 39 more
Caused by: java.util.ConcurrentModificationException
at java.util.ArrayList$Itr.checkForComodification(ArrayList.java:913)
at java.util.ArrayList$Itr.next(ArrayList.java:863)
at org.apache.lucene.search.payloads.PayloadNearQuery$PayloadNearSpanScorer.processPayloads(PayloadNearQuery.java:199)
at org.apache.lucene.search.payloads.PayloadNearQuery$PayloadNearSpanScorer.setFreqCurrentDoc(PayloadNearQuery.java:223)
at org.apache.lucene.search.spans.SpanScorer.ensureFreq(SpanScorer.java:65)
at org.apache.lucene.search.spans.SpanScorer.score(SpanScorer.java:118)
at org.apache.lucene.search.AssertingScorer.score(AssertingScorer.java:67)
at org.apache.lucene.search.TopScoreDocCollector$SimpleTopScoreDocCollector$1.collect(TopScoreDocCollector.java:64)
at org.apache.lucene.search.AssertingLeafCollector.collect(AssertingLeafCollector.java:53)
at org.apache.lucene.search.AssertingCollector$1.collect(AssertingCollector.java:57)
at org.apache.lucene.search.AssertingLeafCollector.collect(AssertingLeafCollector.java:53)
at org.apache.lucene.search.Weight$DefaultBulkScorer.scoreAll(Weight.java:203)
at org.apache.lucene.search.Weight$DefaultBulkScorer.score(Weight.java:174)
at org.apache.lucene.search.BulkScorer.score(BulkScorer.java:35)
at org.apache.lucene.search.AssertingBulkScorer.score(AssertingBulkScorer.java:69)
at org.apache.lucene.search.IndexSearcher.search(IndexSearcher.java:563)
at org.apache.lucene.search.AssertingIndexSearcher.search(AssertingIndexSearcher.java:93)
at org.apache.lucene.search.IndexSearcher$4.call(IndexSearcher.java:505)
at org.apache.lucene.search.IndexSearcher$4.call(IndexSearcher.java:502)
at java.util.concurrent.FutureTask.run(FutureTask.java:265)
at java.util.concurrent.ThreadPoolExecutor.runWorker(ThreadPoolExecutor.java:1142)
at java.util.concurrent.ThreadPoolExecutor$Worker.run(ThreadPoolExecutor.java:617)
... 1 more
Build Log:
[...truncated 361 lines...]
[junit4] Suite: org.apache.lucene.search.payloads.TestPayloadNearQuery
[junit4] 2> NOTE: reproduce with: ant test -Dtestcase=TestPayloadNearQuery -Dtests.method=testPayloadNear -Dtests.seed=AA1A271682C7152A -Dtests.multiplier=3 -Dtests.slow=true -Dtests.locale=ar_JO -Dtests.timezone=America/Guayaquil -Dtests.asserts=true -Dtests.file.encoding=UTF-8
[junit4] ERROR 0.02s J0 | TestPayloadNearQuery.testPayloadNear <<<
[junit4] > Throwable #1: java.lang.RuntimeException: java.util.concurrent.ExecutionException: java.util.ConcurrentModificationException
[junit4] > at __randomizedtesting.SeedInfo.seed([AA1A271682C7152A:C55D6E8A65CCDD6F]:0)
[junit4] > at org.apache.lucene.search.IndexSearcher.search(IndexSearcher.java:518)
[junit4] > at org.apache.lucene.search.IndexSearcher.searchAfter(IndexSearcher.java:344)
[junit4] > at org.apache.lucene.search.IndexSearcher.search(IndexSearcher.java:355)
[junit4] > at org.apache.lucene.search.payloads.TestPayloadNearQuery.testPayloadNear(TestPayloadNearQuery.java:182)
[junit4] > at java.lang.Thread.run(Thread.java:745)
[junit4] > Caused by: java.util.concurrent.ExecutionException: java.util.ConcurrentModificationException
[junit4] > at java.util.concurrent.FutureTask.report(FutureTask.java:122)
[junit4] > at java.util.concurrent.FutureTask.get(FutureTask.java:192)
[junit4] > at org.apache.lucene.search.IndexSearcher.search(IndexSearcher.java:514)
[junit4] > ... 39 more
[junit4] > Caused by: java.util.ConcurrentModificationException
[junit4] > at java.util.ArrayList$Itr.checkForComodification(ArrayList.java:913)
[junit4] > at java.util.ArrayList$Itr.next(ArrayList.java:863)
[junit4] > at org.apache.lucene.search.payloads.PayloadNearQuery$PayloadNearSpanScorer.processPayloads(PayloadNearQuery.java:199)
[junit4] > at org.apache.lucene.search.payloads.PayloadNearQuery$PayloadNearSpanScorer.setFreqCurrentDoc(PayloadNearQuery.java:223)
[junit4] > at org.apache.lucene.search.spans.SpanScorer.ensureFreq(SpanScorer.java:65)
[junit4] > at org.apache.lucene.search.spans.SpanScorer.score(SpanScorer.java:118)
[junit4] > at org.apache.lucene.search.AssertingScorer.score(AssertingScorer.java:67)
[junit4] > at org.apache.lucene.search.TopScoreDocCollector$SimpleTopScoreDocCollector$1.collect(TopScoreDocCollector.java:64)
[junit4] > at org.apache.lucene.search.AssertingLeafCollector.collect(AssertingLeafCollector.java:53)
[junit4] > at org.apache.lucene.search.AssertingCollector$1.collect(AssertingCollector.java:57)
[junit4] > at org.apache.lucene.search.AssertingLeafCollector.collect(AssertingLeafCollector.java:53)
[junit4] > at org.apache.lucene.search.Weight$DefaultBulkScorer.scoreAll(Weight.java:203)
[junit4] > at org.apache.lucene.search.Weight$DefaultBulkScorer.score(Weight.java:174)
[junit4] > at org.apache.lucene.search.BulkScorer.score(BulkScorer.java:35)
[junit4] > at org.apache.lucene.search.AssertingBulkScorer.score(AssertingBulkScorer.java:69)
[junit4] > at org.apache.lucene.search.IndexSearcher.search(IndexSearcher.java:563)
[junit4] > at org.apache.lucene.search.AssertingIndexSearcher.search(AssertingIndexSearcher.java:93)
[junit4] > at org.apache.lucene.search.IndexSearcher$4.call(IndexSearcher.java:505)
[junit4] > at org.apache.lucene.search.IndexSearcher$4.call(IndexSearcher.java:502)
[junit4] > at java.util.concurrent.FutureTask.run(FutureTask.java:265)
[junit4] > at java.util.concurrent.ThreadPoolExecutor.runWorker(ThreadPoolExecutor.java:1142)
[junit4] > at java.util.concurrent.ThreadPoolExecutor$Worker.run(ThreadPoolExecutor.java:617)
[junit4] > ... 1 more
[junit4] 2> NOTE: test params are: codec=Asserting(Lucene50): {field=PostingsFormat(name=LuceneFixedGap), field2=PostingsFormat(name=Direct)}, docValues:{}, sim=RandomSimilarityProvider(queryNorm=false,coord=no): {}, locale=ar_JO, timezone=America/Guayaquil
[junit4] 2> NOTE: Linux 3.13.0-52-generic i386/Oracle Corporation 1.9.0-ea (32-bit)/cpus=12,threads=1,free=62437576,total=165679104
[junit4] 2> NOTE: All tests run in this JVM: [TestNumericTokenStream, TestPrefixCodedTerms, TestDocValuesTermsQuery, TestTimSorter, TestIndexableField, TestPackedTokenAttributeImpl, TestFilterDirectory, TestFrequencyTrackingRingBuffer, TestCheckIndex, Test2BSortedDocValues, TestSubScorerFreqs, TestShardSearching, TestMergeRateLimiter, TestQueryBuilder, TestPayloadNearQuery]
[junit4] Completed [43/391] on J0 in 0.60s, 7 tests, 1 error <<< FAILURES!
[...truncated 1146 lines...]
BUILD FAILED
/home/jenkins/workspace/Lucene-Solr-trunk-Linux/build.xml:526: The following error occurred while executing this line:
/home/jenkins/workspace/Lucene-Solr-trunk-Linux/build.xml:474: The following error occurred while executing this line:
/home/jenkins/workspace/Lucene-Solr-trunk-Linux/build.xml:61: The following error occurred while executing this line:
/home/jenkins/workspace/Lucene-Solr-trunk-Linux/extra-targets.xml:39: The following error occurred while executing this line:
/home/jenkins/workspace/Lucene-Solr-trunk-Linux/lucene/build.xml:50: The following error occurred while executing this line:
/home/jenkins/workspace/Lucene-Solr-trunk-Linux/lucene/common-build.xml:1415: The following error occurred while executing this line:
/home/jenkins/workspace/Lucene-Solr-trunk-Linux/lucene/common-build.xml:973: There were test failures: 391 suites, 3153 tests, 1 error, 54 ignored (50 assumptions)
Total time: 7 minutes 6 seconds
Build step 'Invoke Ant' marked build as failure
Archiving artifacts
Recording test results
Email was triggered for: Failure - Any
Sending email for trigger: Failure - Any