You are viewing a plain text version of this content. The canonical link for it is here.
Posted to builds@beam.apache.org by Apache Jenkins Server <je...@builds.apache.org> on 2020/05/27 01:30:20 UTC
Build failed in Jenkins: beam_PerformanceTests_WordCountIT_Py35
#1494
See <https://builds.apache.org/job/beam_PerformanceTests_WordCountIT_Py35/1494/display/redirect?page=changes>
Changes:
[zyichi] [BEAM-9603] Add timer family support to FnApiDoFnRunner
[zyichi] Address comments and add tests
[zyichi] comments
[aramaswamis] Fix typo copyLicenseScrips -> copyLicenseScripts
[aramaswamis] add io-matrix
[aramaswamis] add descriptions, links to guides
[aramaswamis] fix typo
[aramaswamis] format
[aramaswamis] update CHANGES.md
[github] [BEAM-7370] Upgrade sphinx to 3.0.3 (#11798)
[zyichi] Clear redundant debug statements in pr-11756
------------------------------------------
[...truncated 153.67 KB...]
"is_stream_like": {
"value": true
}
},
"output_name": "out",
"user_name": "write/Write/WriteImpl/FinalizeWrite/_UnpickledSideInput(PreFinalize.out.0).output"
}
],
"parallel_input": {
"@type": "OutputReference",
"output_name": "None",
"step_name": "s17"
},
"user_name": "write/Write/WriteImpl/FinalizeWrite/_UnpickledSideInput(PreFinalize.out.0)",
"windowing_strategy": "%0AB%22%40%0A%1Dref_Coder_GlobalWindowCoder_1%12%1F%0A%1D%0A%1Bbeam%3Acoder%3Aglobal_window%3Av1jQ%0A%22%0A%20beam%3Awindow_fn%3Aglobal_windows%3Av1%10%01%1A%1Dref_Coder_GlobalWindowCoder_1%22%02%3A%00%28%010%018%01H%01"
}
},
{
"kind": "ParallelDo",
"name": "s21",
"properties": {
"display_data": [
{
"key": "fn",
"label": "Transform Function",
"namespace": "apache_beam.transforms.core.CallableWrapperDoFn",
"type": "STRING",
"value": "_finalize_write"
},
{
"key": "fn",
"label": "Transform Function",
"namespace": "apache_beam.transforms.core.ParDo",
"shortValue": "CallableWrapperDoFn",
"type": "STRING",
"value": "apache_beam.transforms.core.CallableWrapperDoFn"
}
],
"non_parallel_inputs": {
"python_side_input0-write/Write/WriteImpl/FinalizeWrite": {
"@type": "OutputReference",
"output_name": "out",
"step_name": "SideInput-s18"
},
"python_side_input1-write/Write/WriteImpl/FinalizeWrite": {
"@type": "OutputReference",
"output_name": "out",
"step_name": "SideInput-s19"
},
"python_side_input2-write/Write/WriteImpl/FinalizeWrite": {
"@type": "OutputReference",
"output_name": "out",
"step_name": "SideInput-s20"
}
},
"output_info": [
{
"encoding": {
"@type": "kind:windowed_value",
"component_encodings": [
{
"@type": "FastPrimitivesCoder$eNprYE5OLEhMzkiNT0pNzNVLzk9JLSqGUlxuicUlAUWZuZklmWWpxc4gQa5CBs3GQsbaQqYIfgYGhvi0xJycpMTk7HiwlkJ8pgVkJmfnpEJNYQGawlpbyJZUnKQHACYlLgM=",
"component_encodings": [
{
"@type": "FastPrimitivesCoder$eNprYE5OLEhMzkiNT0pNzNVLzk9JLSqGUlxuicUlAUWZuZklmWWpxc4gQa5CBs3GQsbaQqYIfgYGhvi0xJycpMTk7HiwlkJ8pgVkJmfnpEJNYQGawlpbyJZUnKQHACYlLgM=",
"component_encodings": [],
"pipeline_proto_coder_id": "ref_Coder_FastPrimitivesCoder_5"
},
{
"@type": "FastPrimitivesCoder$eNprYE5OLEhMzkiNT0pNzNVLzk9JLSqGUlxuicUlAUWZuZklmWWpxc4gQa5CBs3GQsbaQqYIfgYGhvi0xJycpMTk7HiwlkJ8pgVkJmfnpEJNYQGawlpbyJZUnKQHACYlLgM=",
"component_encodings": [],
"pipeline_proto_coder_id": "ref_Coder_FastPrimitivesCoder_5"
}
],
"is_pair_like": true,
"pipeline_proto_coder_id": "ref_Coder_FastPrimitivesCoder_5"
},
{
"@type": "kind:global_window"
}
],
"is_wrapper": true
},
"output_name": "None",
"user_name": "write/Write/WriteImpl/FinalizeWrite.out"
}
],
"parallel_input": {
"@type": "OutputReference",
"output_name": "out",
"step_name": "s7"
},
"serialized_fn": "eNrNWHd8HMUV3ruT29oGYwcHhwQuBicrwt1ZxnKCQ0iwbIE5fFZWAi0hzmZvd+5mrS33ZmYli3hxiwpOICG9kN5774X03guQTkgP6ZVU82buTvI5h+L/4Gd5RzvlvTfv++Z7szqYM1yn4biU2FXihEXBnIjXYhbyohszog84QeBUAzLKnEaDsO3xYKSD1nsIMilkDSunaZpdiyDXYcSP8afqcKLbNT9yAv9aYk8wXxAdeqwVakmCZlmdN4gLiyrWEuxrsNglnMNi2mMtl3PEZIPY1I8EhyWu5wdB0ZZP3XYZcQSxIycknkgaAZpdqpbs3D2Cay5TS5apHj9qJEJZ4qAr13Ei5ruWW4tlF/PrfgQrZmCllcf3jnzgPBVD0SOYEEfEjMMpM3CqCasqlT1w2gysNmFNUt0DDzBOTIIg+4Qf6/YItsN+NKbD6Zi5tSk80LBWoSM3DhsM9+zHkQoIzrB6pP9ExLBOzaj5AbEbjqA2Tqz5++BBHT7iBtqPeHHcCRKcx+Jx3yNMHxaO8N2rZOdQuw/ORNcPTuEhhqWj4eYK5fSsjuQGseOpfh3OVvBywSA/BQ81Yb21qL0SzrF24+91vrVUEiRsFDgmxqmTAlKnQCKvIOJmQ7jgpcZkwRcFN4gTr9TMf6mv/8KN/Zs3be7v29K/uYRJSAIE7dykaq2VPqnDPAWwXQ/iqi0J6QjYoAYL5xXiWmGDESWhrSby3o39HjzMWidZI2ka4Q6Y4wd+VLcjMoEtYv3wWUUzmxIH8wFGZT7ByhFPajLBvVQm6rwUHmHQs+h6eo6FszQ4HyOTeZt3CoWyphLixtJesQMY1cdbjT4Sb5vETAzECogS2t+YQl/VWoarQz9s4bBJOZCcKTUCBwl5gXVaZy5aadhsnSvTsMFoDSWhTEDXpPQn1U5SRoIwPJHFRPiBfgmrJyGJxFDguITGgQpvC4b3SCqfjypnVHshSWHrHni0YW2R53RSUOQrR1bZ6nhtLKizXRqdf+4MG0FpsHX0VQ9c1BFHQ7FIt6+MGr47FhBvGM3tlNZ0eEwKFxt0oXyO+pEXTxBPMbyV1cdioI9L4RLDOlVmEbPKhRM27CY62xZCpz23ZWkALW1PYUdV6cWE8tUyM7iAmUuRqE7QDK1l6VK0dFkKO5XK2M2Dc/m9yW3TUYcZHcpo4YoUdildsJHYUOlYL2Hkxbndzu9Fh924dCiFxyvnoe+ymIN5dOntNxt33nXs2AFelf+sNXKLStu9ZoCtnQ4vsNNBh4sh5oe+8MfnWD2C7q5M4SqVfruGZaPquGMta6MLWBtSBGhZsdDK1Sk8AUPDAyc37TnCgWu6kWeOMttxig5PxKV7UniSYZ0iNdSVxURKpyQ82NaZ2ClXb50n7lbkJZPFbet4HzxZHbYW2iEmRIoHVjbn3vCSdpQZriuRcgL7f1brUFWiM+6TCWnM7VbHaknkShnXwTPo2dZSnC+zIUsZkCmomVA3ypmyhv9z5TUDK2c1bb+mzWa0I1ltGGhlCvxetaq9Hdg7BWMWw54SjUNS2kuiMT/i7bbAA2eclCZiNsZxa6Qkd2YPEabkJXLJiBRtezRm3kCcRGLniD00eUF/iTO3xL0xKedSAUrH5aXUhKTYmIRAhXJR4IRVz7kYwl1HMwMaRNbpUmxZHNoMTUrNm4s2VudMpahVz6AxDdArgJnAOzJWJ8JGRJEoQrmpJn4gcEuQqDTjsByF8WmYMGFfx1I/bMRM2GHsJfLCMGmtPqHSN7cA107BU0zYr8zbuNYVtg3pNFxnwgEaVroB6BJ8gYMU4UOksohUrrykPDBwWKAQZbS9WYmXp/A6ktFSfM1qvE/bj0M5zctqokc7oik0xSI5hpO8nDaW1VhZvno92rphsVjzFmlz42JJe2T+JadeajltLTaH0YaG9DhkVMpZlRyP1BwssnBYcsm6DnuGBuIgIIp7+biW56jV+Q1efsIXNB/i5S8vqIMjEcmTgMg6kW+eKuLlHZ53cEFUD4jA1RK8Yn7QZ1zkxUTcns/zJHIlhQiTa9Di+g18/fnqWYQjAp5qqDMe+FzAlCqHkhUijgMO00q4fB74LoEZdRVBfGFWHe8dYUNMzgkAXK+GAxLBUVVEVWHYwVjM4Gk0L+DpVlbZhhtUKto0u1F5lxcCeMYMPJMG6n5hd6fpTbvuzgys0rJnZBZn1mRWZ5ZmcplcFp7Vi0R9tgnPoQfoTZVKCs+tCHieCc+fgheY8EJ6MIUXGcfdE15MZaW6OYWXGHQblbXmpSm8rEoHqawWL0/hFfRyegWv0mEqJfWVKbyKjlKpi69O4TVNXeyuVK+l1WQKXmfC66fhDSm8EeN4kwlvTqrUwZEZeEv38t13UuX7rRTL8tuwLKvw357CO9rhvzOFd7XDf3cK7+kI/70pvA/Dv1qGTa+hUqPfn8IHDPr/BfmDMmzqtk5VU/8y5eGBnv2S1x9C2ftwL0Wl+8h9pXQf7VS6W3atz9JIsuFjJnwc2XCLZMMnEIVPmvCpORQ+3R2FTSeFwmckCp9to/C5FD7fRuELKXyxjcKXUvhyBwpfSeGrJ6DwtRS+fjIofKMLCl2q0DcRjm8pOL59X8Fxaycct2HhoRGNKdaS2xGU75jwXQTltgq9fwr196RQ0/uNOH9fwA8MOkWn6QydpdfTo1QJ6Q/pDfRGimL5I3rrQmJ5R3ex/LE8Hnea8BNE4g55PH6Kx+NnJvx8Cn5hwi+lWP7qeLH8teL5XSn8ps3z36bwuzbPf5/CHzp4/scU/tQSyz+n8JeFxPKvSiz/ZsLfp+HuFP6BcfzThH/NHdN/kwX/LNK8n6MtHf6D3v6bwjFD8a/pqRYxLYObOPmrPtdZBlf0HmJZbNSnKV6h5UeOHeAdAz9gOcudaPLE2//2hDnqJsl6mrYWYZOyxfikZlnjzWQgT5IwCdRMeR8ibAlOKGdU/RXMr9fxREZs6QIbaM3StzfvFCOtV7as6VaXW1B/w/G53bp3sOXYOatuXcd/nIVV/DhnbIWKIKkKthJ/K94DDbZb5Q==",
"user_name": "write/Write/WriteImpl/FinalizeWrite/FinalizeWrite"
}
}
],
"type": "JOB_TYPE_BATCH"
}
INFO:apache_beam.runners.dataflow.internal.apiclient:Create job: <Job
createTime: '2020-05-27T01:20:57.146883Z'
currentStateTime: '1970-01-01T00:00:00Z'
id: '2020-05-26_18_20_55-9993195963312768973'
location: 'us-central1'
name: 'beamapp-jenkins-0527012053-115975'
projectId: 'apache-beam-testing'
stageStates: []
startTime: '2020-05-27T01:20:57.146883Z'
steps: []
tempFiles: []
type: TypeValueValuesEnum(JOB_TYPE_BATCH, 1)>
INFO:apache_beam.runners.dataflow.internal.apiclient:Created job with id: [2020-05-26_18_20_55-9993195963312768973]
INFO:apache_beam.runners.dataflow.internal.apiclient:Submitted job: 2020-05-26_18_20_55-9993195963312768973
INFO:apache_beam.runners.dataflow.internal.apiclient:To access the Dataflow monitoring console, please navigate to https://console.cloud.google.com/dataflow/jobs/us-central1/2020-05-26_18_20_55-9993195963312768973?project=apache-beam-testing
INFO:apache_beam.runners.dataflow.dataflow_runner:Job 2020-05-26_18_20_55-9993195963312768973 is in state JOB_STATE_RUNNING
INFO:apache_beam.runners.dataflow.dataflow_runner:2020-05-27T01:21:00.203Z: JOB_MESSAGE_BASIC: Worker configuration: n1-standard-1 in us-central1-a.
INFO:apache_beam.runners.dataflow.dataflow_runner:2020-05-27T01:21:01.143Z: JOB_MESSAGE_DETAILED: Expanding CoGroupByKey operations into optimizable parts.
INFO:apache_beam.runners.dataflow.dataflow_runner:2020-05-27T01:21:01.189Z: JOB_MESSAGE_DEBUG: Combiner lifting skipped for step write/Write/WriteImpl/GroupByKey: GroupByKey not followed by a combiner.
INFO:apache_beam.runners.dataflow.dataflow_runner:2020-05-27T01:21:01.224Z: JOB_MESSAGE_DEBUG: Combiner lifting skipped for step group: GroupByKey not followed by a combiner.
INFO:apache_beam.runners.dataflow.dataflow_runner:2020-05-27T01:21:01.281Z: JOB_MESSAGE_DETAILED: Expanding GroupByKey operations into optimizable parts.
INFO:apache_beam.runners.dataflow.dataflow_runner:2020-05-27T01:21:01.312Z: JOB_MESSAGE_DETAILED: Lifting ValueCombiningMappingFns into MergeBucketsMappingFns
INFO:apache_beam.runners.dataflow.dataflow_runner:2020-05-27T01:21:01.444Z: JOB_MESSAGE_DEBUG: Annotating graph with Autotuner information.
INFO:apache_beam.runners.dataflow.dataflow_runner:2020-05-27T01:21:01.509Z: JOB_MESSAGE_DETAILED: Fusing adjacent ParDo, Read, Write, and Flatten operations
INFO:apache_beam.runners.dataflow.dataflow_runner:2020-05-27T01:21:01.545Z: JOB_MESSAGE_DETAILED: Fusing consumer split into read/Read
INFO:apache_beam.runners.dataflow.dataflow_runner:2020-05-27T01:21:01.580Z: JOB_MESSAGE_DETAILED: Fusing consumer pair_with_one into split
INFO:apache_beam.runners.dataflow.dataflow_runner:2020-05-27T01:21:01.618Z: JOB_MESSAGE_DETAILED: Fusing consumer group/Reify into pair_with_one
INFO:apache_beam.runners.dataflow.dataflow_runner:2020-05-27T01:21:01.657Z: JOB_MESSAGE_DETAILED: Fusing consumer group/Write into group/Reify
INFO:apache_beam.runners.dataflow.dataflow_runner:2020-05-27T01:21:01.703Z: JOB_MESSAGE_DETAILED: Fusing consumer group/GroupByWindow into group/Read
INFO:apache_beam.runners.dataflow.dataflow_runner:2020-05-27T01:21:01.746Z: JOB_MESSAGE_DETAILED: Fusing consumer count into group/GroupByWindow
INFO:apache_beam.runners.dataflow.dataflow_runner:2020-05-27T01:21:01.789Z: JOB_MESSAGE_DETAILED: Fusing consumer format into count
INFO:apache_beam.runners.dataflow.dataflow_runner:2020-05-27T01:21:01.821Z: JOB_MESSAGE_DETAILED: Fusing consumer write/Write/WriteImpl/WindowInto(WindowIntoFn) into format
INFO:apache_beam.runners.dataflow.dataflow_runner:2020-05-27T01:21:01.871Z: JOB_MESSAGE_DETAILED: Fusing consumer write/Write/WriteImpl/WriteBundles/WriteBundles into write/Write/WriteImpl/WindowInto(WindowIntoFn)
INFO:apache_beam.runners.dataflow.dataflow_runner:2020-05-27T01:21:01.916Z: JOB_MESSAGE_DETAILED: Fusing consumer write/Write/WriteImpl/Pair into write/Write/WriteImpl/WriteBundles/WriteBundles
INFO:apache_beam.runners.dataflow.dataflow_runner:2020-05-27T01:21:01.950Z: JOB_MESSAGE_DETAILED: Fusing consumer write/Write/WriteImpl/GroupByKey/Reify into write/Write/WriteImpl/Pair
INFO:apache_beam.runners.dataflow.dataflow_runner:2020-05-27T01:21:01.996Z: JOB_MESSAGE_DETAILED: Fusing consumer write/Write/WriteImpl/GroupByKey/Write into write/Write/WriteImpl/GroupByKey/Reify
INFO:apache_beam.runners.dataflow.dataflow_runner:2020-05-27T01:21:02.038Z: JOB_MESSAGE_DETAILED: Fusing consumer write/Write/WriteImpl/GroupByKey/GroupByWindow into write/Write/WriteImpl/GroupByKey/Read
INFO:apache_beam.runners.dataflow.dataflow_runner:2020-05-27T01:21:02.073Z: JOB_MESSAGE_DETAILED: Fusing consumer write/Write/WriteImpl/Extract into write/Write/WriteImpl/GroupByKey/GroupByWindow
INFO:apache_beam.runners.dataflow.dataflow_runner:2020-05-27T01:21:02.114Z: JOB_MESSAGE_DETAILED: Fusing consumer write/Write/WriteImpl/InitializeWrite into write/Write/WriteImpl/DoOnce/Read
INFO:apache_beam.runners.dataflow.dataflow_runner:2020-05-27T01:21:02.157Z: JOB_MESSAGE_DEBUG: Workflow config is missing a default resource spec.
INFO:apache_beam.runners.dataflow.dataflow_runner:2020-05-27T01:21:02.202Z: JOB_MESSAGE_DEBUG: Adding StepResource setup and teardown to workflow graph.
INFO:apache_beam.runners.dataflow.dataflow_runner:2020-05-27T01:21:02.242Z: JOB_MESSAGE_DEBUG: Adding workflow start and stop steps.
INFO:apache_beam.runners.dataflow.dataflow_runner:2020-05-27T01:21:02.293Z: JOB_MESSAGE_DEBUG: Assigning stage ids.
INFO:apache_beam.runners.dataflow.dataflow_runner:2020-05-27T01:21:02.595Z: JOB_MESSAGE_DEBUG: Executing wait step start26
INFO:apache_beam.runners.dataflow.dataflow_runner:2020-05-27T01:21:02.681Z: JOB_MESSAGE_BASIC: Executing operation write/Write/WriteImpl/DoOnce/Read+write/Write/WriteImpl/InitializeWrite
INFO:apache_beam.runners.dataflow.dataflow_runner:2020-05-27T01:21:02.717Z: JOB_MESSAGE_BASIC: Executing operation write/Write/WriteImpl/GroupByKey/Create
INFO:apache_beam.runners.dataflow.dataflow_runner:2020-05-27T01:21:02.730Z: JOB_MESSAGE_DEBUG: Starting worker pool setup.
INFO:apache_beam.runners.dataflow.dataflow_runner:2020-05-27T01:21:02.763Z: JOB_MESSAGE_BASIC: Executing operation group/Create
INFO:apache_beam.runners.dataflow.dataflow_runner:2020-05-27T01:21:02.775Z: JOB_MESSAGE_BASIC: Starting 10 workers in us-central1-a...
INFO:apache_beam.runners.dataflow.dataflow_runner:2020-05-27T01:21:02.846Z: JOB_MESSAGE_BASIC: Finished operation write/Write/WriteImpl/GroupByKey/Create
INFO:apache_beam.runners.dataflow.dataflow_runner:2020-05-27T01:21:02.846Z: JOB_MESSAGE_BASIC: Finished operation group/Create
INFO:apache_beam.runners.dataflow.dataflow_runner:2020-05-27T01:21:02.936Z: JOB_MESSAGE_DEBUG: Value "group/Session" materialized.
INFO:apache_beam.runners.dataflow.dataflow_runner:2020-05-27T01:21:02.978Z: JOB_MESSAGE_DEBUG: Value "write/Write/WriteImpl/GroupByKey/Session" materialized.
INFO:apache_beam.runners.dataflow.dataflow_runner:2020-05-27T01:21:03.024Z: JOB_MESSAGE_BASIC: Executing operation read/Read+split+pair_with_one+group/Reify+group/Write
INFO:apache_beam.runners.dataflow.dataflow_runner:2020-05-27T01:21:17.979Z: JOB_MESSAGE_WARNING: Your project already contains 100 Dataflow-created metric descriptors and Stackdriver will not create new Dataflow custom metrics for this job. Each unique user-defined metric name (independent of the DoFn in which it is defined) produces a new metric descriptor. To delete old / unused metric descriptors see https://developers.google.com/apis-explorer/#p/monitoring/v3/monitoring.projects.metricDescriptors.list and https://developers.google.com/apis-explorer/#p/monitoring/v3/monitoring.projects.metricDescriptors.delete
INFO:apache_beam.runners.dataflow.dataflow_runner:2020-05-27T01:21:31.691Z: JOB_MESSAGE_DETAILED: Autoscaling: Raised the number of workers to 10 based on the rate of progress in the currently running stage(s).
INFO:apache_beam.runners.dataflow.dataflow_runner:2020-05-27T01:23:07.454Z: JOB_MESSAGE_DETAILED: Workers have started successfully.
INFO:apache_beam.runners.dataflow.dataflow_runner:2020-05-27T01:23:07.488Z: JOB_MESSAGE_DETAILED: Workers have started successfully.
INFO:apache_beam.runners.dataflow.dataflow_runner:2020-05-27T01:26:09.088Z: JOB_MESSAGE_BASIC: Finished operation write/Write/WriteImpl/DoOnce/Read+write/Write/WriteImpl/InitializeWrite
INFO:apache_beam.runners.dataflow.dataflow_runner:2020-05-27T01:26:09.163Z: JOB_MESSAGE_DEBUG: Value "write/Write/WriteImpl/DoOnce/Read.out" materialized.
INFO:apache_beam.runners.dataflow.dataflow_runner:2020-05-27T01:26:09.197Z: JOB_MESSAGE_DEBUG: Value "write/Write/WriteImpl/InitializeWrite.out" materialized.
INFO:apache_beam.runners.dataflow.dataflow_runner:2020-05-27T01:26:09.271Z: JOB_MESSAGE_BASIC: Executing operation write/Write/WriteImpl/WriteBundles/_UnpickledSideInput(InitializeWrite.out.0)
INFO:apache_beam.runners.dataflow.dataflow_runner:2020-05-27T01:26:09.313Z: JOB_MESSAGE_BASIC: Executing operation write/Write/WriteImpl/FinalizeWrite/_UnpickledSideInput(InitializeWrite.out.0)
INFO:apache_beam.runners.dataflow.dataflow_runner:2020-05-27T01:26:09.320Z: JOB_MESSAGE_BASIC: Finished operation write/Write/WriteImpl/WriteBundles/_UnpickledSideInput(InitializeWrite.out.0)
INFO:apache_beam.runners.dataflow.dataflow_runner:2020-05-27T01:26:09.347Z: JOB_MESSAGE_BASIC: Executing operation write/Write/WriteImpl/PreFinalize/_UnpickledSideInput(InitializeWrite.out.0)
INFO:apache_beam.runners.dataflow.dataflow_runner:2020-05-27T01:26:09.366Z: JOB_MESSAGE_BASIC: Finished operation write/Write/WriteImpl/FinalizeWrite/_UnpickledSideInput(InitializeWrite.out.0)
INFO:apache_beam.runners.dataflow.dataflow_runner:2020-05-27T01:26:09.409Z: JOB_MESSAGE_BASIC: Finished operation write/Write/WriteImpl/PreFinalize/_UnpickledSideInput(InitializeWrite.out.0)
INFO:apache_beam.runners.dataflow.dataflow_runner:2020-05-27T01:26:09.413Z: JOB_MESSAGE_DEBUG: Value "write/Write/WriteImpl/WriteBundles/_UnpickledSideInput(InitializeWrite.out.0).output" materialized.
INFO:apache_beam.runners.dataflow.dataflow_runner:2020-05-27T01:26:09.448Z: JOB_MESSAGE_DEBUG: Value "write/Write/WriteImpl/FinalizeWrite/_UnpickledSideInput(InitializeWrite.out.0).output" materialized.
INFO:apache_beam.runners.dataflow.dataflow_runner:2020-05-27T01:26:09.486Z: JOB_MESSAGE_DEBUG: Value "write/Write/WriteImpl/PreFinalize/_UnpickledSideInput(InitializeWrite.out.0).output" materialized.
INFO:apache_beam.runners.dataflow.dataflow_runner:2020-05-27T01:28:13.465Z: JOB_MESSAGE_BASIC: Finished operation read/Read+split+pair_with_one+group/Reify+group/Write
INFO:apache_beam.runners.dataflow.dataflow_runner:2020-05-27T01:28:13.547Z: JOB_MESSAGE_BASIC: Executing operation group/Close
INFO:apache_beam.runners.dataflow.dataflow_runner:2020-05-27T01:28:13.606Z: JOB_MESSAGE_BASIC: Finished operation group/Close
INFO:apache_beam.runners.dataflow.dataflow_runner:2020-05-27T01:28:13.699Z: JOB_MESSAGE_BASIC: Executing operation group/Read+group/GroupByWindow+count+format+write/Write/WriteImpl/WindowInto(WindowIntoFn)+write/Write/WriteImpl/WriteBundles/WriteBundles+write/Write/WriteImpl/Pair+write/Write/WriteImpl/GroupByKey/Reify+write/Write/WriteImpl/GroupByKey/Write
Terminated
The message received from the daemon indicates that the daemon has disappeared.
Build request sent: Build{id=5c3ccdb0-71a5-41ea-b7c3-a013254a92e2, currentDir=<https://builds.apache.org/job/beam_PerformanceTests_WordCountIT_Py35/ws/src}>
Attempting to read last messages from the daemon log...
Daemon pid: 11819
log file: /home/jenkins/.gradle/daemon/5.2.1/daemon-11819.out.log
----- Last 20 lines from daemon log file - daemon-11819.out.log -----
INFO:apache_beam.runners.dataflow.dataflow_runner:2020-05-27T01:23:07.454Z: JOB_MESSAGE_DETAILED: Workers have started successfully.
INFO:apache_beam.runners.dataflow.dataflow_runner:2020-05-27T01:23:07.488Z: JOB_MESSAGE_DETAILED: Workers have started successfully.
INFO:apache_beam.runners.dataflow.dataflow_runner:2020-05-27T01:26:09.088Z: JOB_MESSAGE_BASIC: Finished operation write/Write/WriteImpl/DoOnce/Read+write/Write/WriteImpl/InitializeWrite
INFO:apache_beam.runners.dataflow.dataflow_runner:2020-05-27T01:26:09.163Z: JOB_MESSAGE_DEBUG: Value "write/Write/WriteImpl/DoOnce/Read.out" materialized.
INFO:apache_beam.runners.dataflow.dataflow_runner:2020-05-27T01:26:09.197Z: JOB_MESSAGE_DEBUG: Value "write/Write/WriteImpl/InitializeWrite.out" materialized.
INFO:apache_beam.runners.dataflow.dataflow_runner:2020-05-27T01:26:09.271Z: JOB_MESSAGE_BASIC: Executing operation write/Write/WriteImpl/WriteBundles/_UnpickledSideInput(InitializeWrite.out.0)
INFO:apache_beam.runners.dataflow.dataflow_runner:2020-05-27T01:26:09.313Z: JOB_MESSAGE_BASIC: Executing operation write/Write/WriteImpl/FinalizeWrite/_UnpickledSideInput(InitializeWrite.out.0)
INFO:apache_beam.runners.dataflow.dataflow_runner:2020-05-27T01:26:09.320Z: JOB_MESSAGE_BASIC: Finished operation write/Write/WriteImpl/WriteBundles/_UnpickledSideInput(InitializeWrite.out.0)
INFO:apache_beam.runners.dataflow.dataflow_runner:2020-05-27T01:26:09.347Z: JOB_MESSAGE_BASIC: Executing operation write/Write/WriteImpl/PreFinalize/_UnpickledSideInput(InitializeWrite.out.0)
INFO:apache_beam.runners.dataflow.dataflow_runner:2020-05-27T01:26:09.366Z: JOB_MESSAGE_BASIC: Finished operation write/Write/WriteImpl/FinalizeWrite/_UnpickledSideInput(InitializeWrite.out.0)
INFO:apache_beam.runners.dataflow.dataflow_runner:2020-05-27T01:26:09.409Z: JOB_MESSAGE_BASIC: Finished operation write/Write/WriteImpl/PreFinalize/_UnpickledSideInput(InitializeWrite.out.0)
INFO:apache_beam.runners.dataflow.dataflow_runner:2020-05-27T01:26:09.413Z: JOB_MESSAGE_DEBUG: Value "write/Write/WriteImpl/WriteBundles/_UnpickledSideInput(InitializeWrite.out.0).output" materialized.
INFO:apache_beam.runners.dataflow.dataflow_runner:2020-05-27T01:26:09.448Z: JOB_MESSAGE_DEBUG: Value "write/Write/WriteImpl/FinalizeWrite/_UnpickledSideInput(InitializeWrite.out.0).output" materialized.
INFO:apache_beam.runners.dataflow.dataflow_runner:2020-05-27T01:26:09.486Z: JOB_MESSAGE_DEBUG: Value "write/Write/WriteImpl/PreFinalize/_UnpickledSideInput(InitializeWrite.out.0).output" materialized.
INFO:apache_beam.runners.dataflow.dataflow_runner:2020-05-27T01:28:13.465Z: JOB_MESSAGE_BASIC: Finished operation read/Read+split+pair_with_one+group/Reify+group/Write
INFO:apache_beam.runners.dataflow.dataflow_runner:2020-05-27T01:28:13.547Z: JOB_MESSAGE_BASIC: Executing operation group/Close
INFO:apache_beam.runners.dataflow.dataflow_runner:2020-05-27T01:28:13.606Z: JOB_MESSAGE_BASIC: Finished operation group/Close
INFO:apache_beam.runners.dataflow.dataflow_runner:2020-05-27T01:28:13.699Z: JOB_MESSAGE_BASIC: Executing operation group/Read+group/GroupByWindow+count+format+write/Write/WriteImpl/WindowInto(WindowIntoFn)+write/Write/WriteImpl/WriteBundles/WriteBundles+write/Write/WriteImpl/Pair+write/Write/WriteImpl/GroupByKey/Reify+write/Write/WriteImpl/GroupByKey/Write
Terminated
Daemon vm is shutting down... The daemon has exited normally or was terminated in response to a user interrupt.
----- End of the daemon log -----
FAILURE: Build failed with an exception.
* What went wrong:
Gradle build daemon disappeared unexpectedly (it may have been killed or may have crashed)
* Try:
Run with --stacktrace option to get the stack trace. Run with --debug option to get more log output. Run with --scan to get full insights.
* Get more help at https://help.gradle.org
2020-05-27 01:30:19,340 fdb49bdb MainThread beam_integration_benchmark(1/1) ERROR Error during benchmark beam_integration_benchmark
Traceback (most recent call last):
File "<https://builds.apache.org/job/beam_PerformanceTests_WordCountIT_Py35/ws/PerfKitBenchmarker/perfkitbenchmarker/pkb.py",> line 846, in RunBenchmark
DoRunPhase(spec, collector, detailed_timer)
File "<https://builds.apache.org/job/beam_PerformanceTests_WordCountIT_Py35/ws/PerfKitBenchmarker/perfkitbenchmarker/pkb.py",> line 689, in DoRunPhase
samples = spec.BenchmarkRun(spec)
File "<https://builds.apache.org/job/beam_PerformanceTests_WordCountIT_Py35/ws/PerfKitBenchmarker/perfkitbenchmarker/linux_benchmarks/beam_integration_benchmark.py",> line 161, in Run
job_type=job_type)
File "<https://builds.apache.org/job/beam_PerformanceTests_WordCountIT_Py35/ws/PerfKitBenchmarker/perfkitbenchmarker/providers/gcp/gcp_dpb_dataflow.py",> line 96, in SubmitJob
assert retcode == 0, "Integration Test Failed."
AssertionError: Integration Test Failed.
2020-05-27 01:30:19,341 fdb49bdb MainThread beam_integration_benchmark(1/1) INFO Cleaning up benchmark beam_integration_benchmark
2020-05-27 01:30:19,343 fdb49bdb MainThread beam_integration_benchmark(1/1) ERROR Exception running benchmark
Traceback (most recent call last):
File "<https://builds.apache.org/job/beam_PerformanceTests_WordCountIT_Py35/ws/PerfKitBenchmarker/perfkitbenchmarker/pkb.py",> line 995, in RunBenchmarkTask
RunBenchmark(spec, collector)
File "<https://builds.apache.org/job/beam_PerformanceTests_WordCountIT_Py35/ws/PerfKitBenchmarker/perfkitbenchmarker/pkb.py",> line 846, in RunBenchmark
DoRunPhase(spec, collector, detailed_timer)
File "<https://builds.apache.org/job/beam_PerformanceTests_WordCountIT_Py35/ws/PerfKitBenchmarker/perfkitbenchmarker/pkb.py",> line 689, in DoRunPhase
samples = spec.BenchmarkRun(spec)
File "<https://builds.apache.org/job/beam_PerformanceTests_WordCountIT_Py35/ws/PerfKitBenchmarker/perfkitbenchmarker/linux_benchmarks/beam_integration_benchmark.py",> line 161, in Run
job_type=job_type)
File "<https://builds.apache.org/job/beam_PerformanceTests_WordCountIT_Py35/ws/PerfKitBenchmarker/perfkitbenchmarker/providers/gcp/gcp_dpb_dataflow.py",> line 96, in SubmitJob
assert retcode == 0, "Integration Test Failed."
AssertionError: Integration Test Failed.
2020-05-27 01:30:19,343 fdb49bdb MainThread beam_integration_benchmark(1/1) ERROR Benchmark 1/1 beam_integration_benchmark (UID: beam_integration_benchmark0) failed. Execution will continue.
2020-05-27 01:30:19,344 fdb49bdb MainThread beam_integration_benchmark(1/1) INFO Benchmark run statuses:
---------------------------------------------------------------------------------
Name UID Status Failed Substatus
---------------------------------------------------------------------------------
beam_integration_benchmark beam_integration_benchmark0 FAILED
---------------------------------------------------------------------------------
Success rate: 0.00% (0/1)
2020-05-27 01:30:19,344 fdb49bdb MainThread beam_integration_benchmark(1/1) INFO Complete logs can be found at: <https://builds.apache.org/job/beam_PerformanceTests_WordCountIT_Py35/ws/runs/fdb49bdb/pkb.log>
2020-05-27 01:30:19,344 fdb49bdb MainThread beam_integration_benchmark(1/1) INFO Completion statuses can be found at: <https://builds.apache.org/job/beam_PerformanceTests_WordCountIT_Py35/ws/runs/fdb49bdb/completion_statuses.json>
Build step 'Execute shell' marked build as failure
---------------------------------------------------------------------
To unsubscribe, e-mail: builds-unsubscribe@beam.apache.org
For additional commands, e-mail: builds-help@beam.apache.org
Jenkins build is back to normal :
beam_PerformanceTests_WordCountIT_Py35 #1495
Posted by Apache Jenkins Server <je...@builds.apache.org>.
See <https://builds.apache.org/job/beam_PerformanceTests_WordCountIT_Py35/1495/display/redirect?page=changes>
---------------------------------------------------------------------
To unsubscribe, e-mail: builds-unsubscribe@beam.apache.org
For additional commands, e-mail: builds-help@beam.apache.org