You are viewing a plain text version of this content. The canonical link for it is here.
Posted to fop-dev@xmlgraphics.apache.org by Vincent Hennebert <vi...@anyware-tech.com> on 2008/01/10 16:22:30 UTC
ant junit-intermediate-format fails on Trunk?
Hi,
Am I the only one to have the following error when running ant
junit-intermediate-format on the Trunk:
[junit] Testcase: fox_external-document_2.xml(org.apache.fop.intermediate.IntermediateFormatTestSuite$1): Caused an ERROR
[junit] Java heap space
[junit] java.lang.OutOfMemoryError: Java heap space
[junit] at org.apache.fop.image.ImageIOImage.loadBitmap(ImageIOImage.java:183)
[junit] at org.apache.fop.image.ImageIOImage.loadDimensions(ImageIOImage.java:68)
[junit] at org.apache.fop.image.AbstractFopImage.load(AbstractFopImage.java:160)
[junit] at org.apache.fop.layoutmgr.ExternalDocumentLayoutManager.activateLayout(ExternalDocumentLayoutManager.java:92)
[junit] at org.apache.fop.area.AreaTreeHandler.endExternalDocument(AreaTreeHandler.java:260)
[junit] at org.apache.fop.fo.extensions.ExternalDocument.endOfNode(ExternalDocument.java:94)
[junit] at org.apache.fop.fo.FOTreeBuilder$MainFOHandler.endElement(FOTreeBuilder.java:379)
[junit] at org.apache.fop.fo.FOTreeBuilder.endElement(FOTreeBuilder.java:196)
[junit] at org.apache.xml.serializer.ToXMLSAXHandler.endElement(ToXMLSAXHandler.java:261)
[junit] at org.apache.xalan.templates.ElemCopy.execute(ElemCopy.java:118)
[junit] at org.apache.xalan.templates.ElemApplyTemplates.transformSelectedNodes(ElemApplyTemplates.java:393)
[junit] at org.apache.xalan.templates.ElemApplyTemplates.execute(ElemApplyTemplates.java:176)
[junit] at org.apache.xalan.transformer.TransformerImpl.executeChildTemplates(TransformerImpl.java:2411)
[junit] at org.apache.xalan.templates.ElemCopy.execute(ElemCopy.java:114)
[junit] at org.apache.xalan.templates.ElemApplyTemplates.transformSelectedNodes(ElemApplyTemplates.java:393)
[junit] at org.apache.xalan.templates.ElemApplyTemplates.execute(ElemApplyTemplates.java:176)
[junit] at org.apache.xalan.templates.ElemApplyTemplates.transformSelectedNodes(ElemApplyTemplates.java:393)
[junit] at org.apache.xalan.templates.ElemApplyTemplates.execute(ElemApplyTemplates.java:176)
[junit] at org.apache.xalan.transformer.TransformerImpl.executeChildTemplates(TransformerImpl.java:2411)
[junit] at org.apache.xalan.transformer.TransformerImpl.applyTemplateToNode(TransformerImpl.java:2281)
[junit] at org.apache.xalan.transformer.TransformerImpl.transformNode(TransformerImpl.java:1367)
[junit] at org.apache.xalan.transformer.TransformerImpl.transform(TransformerImpl.java:709)
[junit] at org.apache.xalan.transformer.TransformerImpl.transform(TransformerImpl.java:1284)
[junit] at org.apache.xalan.transformer.TransformerImpl.transform(TransformerImpl.java:1262)
[junit] at org.apache.fop.intermediate.AreaTreeParserTestCase.buildAreaTreeXML(AreaTreeParserTestCase.java:207)
[junit] at org.apache.fop.intermediate.AreaTreeParserTestCase.setUp(AreaTreeParserTestCase.java:116)
[junit]
[junit]
[junit] Test org.apache.fop.intermediate.IntermediateFormatTestSuite FAILED
?
Vincent
--
Vincent Hennebert Anyware Technologies
http://people.apache.org/~vhennebert http://www.anyware-tech.com
Apache FOP Committer FOP Development/Consulting
Re: ant junit-intermediate-format fails on Trunk?
Posted by Jeremias Maerki <de...@jeremias-maerki.ch>.
I get these, too. I think it's because somewhere an exception is caught
and logged and rethrown. The tests are exercising exactly those
exceptions. I plan to clean that up when I get to the new user feedback
mechanism. VERY soon now.
On 10.01.2008 18:05:46 Andreas L Delmelle wrote:
> On Jan 10, 2008, at 17:16, Jeremias Maerki wrote:
>
> > Works for me. I had a few OutOfMemoryErrors earlier during font auto
> > detection: http://issues.apache.org/bugzilla/show_bug.cgi?id=43962
>
> No problem here either with the build target Vincent mentioned.
>
> Checking the standard output of a plain 'ant', however, I do get the
> following two SEVERE errors (PDFConformanceException) in the 'junit-
> basic' target:
>
> junit-basic:
> [echo] Running basic functionality tests for fop.jar
> [junit] Testsuite: org.apache.fop.StandardTestSuite
> [junit] Tests run: 29, Failures: 0, Errors: 0, Time elapsed:
> 3.645 sec
> [junit]
> [junit] ------------- Standard Error -----------------
> [junit] Jan 10, 2008 5:52:23 PM
> org.apache.fop.area.RenderPagesModel addPage
> [junit] SEVERE: Error while rendering page 1
> [junit] org.apache.fop.pdf.PDFConformanceException: PostScript
> XObjects are prohibited when PDF/A-1b is active. Convert EPS graphics
> to another format.
> [junit] at
> org.apache.fop.pdf.PDFProfile.verifyPSXObjectsAllowed(PDFProfile.java:
> 159)
> <snip />
> [junit] Jan 10, 2008 5:52:23 PM
> org.apache.fop.area.RenderPagesModel addPage
> [junit] SEVERE: Error while rendering page 1
> [junit] org.apache.fop.pdf.PDFConformanceException: PDF/A-1 does
> not allow mixing DeviceRGB and DeviceCMYK: file:/Developer/javatools/
> xml-fop/test/resources/images/cmyk.jpg
> <snip />
>
>
> Apparently, they do not cause the related tests to fail. Are they
> expected? Does anyone else get these?
>
>
> Cheers
>
> Andreas
Jeremias Maerki
Re: ant junit-intermediate-format fails on Trunk?
Posted by Andreas L Delmelle <a_...@pandora.be>.
On Jan 10, 2008, at 17:16, Jeremias Maerki wrote:
> Works for me. I had a few OutOfMemoryErrors earlier during font auto
> detection: http://issues.apache.org/bugzilla/show_bug.cgi?id=43962
No problem here either with the build target Vincent mentioned.
Checking the standard output of a plain 'ant', however, I do get the
following two SEVERE errors (PDFConformanceException) in the 'junit-
basic' target:
junit-basic:
[echo] Running basic functionality tests for fop.jar
[junit] Testsuite: org.apache.fop.StandardTestSuite
[junit] Tests run: 29, Failures: 0, Errors: 0, Time elapsed:
3.645 sec
[junit]
[junit] ------------- Standard Error -----------------
[junit] Jan 10, 2008 5:52:23 PM
org.apache.fop.area.RenderPagesModel addPage
[junit] SEVERE: Error while rendering page 1
[junit] org.apache.fop.pdf.PDFConformanceException: PostScript
XObjects are prohibited when PDF/A-1b is active. Convert EPS graphics
to another format.
[junit] at
org.apache.fop.pdf.PDFProfile.verifyPSXObjectsAllowed(PDFProfile.java:
159)
<snip />
[junit] Jan 10, 2008 5:52:23 PM
org.apache.fop.area.RenderPagesModel addPage
[junit] SEVERE: Error while rendering page 1
[junit] org.apache.fop.pdf.PDFConformanceException: PDF/A-1 does
not allow mixing DeviceRGB and DeviceCMYK: file:/Developer/javatools/
xml-fop/test/resources/images/cmyk.jpg
<snip />
Apparently, they do not cause the related tests to fail. Are they
expected? Does anyone else get these?
Cheers
Andreas
Re: ant junit-intermediate-format fails on Trunk?
Posted by Jeremias Maerki <de...@jeremias-maerki.ch>.
Works for me. I had a few OutOfMemoryErrors earlier during font auto
detection: http://issues.apache.org/bugzilla/show_bug.cgi?id=43962
On 10.01.2008 16:22:30 Vincent Hennebert wrote:
> Hi,
>
> Am I the only one to have the following error when running ant
> junit-intermediate-format on the Trunk:
> [junit] Testcase: fox_external-document_2.xml(org.apache.fop.intermediate.IntermediateFormatTestSuite$1): Caused an ERROR
> [junit] Java heap space
> [junit] java.lang.OutOfMemoryError: Java heap space
> [junit] at org.apache.fop.image.ImageIOImage.loadBitmap(ImageIOImage.java:183)
> [junit] at org.apache.fop.image.ImageIOImage.loadDimensions(ImageIOImage.java:68)
> [junit] at org.apache.fop.image.AbstractFopImage.load(AbstractFopImage.java:160)
> [junit] at org.apache.fop.layoutmgr.ExternalDocumentLayoutManager.activateLayout(ExternalDocumentLayoutManager.java:92)
> [junit] at org.apache.fop.area.AreaTreeHandler.endExternalDocument(AreaTreeHandler.java:260)
> [junit] at org.apache.fop.fo.extensions.ExternalDocument.endOfNode(ExternalDocument.java:94)
> [junit] at org.apache.fop.fo.FOTreeBuilder$MainFOHandler.endElement(FOTreeBuilder.java:379)
> [junit] at org.apache.fop.fo.FOTreeBuilder.endElement(FOTreeBuilder.java:196)
> [junit] at org.apache.xml.serializer.ToXMLSAXHandler.endElement(ToXMLSAXHandler.java:261)
> [junit] at org.apache.xalan.templates.ElemCopy.execute(ElemCopy.java:118)
> [junit] at org.apache.xalan.templates.ElemApplyTemplates.transformSelectedNodes(ElemApplyTemplates.java:393)
> [junit] at org.apache.xalan.templates.ElemApplyTemplates.execute(ElemApplyTemplates.java:176)
> [junit] at org.apache.xalan.transformer.TransformerImpl.executeChildTemplates(TransformerImpl.java:2411)
> [junit] at org.apache.xalan.templates.ElemCopy.execute(ElemCopy.java:114)
> [junit] at org.apache.xalan.templates.ElemApplyTemplates.transformSelectedNodes(ElemApplyTemplates.java:393)
> [junit] at org.apache.xalan.templates.ElemApplyTemplates.execute(ElemApplyTemplates.java:176)
> [junit] at org.apache.xalan.templates.ElemApplyTemplates.transformSelectedNodes(ElemApplyTemplates.java:393)
> [junit] at org.apache.xalan.templates.ElemApplyTemplates.execute(ElemApplyTemplates.java:176)
> [junit] at org.apache.xalan.transformer.TransformerImpl.executeChildTemplates(TransformerImpl.java:2411)
> [junit] at org.apache.xalan.transformer.TransformerImpl.applyTemplateToNode(TransformerImpl.java:2281)
> [junit] at org.apache.xalan.transformer.TransformerImpl.transformNode(TransformerImpl.java:1367)
> [junit] at org.apache.xalan.transformer.TransformerImpl.transform(TransformerImpl.java:709)
> [junit] at org.apache.xalan.transformer.TransformerImpl.transform(TransformerImpl.java:1284)
> [junit] at org.apache.xalan.transformer.TransformerImpl.transform(TransformerImpl.java:1262)
> [junit] at org.apache.fop.intermediate.AreaTreeParserTestCase.buildAreaTreeXML(AreaTreeParserTestCase.java:207)
> [junit] at org.apache.fop.intermediate.AreaTreeParserTestCase.setUp(AreaTreeParserTestCase.java:116)
> [junit]
> [junit]
> [junit] Test org.apache.fop.intermediate.IntermediateFormatTestSuite FAILED
> ?
> Vincent
>
> --
> Vincent Hennebert Anyware Technologies
> http://people.apache.org/~vhennebert http://www.anyware-tech.com
> Apache FOP Committer FOP Development/Consulting
Jeremias Maerki