You are viewing a plain text version of this content. The canonical link for it is here.
Posted to dev@hbase.apache.org by Apache Jenkins Server <je...@builds.apache.org> on 2013/03/13 18:45:37 UTC
Build failed in Jenkins: HBase-TRUNK #3954
See <https://builds.apache.org/job/HBase-TRUNK/3954/changes>
Changes:
[ramkrishna] HBASE-8012 - Reseek should position to the beginning of file for the first time it is invoked with a KV smaller than the first KV in file (Raymond Liu)
[tedyu] HBASE-8063 Filter HFiles based on first/last key (Liang Xie)
[ramkrishna] HBASE-8066 - Provide Admin.isTableAvailable() for a given table along with splitkeys(Ram)
------------------------------------------
[...truncated 3560 lines...]
Tests run: 1, Failures: 0, Errors: 0, Skipped: 0, Time elapsed: 114.609 sec
Running org.apache.hadoop.hbase.TestGlobalMemStoreSize
Tests run: 1, Failures: 0, Errors: 0, Skipped: 0, Time elapsed: 98.004 sec
Running org.apache.hadoop.hbase.replication.TestReplicationZookeeper
Tests run: 4, Failures: 0, Errors: 0, Skipped: 0, Time elapsed: 3.161 sec
Running org.apache.hadoop.hbase.TestZooKeeper
Tests run: 9, Failures: 0, Errors: 0, Skipped: 0, Time elapsed: 155.739 sec
Running org.apache.hadoop.hbase.master.TestTableLockManager
Tests run: 4, Failures: 1, Errors: 0, Skipped: 0, Time elapsed: 204.547 sec <<< FAILURE!
Running org.apache.hadoop.hbase.replication.TestReplicationSource
Tests run: 1, Failures: 0, Errors: 0, Skipped: 0, Time elapsed: 25.884 sec
Running org.apache.hadoop.hbase.replication.regionserver.TestReplicationSink
Tests run: 5, Failures: 0, Errors: 0, Skipped: 0, Time elapsed: 77.098 sec
Running org.apache.hadoop.hbase.replication.regionserver.TestReplicationSourceManager
Tests run: 1, Failures: 0, Errors: 0, Skipped: 0, Time elapsed: 12.91 sec
Running org.apache.hadoop.hbase.replication.TestReplicationQueueFailoverCompressed
Tests run: 1, Failures: 0, Errors: 0, Skipped: 0, Time elapsed: 220.41 sec
Running org.apache.hadoop.hbase.master.TestDistributedLogSplitting
Tests run: 4, Failures: 0, Errors: 0, Skipped: 0, Time elapsed: 483.112 sec
Running org.apache.hadoop.hbase.replication.TestMasterReplication
Tests run: 2, Failures: 0, Errors: 0, Skipped: 0, Time elapsed: 273.023 sec
Running org.apache.hadoop.hbase.replication.TestReplicationSmallTests
Tests run: 8, Failures: 0, Errors: 0, Skipped: 0, Time elapsed: 216.553 sec
Running org.apache.hadoop.hbase.replication.TestReplicationDisableInactivePeer
Tests run: 1, Failures: 0, Errors: 0, Skipped: 0, Time elapsed: 185.482 sec
Running org.apache.hadoop.hbase.catalog.TestMetaReaderEditorNoCluster
Tests run: 2, Failures: 0, Errors: 0, Skipped: 0, Time elapsed: 10.299 sec
Running org.apache.hadoop.hbase.replication.TestMultiSlaveReplication
Tests run: 1, Failures: 0, Errors: 0, Skipped: 0, Time elapsed: 161.352 sec
Running org.apache.hadoop.hbase.TestMultiVersions
Tests run: 3, Failures: 0, Errors: 0, Skipped: 0, Time elapsed: 100.36 sec
Running org.apache.hadoop.hbase.catalog.TestCatalogTracker
Tests run: 7, Failures: 0, Errors: 0, Skipped: 0, Time elapsed: 14.695 sec
Running org.apache.hadoop.hbase.coprocessor.TestAggregateProtocol
Tests run: 45, Failures: 0, Errors: 0, Skipped: 0, Time elapsed: 61.674 sec
Running org.apache.hadoop.hbase.replication.TestReplicationQueueFailover
Tests run: 1, Failures: 0, Errors: 0, Skipped: 0, Time elapsed: 207.396 sec
Running org.apache.hadoop.hbase.catalog.TestMetaReaderEditor
Tests run: 5, Failures: 0, Errors: 0, Skipped: 0, Time elapsed: 120.2 sec
Running org.apache.hadoop.hbase.coprocessor.TestRowProcessorEndpoint
Tests run: 4, Failures: 0, Errors: 0, Skipped: 0, Time elapsed: 106.427 sec
Running org.apache.hadoop.hbase.TestHBaseTestingUtility
Tests run: 7, Failures: 0, Errors: 0, Skipped: 0, Time elapsed: 249.914 sec
Running org.apache.hadoop.hbase.coprocessor.TestBigDecimalColumnInterpreter
Tests run: 38, Failures: 0, Errors: 0, Skipped: 0, Time elapsed: 71.336 sec
Running org.apache.hadoop.hbase.coprocessor.TestCoprocessorEndpoint
Tests run: 6, Failures: 0, Errors: 0, Skipped: 0, Time elapsed: 58.851 sec
Running org.apache.hadoop.hbase.coprocessor.TestMasterCoprocessorExceptionWithRemove
Tests run: 1, Failures: 0, Errors: 0, Skipped: 0, Time elapsed: 45.407 sec
Running org.apache.hadoop.hbase.coprocessor.TestClassLoading
Tests run: 7, Failures: 0, Errors: 0, Skipped: 0, Time elapsed: 91.275 sec
Running org.apache.hadoop.hbase.coprocessor.TestMasterObserver
Tests run: 4, Failures: 0, Errors: 0, Skipped: 0, Time elapsed: 156.016 sec
Running org.apache.hadoop.hbase.coprocessor.TestRegionServerCoprocessorExceptionWithRemove
Tests run: 1, Failures: 0, Errors: 0, Skipped: 0, Time elapsed: 61.104 sec
Running org.apache.hadoop.hbase.coprocessor.TestRegionObserverInterface
Tests run: 7, Failures: 0, Errors: 0, Skipped: 0, Time elapsed: 95.954 sec
Running org.apache.hadoop.hbase.coprocessor.TestWALObserver
Tests run: 3, Failures: 0, Errors: 0, Skipped: 0, Time elapsed: 49.265 sec
Running org.apache.hadoop.hbase.coprocessor.TestMasterCoprocessorExceptionWithAbort
Tests run: 1, Failures: 0, Errors: 0, Skipped: 0, Time elapsed: 54.325 sec
Running org.apache.hadoop.hbase.coprocessor.TestRegionServerCoprocessorExceptionWithAbort
Tests run: 1, Failures: 0, Errors: 0, Skipped: 0, Time elapsed: 59.724 sec
Running org.apache.hadoop.hbase.coprocessor.TestRegionObserverBypass
Tests run: 2, Failures: 0, Errors: 0, Skipped: 0, Time elapsed: 55.753 sec
Running org.apache.hadoop.hbase.thrift2.TestThriftHBaseServiceHandler
Tests run: 12, Failures: 0, Errors: 0, Skipped: 0, Time elapsed: 49.071 sec
Running org.apache.hadoop.hbase.procedure.TestZKProcedureControllers
Running org.apache.hadoop.hbase.procedure.TestZKProcedure
Tests run: 4, Failures: 1, Errors: 0, Skipped: 0, Time elapsed: 11.591 sec <<< FAILURE!
Tests run: 4, Failures: 0, Errors: 0, Skipped: 0, Time elapsed: 7.475 sec
Running org.apache.hadoop.hbase.trace.TestHTraceHooks
Tests run: 1, Failures: 0, Errors: 0, Skipped: 0, Time elapsed: 50.084 sec
Running org.apache.hadoop.hbase.regionserver.TestRegionServerNoMaster
Tests run: 7, Failures: 0, Errors: 0, Skipped: 0, Time elapsed: 53.016 sec
Running org.apache.hadoop.hbase.regionserver.TestHRegionOnCluster
Tests run: 1, Failures: 0, Errors: 0, Skipped: 0, Time elapsed: 58.148 sec
Running org.apache.hadoop.hbase.thrift.TestThriftServerCmdLine
Tests run: 32, Failures: 0, Errors: 0, Skipped: 0, Time elapsed: 102.846 sec
Running org.apache.hadoop.hbase.regionserver.TestMasterAddressManager
Tests run: 1, Failures: 0, Errors: 0, Skipped: 0, Time elapsed: 4.85 sec
Running org.apache.hadoop.hbase.regionserver.TestRegionServerMetrics
Tests run: 8, Failures: 0, Errors: 0, Skipped: 0, Time elapsed: 65.009 sec
Running org.apache.hadoop.hbase.thrift.TestThriftServer
Tests run: 1, Failures: 0, Errors: 0, Skipped: 0, Time elapsed: 174.796 sec
Running org.apache.hadoop.hbase.regionserver.TestMemStore
Tests run: 22, Failures: 0, Errors: 0, Skipped: 0, Time elapsed: 212.628 sec
Running org.apache.hadoop.hbase.regionserver.TestSplitLogWorker
Tests run: 5, Failures: 0, Errors: 0, Skipped: 0, Time elapsed: 8.996 sec
Running org.apache.hadoop.hbase.regionserver.TestCompoundBloomFilter
Tests run: 3, Failures: 0, Errors: 0, Skipped: 0, Time elapsed: 137.484 sec
Running org.apache.hadoop.hbase.regionserver.TestCompactionWithCoprocessor
Tests run: 17, Failures: 0, Errors: 0, Skipped: 0, Time elapsed: 192.182 sec
Running org.apache.hadoop.hbase.regionserver.TestHRegion
Tests run: 62, Failures: 0, Errors: 0, Skipped: 0, Time elapsed: 213.239 sec
Running org.apache.hadoop.hbase.regionserver.TestStore
Tests run: 15, Failures: 0, Errors: 0, Skipped: 0, Time elapsed: 34.843 sec
Running org.apache.hadoop.hbase.regionserver.TestStoreFileBlockCacheSummary
Tests run: 1, Failures: 0, Errors: 0, Skipped: 0, Time elapsed: 72.581 sec
Running org.apache.hadoop.hbase.regionserver.TestHRegionBusyWait
Tests run: 63, Failures: 0, Errors: 0, Skipped: 0, Time elapsed: 214.662 sec
Running org.apache.hadoop.hbase.regionserver.TestAtomicOperation
Tests run: 5, Failures: 0, Errors: 0, Skipped: 0, Time elapsed: 112.954 sec
Running org.apache.hadoop.hbase.regionserver.TestServerCustomProtocol
Running org.apache.hadoop.hbase.regionserver.TestBlocksRead
Tests run: 4, Failures: 0, Errors: 0, Skipped: 0, Time elapsed: 15.007 sec
Tests run: 7, Failures: 0, Errors: 0, Skipped: 0, Time elapsed: 144.404 sec
Running org.apache.hadoop.hbase.regionserver.TestFSErrorsExposed
Tests run: 3, Failures: 0, Errors: 0, Skipped: 1, Time elapsed: 4.252 sec
Running org.apache.hadoop.hbase.regionserver.TestClusterId
Tests run: 1, Failures: 0, Errors: 0, Skipped: 0, Time elapsed: 94.392 sec
Running org.apache.hadoop.hbase.regionserver.handler.TestCloseRegionHandler
Tests run: 3, Failures: 0, Errors: 0, Skipped: 0, Time elapsed: 9.504 sec
Running org.apache.hadoop.hbase.regionserver.TestSeekOptimizations
Tests run: 6, Failures: 0, Errors: 0, Skipped: 0, Time elapsed: 14.23 sec
Running org.apache.hadoop.hbase.regionserver.handler.TestOpenRegionHandler
Tests run: 5, Failures: 0, Errors: 0, Skipped: 0, Time elapsed: 11.578 sec
Running org.apache.hadoop.hbase.regionserver.TestRSKilledWhenMasterInitializing
Tests run: 1, Failures: 0, Errors: 0, Skipped: 0, Time elapsed: 102.011 sec
Running org.apache.hadoop.hbase.regionserver.TestGetClosestAtOrBefore
Tests run: 3, Failures: 0, Errors: 0, Skipped: 0, Time elapsed: 5.231 sec
Running org.apache.hadoop.hbase.regionserver.TestHRegionServerBulkLoad
Tests run: 1, Failures: 0, Errors: 0, Skipped: 0, Time elapsed: 81.88 sec
Running org.apache.hadoop.hbase.regionserver.TestCacheOnWriteInSchema
Tests run: 3, Failures: 0, Errors: 0, Skipped: 0, Time elapsed: 21.12 sec
Running org.apache.hadoop.hbase.regionserver.TestParallelPut
Tests run: 2, Failures: 0, Errors: 0, Skipped: 0, Time elapsed: 32.475 sec
Running org.apache.hadoop.hbase.regionserver.TestPriorityRpc
Tests run: 3, Failures: 0, Errors: 0, Skipped: 0, Time elapsed: 9.137 sec
Running org.apache.hadoop.hbase.regionserver.TestCompactionState
Tests run: 5, Failures: 0, Errors: 3, Skipped: 0, Time elapsed: 301.138 sec <<< FAILURE!
Running org.apache.hadoop.hbase.regionserver.TestSplitTransactionOnCluster
Tests run: 9, Failures: 0, Errors: 2, Skipped: 0, Time elapsed: 312.983 sec <<< FAILURE!
Running org.apache.hadoop.hbase.regionserver.wal.TestLogRollAbort
Tests run: 1, Failures: 0, Errors: 0, Skipped: 0, Time elapsed: 243.871 sec
Running org.apache.hadoop.hbase.regionserver.wal.TestHLog
Tests run: 11, Failures: 0, Errors: 0, Skipped: 0, Time elapsed: 178.049 sec
Running org.apache.hadoop.hbase.regionserver.wal.TestLogRolling
Tests run: 2, Failures: 0, Errors: 0, Skipped: 0, Time elapsed: 446.759 sec
Running org.apache.hadoop.hbase.regionserver.wal.TestWALReplay
Tests run: 8, Failures: 0, Errors: 0, Skipped: 0, Time elapsed: 354.722 sec
Running org.apache.hadoop.hbase.regionserver.TestStoreScanner
Tests run: 16, Failures: 0, Errors: 0, Skipped: 0, Time elapsed: 0.953 sec
Running org.apache.hadoop.hbase.regionserver.wal.TestWALReplayCompressed
Tests run: 8, Failures: 0, Errors: 0, Skipped: 0, Time elapsed: 385.316 sec
Running org.apache.hadoop.hbase.regionserver.wal.TestHLogFiltering
Tests run: 1, Failures: 0, Errors: 0, Skipped: 0, Time elapsed: 139.629 sec
Running org.apache.hadoop.hbase.regionserver.TestEndToEndSplitTransaction
Tests run: 2, Failures: 0, Errors: 0, Skipped: 0, Time elapsed: 153.481 sec
Running org.apache.hadoop.hbase.regionserver.wal.TestHLogSplit
Tests run: 32, Failures: 0, Errors: 0, Skipped: 1, Time elapsed: 787.544 sec
Running org.apache.hadoop.hbase.regionserver.TestCompaction
Tests run: 17, Failures: 0, Errors: 0, Skipped: 0, Time elapsed: 115.072 sec
Running org.apache.hadoop.hbase.regionserver.wal.TestHLogSplitCompressed
Tests run: 32, Failures: 0, Errors: 0, Skipped: 1, Time elapsed: 780.14 sec
Running org.apache.hadoop.hbase.regionserver.TestMultiColumnScanner
Tests run: 12, Failures: 0, Errors: 0, Skipped: 0, Time elapsed: 136.499 sec
Running org.apache.hadoop.hbase.mapred.TestTableInputFormat
Tests run: 10, Failures: 0, Errors: 0, Skipped: 0, Time elapsed: 93.147 sec
Running org.apache.hadoop.hbase.backup.example.TestZooKeeperTableArchiveClient
Tests run: 3, Failures: 0, Errors: 0, Skipped: 0, Time elapsed: 23.485 sec
Running org.apache.hadoop.hbase.mapred.TestTableMapReduce
Tests run: 1, Failures: 0, Errors: 0, Skipped: 0, Time elapsed: 154.69 sec
Running org.apache.hadoop.hbase.fs.TestBlockReorder
Tests run: 3, Failures: 0, Errors: 0, Skipped: 0, Time elapsed: 167.712 sec
Running org.apache.hadoop.hbase.TestClusterBootOrder
Tests run: 2, Failures: 0, Errors: 0, Skipped: 0, Time elapsed: 94.4 sec
Running org.apache.hadoop.hbase.TestDrainingServer
Tests run: 2, Failures: 0, Errors: 0, Skipped: 0, Time elapsed: 119.597 sec
Running org.apache.hadoop.hbase.mapreduce.TestTimeRangeMapRed
Tests run: 1, Failures: 0, Errors: 0, Skipped: 0, Time elapsed: 122.523 sec
Running org.apache.hadoop.hbase.mapreduce.TestRowCounter
Tests run: 3, Failures: 0, Errors: 0, Skipped: 0, Time elapsed: 244.263 sec
Running org.apache.hadoop.hbase.mapreduce.TestSecureLoadIncrementalHFiles
Tests run: 6, Failures: 0, Errors: 0, Skipped: 0, Time elapsed: 182.605 sec
Running org.apache.hadoop.hbase.backup.TestHFileArchiving
Tests run: 5, Failures: 1, Errors: 0, Skipped: 0, Time elapsed: 505.891 sec <<< FAILURE!
Running org.apache.hadoop.hbase.mapreduce.TestImportExport
Tests run: 5, Failures: 0, Errors: 0, Skipped: 0, Time elapsed: 415.161 sec
Running org.apache.hadoop.hbase.mapreduce.TestImportTsv
Tests run: 13, Failures: 0, Errors: 0, Skipped: 0, Time elapsed: 768.058 sec
Running org.apache.hadoop.hbase.mapreduce.TestWALPlayer
Tests run: 1, Failures: 0, Errors: 0, Skipped: 0, Time elapsed: 261.153 sec
Running org.apache.hadoop.hbase.mapreduce.TestMultithreadedTableMapper
Tests run: 1, Failures: 0, Errors: 0, Skipped: 0, Time elapsed: 333.873 sec
Running org.apache.hadoop.hbase.mapreduce.TestLoadIncrementalHFilesSplitRecovery
Tests run: 4, Failures: 0, Errors: 0, Skipped: 0, Time elapsed: 267.892 sec
Running org.apache.hadoop.hbase.mapreduce.TestSecureLoadIncrementalHFilesSplitRecovery
Tests run: 4, Failures: 0, Errors: 0, Skipped: 0, Time elapsed: 224.508 sec
Running org.apache.hadoop.hbase.mapreduce.TestHLogRecordReader
Tests run: 2, Failures: 0, Errors: 0, Skipped: 0, Time elapsed: 57.533 sec
Running org.apache.hadoop.hbase.mapreduce.TestLoadIncrementalHFiles
Tests run: 6, Failures: 0, Errors: 0, Skipped: 0, Time elapsed: 133.864 sec
Running org.apache.hadoop.hbase.mapreduce.TestTableMapReduce
Tests run: 2, Failures: 0, Errors: 0, Skipped: 0, Time elapsed: 325.025 sec
Results :
Failed tests: testDelete(org.apache.hadoop.hbase.master.TestTableLockManager)
testMultiCohortWithMemberTimeoutDuringPrepare(org.apache.hadoop.hbase.procedure.TestZKProcedure): Operation error state was unexpected expected:<true> but was:<false>
testArchiveOnTableDelete(org.apache.hadoop.hbase.backup.TestHFileArchiving): Archived files are missing some of the store files!
Tests in error:
testDelayedRpcImmediateReturnValue(org.apache.hadoop.hbase.ipc.TestDelayedRpc): Index: 0, Size: 0
testOfflineSnapshotRegionOperationsIndependent(org.apache.hadoop.hbase.client.TestSnapshotCloneIndependence): Split did not increase the number of regions
testMinorCompaction(org.apache.hadoop.hbase.regionserver.TestCompactionState): test timed out after 60000 milliseconds
testMinorCompactionOnFamily(org.apache.hadoop.hbase.regionserver.TestCompactionState): test timed out after 60000 milliseconds
testMajorCompaction(org.apache.hadoop.hbase.regionserver.TestCompactionState): test timed out after 60000 milliseconds
testTableExistsIfTheSpecifiedTableRegionIsSplitParent(org.apache.hadoop.hbase.regionserver.TestSplitTransactionOnCluster): test timed out after 20000 milliseconds
testShouldFailSplitIfZNodeDoesNotExistDueToPrevRollBack(org.apache.hadoop.hbase.regionserver.TestSplitTransactionOnCluster): test timed out after 20000 milliseconds
Tests run: 1396, Failures: 3, Errors: 7, Skipped: 12
[INFO] ------------------------------------------------------------------------
[INFO] Reactor Summary:
[INFO]
[INFO] HBase ............................................. SUCCESS [5.535s]
[INFO] HBase - Common .................................... SUCCESS [27.012s]
[INFO] HBase - Protocol .................................. SUCCESS [16.372s]
[INFO] HBase - Client .................................... SUCCESS [12.533s]
[INFO] HBase - Prefix Tree ............................... SUCCESS [6.323s]
[INFO] HBase - Hadoop Compatibility ...................... SUCCESS [1.279s]
[INFO] HBase - Hadoop One Compatibility .................. SUCCESS [2.562s]
[INFO] HBase - Server .................................... FAILURE [2:06:04.538s]
[INFO] HBase - Integration Tests ......................... SKIPPED
[INFO] HBase - Examples .................................. SKIPPED
[INFO] ------------------------------------------------------------------------
[INFO] BUILD FAILURE
[INFO] ------------------------------------------------------------------------
[INFO] Total time: 2:07:17.807s
[INFO] Finished at: Wed Mar 13 17:42:19 UTC 2013
[INFO] Final Memory: 71M/861M
[INFO] ------------------------------------------------------------------------
[ERROR] Failed to execute goal org.apache.maven.plugins:maven-surefire-plugin:2.12-TRUNK-HBASE-2:test (secondPartTestsExecution) on project hbase-server: Failure or timeout -> [Help 1]
[ERROR]
[ERROR] To see the full stack trace of the errors, re-run Maven with the -e switch.
[ERROR] Re-run Maven using the -X switch to enable full debug logging.
[ERROR]
[ERROR] For more information about the errors and possible solutions, please read the following articles:
[ERROR] [Help 1] http://cwiki.apache.org/confluence/display/MAVEN/MojoExecutionException
[ERROR]
[ERROR] After correcting the problems, you can resume the build with the command
[ERROR] mvn <goals> -rf :hbase-server
Build step 'Invoke top-level Maven targets' marked build as failure
Archiving artifacts
Recording test results
Updating HBASE-8012
Updating HBASE-8066
Updating HBASE-8063
Re: Build failed in Jenkins: HBase-TRUNK #3954
Posted by Ted Yu <yu...@gmail.com>.
I ran the tests locally and they passed:
677 mt -Dtest=TestTableLockManager,TestZKProcedure,TestHFileArchiving
678 mt
-Dtest=TestDelayedRpc,TestSnapshotCloneIndependence,TestCompactionState,TestSplitTransactionOnCluster
On Wed, Mar 13, 2013 at 10:51 AM, ramkrishna vasudevan <
ramkrishna.s.vasudevan@gmail.com> wrote:
> Seeings lot of test failures.
> https://builds.apache.org/job/HBase-TRUNK/3954/
>
> As much as ten tests failed.
>
> Regards
> Ram
>
> On Wed, Mar 13, 2013 at 11:15 PM, Apache Jenkins Server <
> jenkins@builds.apache.org> wrote:
>
> > See <https://builds.apache.org/job/HBase-TRUNK/3954/changes>
> >
> > Changes:
> >
> > [ramkrishna] HBASE-8012 - Reseek should position to the beginning of file
> > for the first time it is invoked with a KV smaller than the first KV in
> > file (Raymond Liu)
> >
> > [tedyu] HBASE-8063 Filter HFiles based on first/last key (Liang Xie)
> >
> > [ramkrishna] HBASE-8066 - Provide Admin.isTableAvailable() for a given
> > table along with splitkeys(Ram)
> >
> > ------------------------------------------
> > [...truncated 3560 lines...]
> > Tests run: 1, Failures: 0, Errors: 0, Skipped: 0, Time elapsed: 114.609
> sec
> > Running org.apache.hadoop.hbase.TestGlobalMemStoreSize
> > Tests run: 1, Failures: 0, Errors: 0, Skipped: 0, Time elapsed: 98.004
> sec
> > Running org.apache.hadoop.hbase.replication.TestReplicationZookeeper
> > Tests run: 4, Failures: 0, Errors: 0, Skipped: 0, Time elapsed: 3.161 sec
> > Running org.apache.hadoop.hbase.TestZooKeeper
> > Tests run: 9, Failures: 0, Errors: 0, Skipped: 0, Time elapsed: 155.739
> sec
> > Running org.apache.hadoop.hbase.master.TestTableLockManager
> > Tests run: 4, Failures: 1, Errors: 0, Skipped: 0, Time elapsed: 204.547
> > sec <<< FAILURE!
> > Running org.apache.hadoop.hbase.replication.TestReplicationSource
> > Tests run: 1, Failures: 0, Errors: 0, Skipped: 0, Time elapsed: 25.884
> sec
> > Running
> > org.apache.hadoop.hbase.replication.regionserver.TestReplicationSink
> > Tests run: 5, Failures: 0, Errors: 0, Skipped: 0, Time elapsed: 77.098
> sec
> > Running
> >
> org.apache.hadoop.hbase.replication.regionserver.TestReplicationSourceManager
> > Tests run: 1, Failures: 0, Errors: 0, Skipped: 0, Time elapsed: 12.91 sec
> > Running
> >
> org.apache.hadoop.hbase.replication.TestReplicationQueueFailoverCompressed
> > Tests run: 1, Failures: 0, Errors: 0, Skipped: 0, Time elapsed: 220.41
> sec
> > Running org.apache.hadoop.hbase.master.TestDistributedLogSplitting
> > Tests run: 4, Failures: 0, Errors: 0, Skipped: 0, Time elapsed: 483.112
> sec
> > Running org.apache.hadoop.hbase.replication.TestMasterReplication
> > Tests run: 2, Failures: 0, Errors: 0, Skipped: 0, Time elapsed: 273.023
> sec
> > Running org.apache.hadoop.hbase.replication.TestReplicationSmallTests
> > Tests run: 8, Failures: 0, Errors: 0, Skipped: 0, Time elapsed: 216.553
> sec
> > Running
> > org.apache.hadoop.hbase.replication.TestReplicationDisableInactivePeer
> > Tests run: 1, Failures: 0, Errors: 0, Skipped: 0, Time elapsed: 185.482
> sec
> > Running org.apache.hadoop.hbase.catalog.TestMetaReaderEditorNoCluster
> > Tests run: 2, Failures: 0, Errors: 0, Skipped: 0, Time elapsed: 10.299
> sec
> > Running org.apache.hadoop.hbase.replication.TestMultiSlaveReplication
> > Tests run: 1, Failures: 0, Errors: 0, Skipped: 0, Time elapsed: 161.352
> sec
> > Running org.apache.hadoop.hbase.TestMultiVersions
> > Tests run: 3, Failures: 0, Errors: 0, Skipped: 0, Time elapsed: 100.36
> sec
> > Running org.apache.hadoop.hbase.catalog.TestCatalogTracker
> > Tests run: 7, Failures: 0, Errors: 0, Skipped: 0, Time elapsed: 14.695
> sec
> > Running org.apache.hadoop.hbase.coprocessor.TestAggregateProtocol
> > Tests run: 45, Failures: 0, Errors: 0, Skipped: 0, Time elapsed: 61.674
> sec
> > Running org.apache.hadoop.hbase.replication.TestReplicationQueueFailover
> > Tests run: 1, Failures: 0, Errors: 0, Skipped: 0, Time elapsed: 207.396
> sec
> > Running org.apache.hadoop.hbase.catalog.TestMetaReaderEditor
> > Tests run: 5, Failures: 0, Errors: 0, Skipped: 0, Time elapsed: 120.2 sec
> > Running org.apache.hadoop.hbase.coprocessor.TestRowProcessorEndpoint
> > Tests run: 4, Failures: 0, Errors: 0, Skipped: 0, Time elapsed: 106.427
> sec
> > Running org.apache.hadoop.hbase.TestHBaseTestingUtility
> > Tests run: 7, Failures: 0, Errors: 0, Skipped: 0, Time elapsed: 249.914
> sec
> > Running
> org.apache.hadoop.hbase.coprocessor.TestBigDecimalColumnInterpreter
> > Tests run: 38, Failures: 0, Errors: 0, Skipped: 0, Time elapsed: 71.336
> sec
> > Running org.apache.hadoop.hbase.coprocessor.TestCoprocessorEndpoint
> > Tests run: 6, Failures: 0, Errors: 0, Skipped: 0, Time elapsed: 58.851
> sec
> > Running
> >
> org.apache.hadoop.hbase.coprocessor.TestMasterCoprocessorExceptionWithRemove
> > Tests run: 1, Failures: 0, Errors: 0, Skipped: 0, Time elapsed: 45.407
> sec
> > Running org.apache.hadoop.hbase.coprocessor.TestClassLoading
> > Tests run: 7, Failures: 0, Errors: 0, Skipped: 0, Time elapsed: 91.275
> sec
> > Running org.apache.hadoop.hbase.coprocessor.TestMasterObserver
> > Tests run: 4, Failures: 0, Errors: 0, Skipped: 0, Time elapsed: 156.016
> sec
> > Running
> >
> org.apache.hadoop.hbase.coprocessor.TestRegionServerCoprocessorExceptionWithRemove
> > Tests run: 1, Failures: 0, Errors: 0, Skipped: 0, Time elapsed: 61.104
> sec
> > Running org.apache.hadoop.hbase.coprocessor.TestRegionObserverInterface
> > Tests run: 7, Failures: 0, Errors: 0, Skipped: 0, Time elapsed: 95.954
> sec
> > Running org.apache.hadoop.hbase.coprocessor.TestWALObserver
> > Tests run: 3, Failures: 0, Errors: 0, Skipped: 0, Time elapsed: 49.265
> sec
> > Running
> >
> org.apache.hadoop.hbase.coprocessor.TestMasterCoprocessorExceptionWithAbort
> > Tests run: 1, Failures: 0, Errors: 0, Skipped: 0, Time elapsed: 54.325
> sec
> > Running
> >
> org.apache.hadoop.hbase.coprocessor.TestRegionServerCoprocessorExceptionWithAbort
> > Tests run: 1, Failures: 0, Errors: 0, Skipped: 0, Time elapsed: 59.724
> sec
> > Running org.apache.hadoop.hbase.coprocessor.TestRegionObserverBypass
> > Tests run: 2, Failures: 0, Errors: 0, Skipped: 0, Time elapsed: 55.753
> sec
> > Running org.apache.hadoop.hbase.thrift2.TestThriftHBaseServiceHandler
> > Tests run: 12, Failures: 0, Errors: 0, Skipped: 0, Time elapsed: 49.071
> sec
> > Running org.apache.hadoop.hbase.procedure.TestZKProcedureControllers
> > Running org.apache.hadoop.hbase.procedure.TestZKProcedure
> > Tests run: 4, Failures: 1, Errors: 0, Skipped: 0, Time elapsed: 11.591
> sec
> > <<< FAILURE!
> > Tests run: 4, Failures: 0, Errors: 0, Skipped: 0, Time elapsed: 7.475 sec
> > Running org.apache.hadoop.hbase.trace.TestHTraceHooks
> > Tests run: 1, Failures: 0, Errors: 0, Skipped: 0, Time elapsed: 50.084
> sec
> > Running org.apache.hadoop.hbase.regionserver.TestRegionServerNoMaster
> > Tests run: 7, Failures: 0, Errors: 0, Skipped: 0, Time elapsed: 53.016
> sec
> > Running org.apache.hadoop.hbase.regionserver.TestHRegionOnCluster
> > Tests run: 1, Failures: 0, Errors: 0, Skipped: 0, Time elapsed: 58.148
> sec
> > Running org.apache.hadoop.hbase.thrift.TestThriftServerCmdLine
> > Tests run: 32, Failures: 0, Errors: 0, Skipped: 0, Time elapsed: 102.846
> > sec
> > Running org.apache.hadoop.hbase.regionserver.TestMasterAddressManager
> > Tests run: 1, Failures: 0, Errors: 0, Skipped: 0, Time elapsed: 4.85 sec
> > Running org.apache.hadoop.hbase.regionserver.TestRegionServerMetrics
> > Tests run: 8, Failures: 0, Errors: 0, Skipped: 0, Time elapsed: 65.009
> sec
> > Running org.apache.hadoop.hbase.thrift.TestThriftServer
> > Tests run: 1, Failures: 0, Errors: 0, Skipped: 0, Time elapsed: 174.796
> sec
> > Running org.apache.hadoop.hbase.regionserver.TestMemStore
> > Tests run: 22, Failures: 0, Errors: 0, Skipped: 0, Time elapsed: 212.628
> > sec
> > Running org.apache.hadoop.hbase.regionserver.TestSplitLogWorker
> > Tests run: 5, Failures: 0, Errors: 0, Skipped: 0, Time elapsed: 8.996 sec
> > Running org.apache.hadoop.hbase.regionserver.TestCompoundBloomFilter
> > Tests run: 3, Failures: 0, Errors: 0, Skipped: 0, Time elapsed: 137.484
> sec
> > Running
> org.apache.hadoop.hbase.regionserver.TestCompactionWithCoprocessor
> > Tests run: 17, Failures: 0, Errors: 0, Skipped: 0, Time elapsed: 192.182
> > sec
> > Running org.apache.hadoop.hbase.regionserver.TestHRegion
> > Tests run: 62, Failures: 0, Errors: 0, Skipped: 0, Time elapsed: 213.239
> > sec
> > Running org.apache.hadoop.hbase.regionserver.TestStore
> > Tests run: 15, Failures: 0, Errors: 0, Skipped: 0, Time elapsed: 34.843
> sec
> > Running
> org.apache.hadoop.hbase.regionserver.TestStoreFileBlockCacheSummary
> > Tests run: 1, Failures: 0, Errors: 0, Skipped: 0, Time elapsed: 72.581
> sec
> > Running org.apache.hadoop.hbase.regionserver.TestHRegionBusyWait
> > Tests run: 63, Failures: 0, Errors: 0, Skipped: 0, Time elapsed: 214.662
> > sec
> > Running org.apache.hadoop.hbase.regionserver.TestAtomicOperation
> > Tests run: 5, Failures: 0, Errors: 0, Skipped: 0, Time elapsed: 112.954
> sec
> > Running org.apache.hadoop.hbase.regionserver.TestServerCustomProtocol
> > Running org.apache.hadoop.hbase.regionserver.TestBlocksRead
> > Tests run: 4, Failures: 0, Errors: 0, Skipped: 0, Time elapsed: 15.007
> sec
> > Tests run: 7, Failures: 0, Errors: 0, Skipped: 0, Time elapsed: 144.404
> sec
> > Running org.apache.hadoop.hbase.regionserver.TestFSErrorsExposed
> > Tests run: 3, Failures: 0, Errors: 0, Skipped: 1, Time elapsed: 4.252 sec
> > Running org.apache.hadoop.hbase.regionserver.TestClusterId
> > Tests run: 1, Failures: 0, Errors: 0, Skipped: 0, Time elapsed: 94.392
> sec
> > Running
> org.apache.hadoop.hbase.regionserver.handler.TestCloseRegionHandler
> > Tests run: 3, Failures: 0, Errors: 0, Skipped: 0, Time elapsed: 9.504 sec
> > Running org.apache.hadoop.hbase.regionserver.TestSeekOptimizations
> > Tests run: 6, Failures: 0, Errors: 0, Skipped: 0, Time elapsed: 14.23 sec
> > Running
> org.apache.hadoop.hbase.regionserver.handler.TestOpenRegionHandler
> > Tests run: 5, Failures: 0, Errors: 0, Skipped: 0, Time elapsed: 11.578
> sec
> > Running
> > org.apache.hadoop.hbase.regionserver.TestRSKilledWhenMasterInitializing
> > Tests run: 1, Failures: 0, Errors: 0, Skipped: 0, Time elapsed: 102.011
> sec
> > Running org.apache.hadoop.hbase.regionserver.TestGetClosestAtOrBefore
> > Tests run: 3, Failures: 0, Errors: 0, Skipped: 0, Time elapsed: 5.231 sec
> > Running org.apache.hadoop.hbase.regionserver.TestHRegionServerBulkLoad
> > Tests run: 1, Failures: 0, Errors: 0, Skipped: 0, Time elapsed: 81.88 sec
> > Running org.apache.hadoop.hbase.regionserver.TestCacheOnWriteInSchema
> > Tests run: 3, Failures: 0, Errors: 0, Skipped: 0, Time elapsed: 21.12 sec
> > Running org.apache.hadoop.hbase.regionserver.TestParallelPut
> > Tests run: 2, Failures: 0, Errors: 0, Skipped: 0, Time elapsed: 32.475
> sec
> > Running org.apache.hadoop.hbase.regionserver.TestPriorityRpc
> > Tests run: 3, Failures: 0, Errors: 0, Skipped: 0, Time elapsed: 9.137 sec
> > Running org.apache.hadoop.hbase.regionserver.TestCompactionState
> > Tests run: 5, Failures: 0, Errors: 3, Skipped: 0, Time elapsed: 301.138
> > sec <<< FAILURE!
> > Running
> org.apache.hadoop.hbase.regionserver.TestSplitTransactionOnCluster
> > Tests run: 9, Failures: 0, Errors: 2, Skipped: 0, Time elapsed: 312.983
> > sec <<< FAILURE!
> > Running org.apache.hadoop.hbase.regionserver.wal.TestLogRollAbort
> > Tests run: 1, Failures: 0, Errors: 0, Skipped: 0, Time elapsed: 243.871
> sec
> > Running org.apache.hadoop.hbase.regionserver.wal.TestHLog
> > Tests run: 11, Failures: 0, Errors: 0, Skipped: 0, Time elapsed: 178.049
> > sec
> > Running org.apache.hadoop.hbase.regionserver.wal.TestLogRolling
> > Tests run: 2, Failures: 0, Errors: 0, Skipped: 0, Time elapsed: 446.759
> sec
> > Running org.apache.hadoop.hbase.regionserver.wal.TestWALReplay
> > Tests run: 8, Failures: 0, Errors: 0, Skipped: 0, Time elapsed: 354.722
> sec
> > Running org.apache.hadoop.hbase.regionserver.TestStoreScanner
> > Tests run: 16, Failures: 0, Errors: 0, Skipped: 0, Time elapsed: 0.953
> sec
> > Running org.apache.hadoop.hbase.regionserver.wal.TestWALReplayCompressed
> > Tests run: 8, Failures: 0, Errors: 0, Skipped: 0, Time elapsed: 385.316
> sec
> > Running org.apache.hadoop.hbase.regionserver.wal.TestHLogFiltering
> > Tests run: 1, Failures: 0, Errors: 0, Skipped: 0, Time elapsed: 139.629
> sec
> > Running org.apache.hadoop.hbase.regionserver.TestEndToEndSplitTransaction
> > Tests run: 2, Failures: 0, Errors: 0, Skipped: 0, Time elapsed: 153.481
> sec
> > Running org.apache.hadoop.hbase.regionserver.wal.TestHLogSplit
> > Tests run: 32, Failures: 0, Errors: 0, Skipped: 1, Time elapsed: 787.544
> > sec
> > Running org.apache.hadoop.hbase.regionserver.TestCompaction
> > Tests run: 17, Failures: 0, Errors: 0, Skipped: 0, Time elapsed: 115.072
> > sec
> > Running org.apache.hadoop.hbase.regionserver.wal.TestHLogSplitCompressed
> > Tests run: 32, Failures: 0, Errors: 0, Skipped: 1, Time elapsed: 780.14
> sec
> > Running org.apache.hadoop.hbase.regionserver.TestMultiColumnScanner
> > Tests run: 12, Failures: 0, Errors: 0, Skipped: 0, Time elapsed: 136.499
> > sec
> > Running org.apache.hadoop.hbase.mapred.TestTableInputFormat
> > Tests run: 10, Failures: 0, Errors: 0, Skipped: 0, Time elapsed: 93.147
> sec
> > Running
> > org.apache.hadoop.hbase.backup.example.TestZooKeeperTableArchiveClient
> > Tests run: 3, Failures: 0, Errors: 0, Skipped: 0, Time elapsed: 23.485
> sec
> > Running org.apache.hadoop.hbase.mapred.TestTableMapReduce
> > Tests run: 1, Failures: 0, Errors: 0, Skipped: 0, Time elapsed: 154.69
> sec
> > Running org.apache.hadoop.hbase.fs.TestBlockReorder
> > Tests run: 3, Failures: 0, Errors: 0, Skipped: 0, Time elapsed: 167.712
> sec
> > Running org.apache.hadoop.hbase.TestClusterBootOrder
> > Tests run: 2, Failures: 0, Errors: 0, Skipped: 0, Time elapsed: 94.4 sec
> > Running org.apache.hadoop.hbase.TestDrainingServer
> > Tests run: 2, Failures: 0, Errors: 0, Skipped: 0, Time elapsed: 119.597
> sec
> > Running org.apache.hadoop.hbase.mapreduce.TestTimeRangeMapRed
> > Tests run: 1, Failures: 0, Errors: 0, Skipped: 0, Time elapsed: 122.523
> sec
> > Running org.apache.hadoop.hbase.mapreduce.TestRowCounter
> > Tests run: 3, Failures: 0, Errors: 0, Skipped: 0, Time elapsed: 244.263
> sec
> > Running org.apache.hadoop.hbase.mapreduce.TestSecureLoadIncrementalHFiles
> > Tests run: 6, Failures: 0, Errors: 0, Skipped: 0, Time elapsed: 182.605
> sec
> > Running org.apache.hadoop.hbase.backup.TestHFileArchiving
> > Tests run: 5, Failures: 1, Errors: 0, Skipped: 0, Time elapsed: 505.891
> > sec <<< FAILURE!
> > Running org.apache.hadoop.hbase.mapreduce.TestImportExport
> > Tests run: 5, Failures: 0, Errors: 0, Skipped: 0, Time elapsed: 415.161
> sec
> > Running org.apache.hadoop.hbase.mapreduce.TestImportTsv
> > Tests run: 13, Failures: 0, Errors: 0, Skipped: 0, Time elapsed: 768.058
> > sec
> > Running org.apache.hadoop.hbase.mapreduce.TestWALPlayer
> > Tests run: 1, Failures: 0, Errors: 0, Skipped: 0, Time elapsed: 261.153
> sec
> > Running org.apache.hadoop.hbase.mapreduce.TestMultithreadedTableMapper
> > Tests run: 1, Failures: 0, Errors: 0, Skipped: 0, Time elapsed: 333.873
> sec
> > Running
> > org.apache.hadoop.hbase.mapreduce.TestLoadIncrementalHFilesSplitRecovery
> > Tests run: 4, Failures: 0, Errors: 0, Skipped: 0, Time elapsed: 267.892
> sec
> > Running
> >
> org.apache.hadoop.hbase.mapreduce.TestSecureLoadIncrementalHFilesSplitRecovery
> > Tests run: 4, Failures: 0, Errors: 0, Skipped: 0, Time elapsed: 224.508
> sec
> > Running org.apache.hadoop.hbase.mapreduce.TestHLogRecordReader
> > Tests run: 2, Failures: 0, Errors: 0, Skipped: 0, Time elapsed: 57.533
> sec
> > Running org.apache.hadoop.hbase.mapreduce.TestLoadIncrementalHFiles
> > Tests run: 6, Failures: 0, Errors: 0, Skipped: 0, Time elapsed: 133.864
> sec
> > Running org.apache.hadoop.hbase.mapreduce.TestTableMapReduce
> > Tests run: 2, Failures: 0, Errors: 0, Skipped: 0, Time elapsed: 325.025
> sec
> >
> > Results :
> >
> > Failed tests:
> > testDelete(org.apache.hadoop.hbase.master.TestTableLockManager)
> >
> >
> testMultiCohortWithMemberTimeoutDuringPrepare(org.apache.hadoop.hbase.procedure.TestZKProcedure):
> > Operation error state was unexpected expected:<true> but was:<false>
> >
> >
> testArchiveOnTableDelete(org.apache.hadoop.hbase.backup.TestHFileArchiving):
> > Archived files are missing some of the store files!
> >
> > Tests in error:
> >
> >
> testDelayedRpcImmediateReturnValue(org.apache.hadoop.hbase.ipc.TestDelayedRpc):
> > Index: 0, Size: 0
> >
> >
> testOfflineSnapshotRegionOperationsIndependent(org.apache.hadoop.hbase.client.TestSnapshotCloneIndependence):
> > Split did not increase the number of regions
> >
> >
> testMinorCompaction(org.apache.hadoop.hbase.regionserver.TestCompactionState):
> > test timed out after 60000 milliseconds
> >
> >
> testMinorCompactionOnFamily(org.apache.hadoop.hbase.regionserver.TestCompactionState):
> > test timed out after 60000 milliseconds
> >
> >
> testMajorCompaction(org.apache.hadoop.hbase.regionserver.TestCompactionState):
> > test timed out after 60000 milliseconds
> >
> >
> testTableExistsIfTheSpecifiedTableRegionIsSplitParent(org.apache.hadoop.hbase.regionserver.TestSplitTransactionOnCluster):
> > test timed out after 20000 milliseconds
> >
> >
> testShouldFailSplitIfZNodeDoesNotExistDueToPrevRollBack(org.apache.hadoop.hbase.regionserver.TestSplitTransactionOnCluster):
> > test timed out after 20000 milliseconds
> >
> > Tests run: 1396, Failures: 3, Errors: 7, Skipped: 12
> >
> > [INFO]
> > ------------------------------------------------------------------------
> > [INFO] Reactor Summary:
> > [INFO]
> > [INFO] HBase ............................................. SUCCESS
> [5.535s]
> > [INFO] HBase - Common .................................... SUCCESS
> > [27.012s]
> > [INFO] HBase - Protocol .................................. SUCCESS
> > [16.372s]
> > [INFO] HBase - Client .................................... SUCCESS
> > [12.533s]
> > [INFO] HBase - Prefix Tree ............................... SUCCESS
> [6.323s]
> > [INFO] HBase - Hadoop Compatibility ...................... SUCCESS
> [1.279s]
> > [INFO] HBase - Hadoop One Compatibility .................. SUCCESS
> [2.562s]
> > [INFO] HBase - Server .................................... FAILURE
> > [2:06:04.538s]
> > [INFO] HBase - Integration Tests ......................... SKIPPED
> > [INFO] HBase - Examples .................................. SKIPPED
> > [INFO]
> > ------------------------------------------------------------------------
> > [INFO] BUILD FAILURE
> > [INFO]
> > ------------------------------------------------------------------------
> > [INFO] Total time: 2:07:17.807s
> > [INFO] Finished at: Wed Mar 13 17:42:19 UTC 2013
> > [INFO] Final Memory: 71M/861M
> > [INFO]
> > ------------------------------------------------------------------------
> > [ERROR] Failed to execute goal
> > org.apache.maven.plugins:maven-surefire-plugin:2.12-TRUNK-HBASE-2:test
> > (secondPartTestsExecution) on project hbase-server: Failure or timeout ->
> > [Help 1]
> > [ERROR]
> > [ERROR] To see the full stack trace of the errors, re-run Maven with the
> > -e switch.
> > [ERROR] Re-run Maven using the -X switch to enable full debug logging.
> > [ERROR]
> > [ERROR] For more information about the errors and possible solutions,
> > please read the following articles:
> > [ERROR] [Help 1]
> > http://cwiki.apache.org/confluence/display/MAVEN/MojoExecutionException
> > [ERROR]
> > [ERROR] After correcting the problems, you can resume the build with the
> > command
> > [ERROR] mvn <goals> -rf :hbase-server
> > Build step 'Invoke top-level Maven targets' marked build as failure
> > Archiving artifacts
> > Recording test results
> > Updating HBASE-8012
> > Updating HBASE-8066
> > Updating HBASE-8063
> >
>
Re: Build failed in Jenkins: HBase-TRUNK #3954
Posted by ramkrishna vasudevan <ra...@gmail.com>.
Seeings lot of test failures.
https://builds.apache.org/job/HBase-TRUNK/3954/
As much as ten tests failed.
Regards
Ram
On Wed, Mar 13, 2013 at 11:15 PM, Apache Jenkins Server <
jenkins@builds.apache.org> wrote:
> See <https://builds.apache.org/job/HBase-TRUNK/3954/changes>
>
> Changes:
>
> [ramkrishna] HBASE-8012 - Reseek should position to the beginning of file
> for the first time it is invoked with a KV smaller than the first KV in
> file (Raymond Liu)
>
> [tedyu] HBASE-8063 Filter HFiles based on first/last key (Liang Xie)
>
> [ramkrishna] HBASE-8066 - Provide Admin.isTableAvailable() for a given
> table along with splitkeys(Ram)
>
> ------------------------------------------
> [...truncated 3560 lines...]
> Tests run: 1, Failures: 0, Errors: 0, Skipped: 0, Time elapsed: 114.609 sec
> Running org.apache.hadoop.hbase.TestGlobalMemStoreSize
> Tests run: 1, Failures: 0, Errors: 0, Skipped: 0, Time elapsed: 98.004 sec
> Running org.apache.hadoop.hbase.replication.TestReplicationZookeeper
> Tests run: 4, Failures: 0, Errors: 0, Skipped: 0, Time elapsed: 3.161 sec
> Running org.apache.hadoop.hbase.TestZooKeeper
> Tests run: 9, Failures: 0, Errors: 0, Skipped: 0, Time elapsed: 155.739 sec
> Running org.apache.hadoop.hbase.master.TestTableLockManager
> Tests run: 4, Failures: 1, Errors: 0, Skipped: 0, Time elapsed: 204.547
> sec <<< FAILURE!
> Running org.apache.hadoop.hbase.replication.TestReplicationSource
> Tests run: 1, Failures: 0, Errors: 0, Skipped: 0, Time elapsed: 25.884 sec
> Running
> org.apache.hadoop.hbase.replication.regionserver.TestReplicationSink
> Tests run: 5, Failures: 0, Errors: 0, Skipped: 0, Time elapsed: 77.098 sec
> Running
> org.apache.hadoop.hbase.replication.regionserver.TestReplicationSourceManager
> Tests run: 1, Failures: 0, Errors: 0, Skipped: 0, Time elapsed: 12.91 sec
> Running
> org.apache.hadoop.hbase.replication.TestReplicationQueueFailoverCompressed
> Tests run: 1, Failures: 0, Errors: 0, Skipped: 0, Time elapsed: 220.41 sec
> Running org.apache.hadoop.hbase.master.TestDistributedLogSplitting
> Tests run: 4, Failures: 0, Errors: 0, Skipped: 0, Time elapsed: 483.112 sec
> Running org.apache.hadoop.hbase.replication.TestMasterReplication
> Tests run: 2, Failures: 0, Errors: 0, Skipped: 0, Time elapsed: 273.023 sec
> Running org.apache.hadoop.hbase.replication.TestReplicationSmallTests
> Tests run: 8, Failures: 0, Errors: 0, Skipped: 0, Time elapsed: 216.553 sec
> Running
> org.apache.hadoop.hbase.replication.TestReplicationDisableInactivePeer
> Tests run: 1, Failures: 0, Errors: 0, Skipped: 0, Time elapsed: 185.482 sec
> Running org.apache.hadoop.hbase.catalog.TestMetaReaderEditorNoCluster
> Tests run: 2, Failures: 0, Errors: 0, Skipped: 0, Time elapsed: 10.299 sec
> Running org.apache.hadoop.hbase.replication.TestMultiSlaveReplication
> Tests run: 1, Failures: 0, Errors: 0, Skipped: 0, Time elapsed: 161.352 sec
> Running org.apache.hadoop.hbase.TestMultiVersions
> Tests run: 3, Failures: 0, Errors: 0, Skipped: 0, Time elapsed: 100.36 sec
> Running org.apache.hadoop.hbase.catalog.TestCatalogTracker
> Tests run: 7, Failures: 0, Errors: 0, Skipped: 0, Time elapsed: 14.695 sec
> Running org.apache.hadoop.hbase.coprocessor.TestAggregateProtocol
> Tests run: 45, Failures: 0, Errors: 0, Skipped: 0, Time elapsed: 61.674 sec
> Running org.apache.hadoop.hbase.replication.TestReplicationQueueFailover
> Tests run: 1, Failures: 0, Errors: 0, Skipped: 0, Time elapsed: 207.396 sec
> Running org.apache.hadoop.hbase.catalog.TestMetaReaderEditor
> Tests run: 5, Failures: 0, Errors: 0, Skipped: 0, Time elapsed: 120.2 sec
> Running org.apache.hadoop.hbase.coprocessor.TestRowProcessorEndpoint
> Tests run: 4, Failures: 0, Errors: 0, Skipped: 0, Time elapsed: 106.427 sec
> Running org.apache.hadoop.hbase.TestHBaseTestingUtility
> Tests run: 7, Failures: 0, Errors: 0, Skipped: 0, Time elapsed: 249.914 sec
> Running org.apache.hadoop.hbase.coprocessor.TestBigDecimalColumnInterpreter
> Tests run: 38, Failures: 0, Errors: 0, Skipped: 0, Time elapsed: 71.336 sec
> Running org.apache.hadoop.hbase.coprocessor.TestCoprocessorEndpoint
> Tests run: 6, Failures: 0, Errors: 0, Skipped: 0, Time elapsed: 58.851 sec
> Running
> org.apache.hadoop.hbase.coprocessor.TestMasterCoprocessorExceptionWithRemove
> Tests run: 1, Failures: 0, Errors: 0, Skipped: 0, Time elapsed: 45.407 sec
> Running org.apache.hadoop.hbase.coprocessor.TestClassLoading
> Tests run: 7, Failures: 0, Errors: 0, Skipped: 0, Time elapsed: 91.275 sec
> Running org.apache.hadoop.hbase.coprocessor.TestMasterObserver
> Tests run: 4, Failures: 0, Errors: 0, Skipped: 0, Time elapsed: 156.016 sec
> Running
> org.apache.hadoop.hbase.coprocessor.TestRegionServerCoprocessorExceptionWithRemove
> Tests run: 1, Failures: 0, Errors: 0, Skipped: 0, Time elapsed: 61.104 sec
> Running org.apache.hadoop.hbase.coprocessor.TestRegionObserverInterface
> Tests run: 7, Failures: 0, Errors: 0, Skipped: 0, Time elapsed: 95.954 sec
> Running org.apache.hadoop.hbase.coprocessor.TestWALObserver
> Tests run: 3, Failures: 0, Errors: 0, Skipped: 0, Time elapsed: 49.265 sec
> Running
> org.apache.hadoop.hbase.coprocessor.TestMasterCoprocessorExceptionWithAbort
> Tests run: 1, Failures: 0, Errors: 0, Skipped: 0, Time elapsed: 54.325 sec
> Running
> org.apache.hadoop.hbase.coprocessor.TestRegionServerCoprocessorExceptionWithAbort
> Tests run: 1, Failures: 0, Errors: 0, Skipped: 0, Time elapsed: 59.724 sec
> Running org.apache.hadoop.hbase.coprocessor.TestRegionObserverBypass
> Tests run: 2, Failures: 0, Errors: 0, Skipped: 0, Time elapsed: 55.753 sec
> Running org.apache.hadoop.hbase.thrift2.TestThriftHBaseServiceHandler
> Tests run: 12, Failures: 0, Errors: 0, Skipped: 0, Time elapsed: 49.071 sec
> Running org.apache.hadoop.hbase.procedure.TestZKProcedureControllers
> Running org.apache.hadoop.hbase.procedure.TestZKProcedure
> Tests run: 4, Failures: 1, Errors: 0, Skipped: 0, Time elapsed: 11.591 sec
> <<< FAILURE!
> Tests run: 4, Failures: 0, Errors: 0, Skipped: 0, Time elapsed: 7.475 sec
> Running org.apache.hadoop.hbase.trace.TestHTraceHooks
> Tests run: 1, Failures: 0, Errors: 0, Skipped: 0, Time elapsed: 50.084 sec
> Running org.apache.hadoop.hbase.regionserver.TestRegionServerNoMaster
> Tests run: 7, Failures: 0, Errors: 0, Skipped: 0, Time elapsed: 53.016 sec
> Running org.apache.hadoop.hbase.regionserver.TestHRegionOnCluster
> Tests run: 1, Failures: 0, Errors: 0, Skipped: 0, Time elapsed: 58.148 sec
> Running org.apache.hadoop.hbase.thrift.TestThriftServerCmdLine
> Tests run: 32, Failures: 0, Errors: 0, Skipped: 0, Time elapsed: 102.846
> sec
> Running org.apache.hadoop.hbase.regionserver.TestMasterAddressManager
> Tests run: 1, Failures: 0, Errors: 0, Skipped: 0, Time elapsed: 4.85 sec
> Running org.apache.hadoop.hbase.regionserver.TestRegionServerMetrics
> Tests run: 8, Failures: 0, Errors: 0, Skipped: 0, Time elapsed: 65.009 sec
> Running org.apache.hadoop.hbase.thrift.TestThriftServer
> Tests run: 1, Failures: 0, Errors: 0, Skipped: 0, Time elapsed: 174.796 sec
> Running org.apache.hadoop.hbase.regionserver.TestMemStore
> Tests run: 22, Failures: 0, Errors: 0, Skipped: 0, Time elapsed: 212.628
> sec
> Running org.apache.hadoop.hbase.regionserver.TestSplitLogWorker
> Tests run: 5, Failures: 0, Errors: 0, Skipped: 0, Time elapsed: 8.996 sec
> Running org.apache.hadoop.hbase.regionserver.TestCompoundBloomFilter
> Tests run: 3, Failures: 0, Errors: 0, Skipped: 0, Time elapsed: 137.484 sec
> Running org.apache.hadoop.hbase.regionserver.TestCompactionWithCoprocessor
> Tests run: 17, Failures: 0, Errors: 0, Skipped: 0, Time elapsed: 192.182
> sec
> Running org.apache.hadoop.hbase.regionserver.TestHRegion
> Tests run: 62, Failures: 0, Errors: 0, Skipped: 0, Time elapsed: 213.239
> sec
> Running org.apache.hadoop.hbase.regionserver.TestStore
> Tests run: 15, Failures: 0, Errors: 0, Skipped: 0, Time elapsed: 34.843 sec
> Running org.apache.hadoop.hbase.regionserver.TestStoreFileBlockCacheSummary
> Tests run: 1, Failures: 0, Errors: 0, Skipped: 0, Time elapsed: 72.581 sec
> Running org.apache.hadoop.hbase.regionserver.TestHRegionBusyWait
> Tests run: 63, Failures: 0, Errors: 0, Skipped: 0, Time elapsed: 214.662
> sec
> Running org.apache.hadoop.hbase.regionserver.TestAtomicOperation
> Tests run: 5, Failures: 0, Errors: 0, Skipped: 0, Time elapsed: 112.954 sec
> Running org.apache.hadoop.hbase.regionserver.TestServerCustomProtocol
> Running org.apache.hadoop.hbase.regionserver.TestBlocksRead
> Tests run: 4, Failures: 0, Errors: 0, Skipped: 0, Time elapsed: 15.007 sec
> Tests run: 7, Failures: 0, Errors: 0, Skipped: 0, Time elapsed: 144.404 sec
> Running org.apache.hadoop.hbase.regionserver.TestFSErrorsExposed
> Tests run: 3, Failures: 0, Errors: 0, Skipped: 1, Time elapsed: 4.252 sec
> Running org.apache.hadoop.hbase.regionserver.TestClusterId
> Tests run: 1, Failures: 0, Errors: 0, Skipped: 0, Time elapsed: 94.392 sec
> Running org.apache.hadoop.hbase.regionserver.handler.TestCloseRegionHandler
> Tests run: 3, Failures: 0, Errors: 0, Skipped: 0, Time elapsed: 9.504 sec
> Running org.apache.hadoop.hbase.regionserver.TestSeekOptimizations
> Tests run: 6, Failures: 0, Errors: 0, Skipped: 0, Time elapsed: 14.23 sec
> Running org.apache.hadoop.hbase.regionserver.handler.TestOpenRegionHandler
> Tests run: 5, Failures: 0, Errors: 0, Skipped: 0, Time elapsed: 11.578 sec
> Running
> org.apache.hadoop.hbase.regionserver.TestRSKilledWhenMasterInitializing
> Tests run: 1, Failures: 0, Errors: 0, Skipped: 0, Time elapsed: 102.011 sec
> Running org.apache.hadoop.hbase.regionserver.TestGetClosestAtOrBefore
> Tests run: 3, Failures: 0, Errors: 0, Skipped: 0, Time elapsed: 5.231 sec
> Running org.apache.hadoop.hbase.regionserver.TestHRegionServerBulkLoad
> Tests run: 1, Failures: 0, Errors: 0, Skipped: 0, Time elapsed: 81.88 sec
> Running org.apache.hadoop.hbase.regionserver.TestCacheOnWriteInSchema
> Tests run: 3, Failures: 0, Errors: 0, Skipped: 0, Time elapsed: 21.12 sec
> Running org.apache.hadoop.hbase.regionserver.TestParallelPut
> Tests run: 2, Failures: 0, Errors: 0, Skipped: 0, Time elapsed: 32.475 sec
> Running org.apache.hadoop.hbase.regionserver.TestPriorityRpc
> Tests run: 3, Failures: 0, Errors: 0, Skipped: 0, Time elapsed: 9.137 sec
> Running org.apache.hadoop.hbase.regionserver.TestCompactionState
> Tests run: 5, Failures: 0, Errors: 3, Skipped: 0, Time elapsed: 301.138
> sec <<< FAILURE!
> Running org.apache.hadoop.hbase.regionserver.TestSplitTransactionOnCluster
> Tests run: 9, Failures: 0, Errors: 2, Skipped: 0, Time elapsed: 312.983
> sec <<< FAILURE!
> Running org.apache.hadoop.hbase.regionserver.wal.TestLogRollAbort
> Tests run: 1, Failures: 0, Errors: 0, Skipped: 0, Time elapsed: 243.871 sec
> Running org.apache.hadoop.hbase.regionserver.wal.TestHLog
> Tests run: 11, Failures: 0, Errors: 0, Skipped: 0, Time elapsed: 178.049
> sec
> Running org.apache.hadoop.hbase.regionserver.wal.TestLogRolling
> Tests run: 2, Failures: 0, Errors: 0, Skipped: 0, Time elapsed: 446.759 sec
> Running org.apache.hadoop.hbase.regionserver.wal.TestWALReplay
> Tests run: 8, Failures: 0, Errors: 0, Skipped: 0, Time elapsed: 354.722 sec
> Running org.apache.hadoop.hbase.regionserver.TestStoreScanner
> Tests run: 16, Failures: 0, Errors: 0, Skipped: 0, Time elapsed: 0.953 sec
> Running org.apache.hadoop.hbase.regionserver.wal.TestWALReplayCompressed
> Tests run: 8, Failures: 0, Errors: 0, Skipped: 0, Time elapsed: 385.316 sec
> Running org.apache.hadoop.hbase.regionserver.wal.TestHLogFiltering
> Tests run: 1, Failures: 0, Errors: 0, Skipped: 0, Time elapsed: 139.629 sec
> Running org.apache.hadoop.hbase.regionserver.TestEndToEndSplitTransaction
> Tests run: 2, Failures: 0, Errors: 0, Skipped: 0, Time elapsed: 153.481 sec
> Running org.apache.hadoop.hbase.regionserver.wal.TestHLogSplit
> Tests run: 32, Failures: 0, Errors: 0, Skipped: 1, Time elapsed: 787.544
> sec
> Running org.apache.hadoop.hbase.regionserver.TestCompaction
> Tests run: 17, Failures: 0, Errors: 0, Skipped: 0, Time elapsed: 115.072
> sec
> Running org.apache.hadoop.hbase.regionserver.wal.TestHLogSplitCompressed
> Tests run: 32, Failures: 0, Errors: 0, Skipped: 1, Time elapsed: 780.14 sec
> Running org.apache.hadoop.hbase.regionserver.TestMultiColumnScanner
> Tests run: 12, Failures: 0, Errors: 0, Skipped: 0, Time elapsed: 136.499
> sec
> Running org.apache.hadoop.hbase.mapred.TestTableInputFormat
> Tests run: 10, Failures: 0, Errors: 0, Skipped: 0, Time elapsed: 93.147 sec
> Running
> org.apache.hadoop.hbase.backup.example.TestZooKeeperTableArchiveClient
> Tests run: 3, Failures: 0, Errors: 0, Skipped: 0, Time elapsed: 23.485 sec
> Running org.apache.hadoop.hbase.mapred.TestTableMapReduce
> Tests run: 1, Failures: 0, Errors: 0, Skipped: 0, Time elapsed: 154.69 sec
> Running org.apache.hadoop.hbase.fs.TestBlockReorder
> Tests run: 3, Failures: 0, Errors: 0, Skipped: 0, Time elapsed: 167.712 sec
> Running org.apache.hadoop.hbase.TestClusterBootOrder
> Tests run: 2, Failures: 0, Errors: 0, Skipped: 0, Time elapsed: 94.4 sec
> Running org.apache.hadoop.hbase.TestDrainingServer
> Tests run: 2, Failures: 0, Errors: 0, Skipped: 0, Time elapsed: 119.597 sec
> Running org.apache.hadoop.hbase.mapreduce.TestTimeRangeMapRed
> Tests run: 1, Failures: 0, Errors: 0, Skipped: 0, Time elapsed: 122.523 sec
> Running org.apache.hadoop.hbase.mapreduce.TestRowCounter
> Tests run: 3, Failures: 0, Errors: 0, Skipped: 0, Time elapsed: 244.263 sec
> Running org.apache.hadoop.hbase.mapreduce.TestSecureLoadIncrementalHFiles
> Tests run: 6, Failures: 0, Errors: 0, Skipped: 0, Time elapsed: 182.605 sec
> Running org.apache.hadoop.hbase.backup.TestHFileArchiving
> Tests run: 5, Failures: 1, Errors: 0, Skipped: 0, Time elapsed: 505.891
> sec <<< FAILURE!
> Running org.apache.hadoop.hbase.mapreduce.TestImportExport
> Tests run: 5, Failures: 0, Errors: 0, Skipped: 0, Time elapsed: 415.161 sec
> Running org.apache.hadoop.hbase.mapreduce.TestImportTsv
> Tests run: 13, Failures: 0, Errors: 0, Skipped: 0, Time elapsed: 768.058
> sec
> Running org.apache.hadoop.hbase.mapreduce.TestWALPlayer
> Tests run: 1, Failures: 0, Errors: 0, Skipped: 0, Time elapsed: 261.153 sec
> Running org.apache.hadoop.hbase.mapreduce.TestMultithreadedTableMapper
> Tests run: 1, Failures: 0, Errors: 0, Skipped: 0, Time elapsed: 333.873 sec
> Running
> org.apache.hadoop.hbase.mapreduce.TestLoadIncrementalHFilesSplitRecovery
> Tests run: 4, Failures: 0, Errors: 0, Skipped: 0, Time elapsed: 267.892 sec
> Running
> org.apache.hadoop.hbase.mapreduce.TestSecureLoadIncrementalHFilesSplitRecovery
> Tests run: 4, Failures: 0, Errors: 0, Skipped: 0, Time elapsed: 224.508 sec
> Running org.apache.hadoop.hbase.mapreduce.TestHLogRecordReader
> Tests run: 2, Failures: 0, Errors: 0, Skipped: 0, Time elapsed: 57.533 sec
> Running org.apache.hadoop.hbase.mapreduce.TestLoadIncrementalHFiles
> Tests run: 6, Failures: 0, Errors: 0, Skipped: 0, Time elapsed: 133.864 sec
> Running org.apache.hadoop.hbase.mapreduce.TestTableMapReduce
> Tests run: 2, Failures: 0, Errors: 0, Skipped: 0, Time elapsed: 325.025 sec
>
> Results :
>
> Failed tests:
> testDelete(org.apache.hadoop.hbase.master.TestTableLockManager)
>
> testMultiCohortWithMemberTimeoutDuringPrepare(org.apache.hadoop.hbase.procedure.TestZKProcedure):
> Operation error state was unexpected expected:<true> but was:<false>
>
> testArchiveOnTableDelete(org.apache.hadoop.hbase.backup.TestHFileArchiving):
> Archived files are missing some of the store files!
>
> Tests in error:
>
> testDelayedRpcImmediateReturnValue(org.apache.hadoop.hbase.ipc.TestDelayedRpc):
> Index: 0, Size: 0
>
> testOfflineSnapshotRegionOperationsIndependent(org.apache.hadoop.hbase.client.TestSnapshotCloneIndependence):
> Split did not increase the number of regions
>
> testMinorCompaction(org.apache.hadoop.hbase.regionserver.TestCompactionState):
> test timed out after 60000 milliseconds
>
> testMinorCompactionOnFamily(org.apache.hadoop.hbase.regionserver.TestCompactionState):
> test timed out after 60000 milliseconds
>
> testMajorCompaction(org.apache.hadoop.hbase.regionserver.TestCompactionState):
> test timed out after 60000 milliseconds
>
> testTableExistsIfTheSpecifiedTableRegionIsSplitParent(org.apache.hadoop.hbase.regionserver.TestSplitTransactionOnCluster):
> test timed out after 20000 milliseconds
>
> testShouldFailSplitIfZNodeDoesNotExistDueToPrevRollBack(org.apache.hadoop.hbase.regionserver.TestSplitTransactionOnCluster):
> test timed out after 20000 milliseconds
>
> Tests run: 1396, Failures: 3, Errors: 7, Skipped: 12
>
> [INFO]
> ------------------------------------------------------------------------
> [INFO] Reactor Summary:
> [INFO]
> [INFO] HBase ............................................. SUCCESS [5.535s]
> [INFO] HBase - Common .................................... SUCCESS
> [27.012s]
> [INFO] HBase - Protocol .................................. SUCCESS
> [16.372s]
> [INFO] HBase - Client .................................... SUCCESS
> [12.533s]
> [INFO] HBase - Prefix Tree ............................... SUCCESS [6.323s]
> [INFO] HBase - Hadoop Compatibility ...................... SUCCESS [1.279s]
> [INFO] HBase - Hadoop One Compatibility .................. SUCCESS [2.562s]
> [INFO] HBase - Server .................................... FAILURE
> [2:06:04.538s]
> [INFO] HBase - Integration Tests ......................... SKIPPED
> [INFO] HBase - Examples .................................. SKIPPED
> [INFO]
> ------------------------------------------------------------------------
> [INFO] BUILD FAILURE
> [INFO]
> ------------------------------------------------------------------------
> [INFO] Total time: 2:07:17.807s
> [INFO] Finished at: Wed Mar 13 17:42:19 UTC 2013
> [INFO] Final Memory: 71M/861M
> [INFO]
> ------------------------------------------------------------------------
> [ERROR] Failed to execute goal
> org.apache.maven.plugins:maven-surefire-plugin:2.12-TRUNK-HBASE-2:test
> (secondPartTestsExecution) on project hbase-server: Failure or timeout ->
> [Help 1]
> [ERROR]
> [ERROR] To see the full stack trace of the errors, re-run Maven with the
> -e switch.
> [ERROR] Re-run Maven using the -X switch to enable full debug logging.
> [ERROR]
> [ERROR] For more information about the errors and possible solutions,
> please read the following articles:
> [ERROR] [Help 1]
> http://cwiki.apache.org/confluence/display/MAVEN/MojoExecutionException
> [ERROR]
> [ERROR] After correcting the problems, you can resume the build with the
> command
> [ERROR] mvn <goals> -rf :hbase-server
> Build step 'Invoke top-level Maven targets' marked build as failure
> Archiving artifacts
> Recording test results
> Updating HBASE-8012
> Updating HBASE-8066
> Updating HBASE-8063
>