You are viewing a plain text version of this content. The canonical link for it is here.
Posted to dev@kafka.apache.org by Apache Jenkins Server <je...@builds.apache.org> on 2016/03/15 22:01:45 UTC

Build failed in Jenkins: kafka-trunk-jdk8 #445

See <https://builds.apache.org/job/kafka-trunk-jdk8/445/changes>

Changes:

[wangguoz] MINOR: kstream/ktable counting method with default long serdes

[wangguoz] MINOR: Add test that verifies fix for KAFKA-3047

[me] MINOR: Remove unused import in `WordCountJob` to fix checkstyle failure

------------------------------------------
Started by an SCM change
Started by an SCM change
[EnvInject] - Loading node environment variables.
Building remotely on ubuntu-us1 (Ubuntu ubuntu ubuntu-us golang-ppa) in workspace <https://builds.apache.org/job/kafka-trunk-jdk8/ws/>
 > git rev-parse --is-inside-work-tree # timeout=10
Fetching changes from the remote Git repository
 > git config remote.origin.url https://git-wip-us.apache.org/repos/asf/kafka.git # timeout=10
Fetching upstream changes from https://git-wip-us.apache.org/repos/asf/kafka.git
 > git --version # timeout=10
 > git -c core.askpass=true fetch --tags --progress https://git-wip-us.apache.org/repos/asf/kafka.git +refs/heads/*:refs/remotes/origin/*
 > git rev-parse refs/remotes/origin/trunk^{commit} # timeout=10
 > git rev-parse refs/remotes/origin/origin/trunk^{commit} # timeout=10
Checking out Revision fd6efbe0b7f18beb506f112350b30b7209a2f5cc (refs/remotes/origin/trunk)
 > git config core.sparsecheckout # timeout=10
 > git checkout -f fd6efbe0b7f18beb506f112350b30b7209a2f5cc
 > git rev-list 951e30adc6d4a0ed37dcc3fde0050ca5faff146d # timeout=10
Setting JDK1_8_0_45_HOME=/home/jenkins/jenkins-slave/tools/hudson.model.JDK/jdk1.8.0_45
Setting GRADLE_2_4_RC_2_HOME=/home/jenkins/jenkins-slave/tools/hudson.plugins.gradle.GradleInstallation/Gradle_2.4-rc-2
[kafka-trunk-jdk8] $ /bin/bash -xe /tmp/hudson1837881408554585785.sh
+ /home/jenkins/jenkins-slave/tools/hudson.plugins.gradle.GradleInstallation/Gradle_2.4-rc-2/bin/gradle
To honour the JVM settings for this build a new JVM will be forked. Please consider using the daemon: http://gradle.org/docs/2.4-rc-2/userguide/gradle_daemon.html.
Building project 'core' with Scala version 2.10.6
:downloadWrapper

BUILD SUCCESSFUL

Total time: 14.089 secs
Setting JDK1_8_0_45_HOME=/home/jenkins/jenkins-slave/tools/hudson.model.JDK/jdk1.8.0_45
Setting GRADLE_2_4_RC_2_HOME=/home/jenkins/jenkins-slave/tools/hudson.plugins.gradle.GradleInstallation/Gradle_2.4-rc-2
[kafka-trunk-jdk8] $ /bin/bash -xe /tmp/hudson5877046584320792721.sh
+ export GRADLE_OPTS=-Xmx1024m
+ GRADLE_OPTS=-Xmx1024m
+ ./gradlew -Dorg.gradle.project.maxParallelForks=1 clean jarAll testAll
To honour the JVM settings for this build a new JVM will be forked. Please consider using the daemon: https://docs.gradle.org/2.11/userguide/gradle_daemon.html.
Building project 'core' with Scala version 2.10.6
:clean UP-TO-DATE
:clients:clean UP-TO-DATE
:connect:clean UP-TO-DATE
:core:clean UP-TO-DATE
:examples:clean UP-TO-DATE
:log4j-appender:clean UP-TO-DATE
:streams:clean UP-TO-DATE
:tools:clean UP-TO-DATE
:connect:api:clean UP-TO-DATE
:connect:file:clean UP-TO-DATE
:connect:json:clean UP-TO-DATE
:connect:runtime:clean UP-TO-DATE
:streams:examples:clean UP-TO-DATE
:jar_core_2_10
Building project 'core' with Scala version 2.10.6
:kafka-trunk-jdk8:clients:compileJava
:jar_core_2_10 FAILED

FAILURE: Build failed with an exception.

* What went wrong:
Failed to capture snapshot of input files for task 'compileJava' during up-to-date check.
> Could not add entry '/home/jenkins/.gradle/caches/modules-2/files-2.1/org.slf4j/slf4j-api/1.7.18/b631d286463ced7cc42ee2171fe3beaed2836823/slf4j-api-1.7.18.jar' to cache fileHashes.bin (<https://builds.apache.org/job/kafka-trunk-jdk8/ws/.gradle/2.11/taskArtifacts/fileHashes.bin).>

* Try:
Run with --stacktrace option to get the stack trace. Run with --info or --debug option to get more log output.

BUILD FAILED

Total time: 11.882 secs
Build step 'Execute shell' marked build as failure
Recording test results
Setting JDK1_8_0_45_HOME=/home/jenkins/jenkins-slave/tools/hudson.model.JDK/jdk1.8.0_45
Setting GRADLE_2_4_RC_2_HOME=/home/jenkins/jenkins-slave/tools/hudson.plugins.gradle.GradleInstallation/Gradle_2.4-rc-2
ERROR: Step ‘Publish JUnit test result report’ failed: No test report files were found. Configuration error?
Setting JDK1_8_0_45_HOME=/home/jenkins/jenkins-slave/tools/hudson.model.JDK/jdk1.8.0_45
Setting GRADLE_2_4_RC_2_HOME=/home/jenkins/jenkins-slave/tools/hudson.plugins.gradle.GradleInstallation/Gradle_2.4-rc-2

Jenkins build is back to normal : kafka-trunk-jdk8 #449

Posted by Apache Jenkins Server <je...@builds.apache.org>.
See <https://builds.apache.org/job/kafka-trunk-jdk8/449/changes>


Build failed in Jenkins: kafka-trunk-jdk8 #448

Posted by Apache Jenkins Server <je...@builds.apache.org>.
See <https://builds.apache.org/job/kafka-trunk-jdk8/448/changes>

Changes:

[cshapi] KAFKA-3403: Upgrade ZkClient to 0.8

[cshapi] KAFKA-3402; Restore behaviour of MetadataCache.getTopicMetadata when

------------------------------------------
Started by an SCM change
Started by an SCM change
[EnvInject] - Loading node environment variables.
Building remotely on ubuntu-us1 (Ubuntu ubuntu ubuntu-us golang-ppa) in workspace <https://builds.apache.org/job/kafka-trunk-jdk8/ws/>
 > git rev-parse --is-inside-work-tree # timeout=10
Fetching changes from the remote Git repository
 > git config remote.origin.url https://git-wip-us.apache.org/repos/asf/kafka.git # timeout=10
Fetching upstream changes from https://git-wip-us.apache.org/repos/asf/kafka.git
 > git --version # timeout=10
 > git -c core.askpass=true fetch --tags --progress https://git-wip-us.apache.org/repos/asf/kafka.git +refs/heads/*:refs/remotes/origin/*
 > git rev-parse refs/remotes/origin/trunk^{commit} # timeout=10
 > git rev-parse refs/remotes/origin/origin/trunk^{commit} # timeout=10
Checking out Revision 858047a12ba3a7d426178c63226dd2c7509f20dd (refs/remotes/origin/trunk)
 > git config core.sparsecheckout # timeout=10
 > git checkout -f 858047a12ba3a7d426178c63226dd2c7509f20dd
 > git rev-list b0f811804fb818792dfc55298bd11eacd19dec5c # timeout=10
Setting JDK1_8_0_45_HOME=/home/jenkins/jenkins-slave/tools/hudson.model.JDK/jdk1.8.0_45
Setting GRADLE_2_4_RC_2_HOME=/home/jenkins/jenkins-slave/tools/hudson.plugins.gradle.GradleInstallation/Gradle_2.4-rc-2
[kafka-trunk-jdk8] $ /bin/bash -xe /tmp/hudson1744178789252999144.sh
+ /home/jenkins/jenkins-slave/tools/hudson.plugins.gradle.GradleInstallation/Gradle_2.4-rc-2/bin/gradle
To honour the JVM settings for this build a new JVM will be forked. Please consider using the daemon: http://gradle.org/docs/2.4-rc-2/userguide/gradle_daemon.html.
Building project 'core' with Scala version 2.10.6
:downloadWrapper

BUILD SUCCESSFUL

Total time: 14.814 secs
Setting JDK1_8_0_45_HOME=/home/jenkins/jenkins-slave/tools/hudson.model.JDK/jdk1.8.0_45
Setting GRADLE_2_4_RC_2_HOME=/home/jenkins/jenkins-slave/tools/hudson.plugins.gradle.GradleInstallation/Gradle_2.4-rc-2
[kafka-trunk-jdk8] $ /bin/bash -xe /tmp/hudson771502297759596952.sh
+ export GRADLE_OPTS=-Xmx1024m
+ GRADLE_OPTS=-Xmx1024m
+ ./gradlew -Dorg.gradle.project.maxParallelForks=1 clean jarAll testAll
To honour the JVM settings for this build a new JVM will be forked. Please consider using the daemon: https://docs.gradle.org/2.11/userguide/gradle_daemon.html.
Building project 'core' with Scala version 2.10.6
:clean UP-TO-DATE
:clients:clean UP-TO-DATE
:connect:clean UP-TO-DATE
:core:clean UP-TO-DATE
:examples:clean UP-TO-DATE
:log4j-appender:clean UP-TO-DATE
:streams:clean UP-TO-DATE
:tools:clean UP-TO-DATE
:connect:api:clean UP-TO-DATE
:connect:file:clean UP-TO-DATE
:connect:json:clean UP-TO-DATE
:connect:runtime:clean UP-TO-DATE
:streams:examples:clean UP-TO-DATE
:jar_core_2_10
Building project 'core' with Scala version 2.10.6
:kafka-trunk-jdk8:clients:compileJava
:jar_core_2_10 FAILED

FAILURE: Build failed with an exception.

* What went wrong:
Failed to capture snapshot of input files for task 'compileJava' during up-to-date check.
> Could not add entry '/home/jenkins/.gradle/caches/modules-2/files-2.1/org.slf4j/slf4j-api/1.7.18/b631d286463ced7cc42ee2171fe3beaed2836823/slf4j-api-1.7.18.jar' to cache fileHashes.bin (<https://builds.apache.org/job/kafka-trunk-jdk8/ws/.gradle/2.11/taskArtifacts/fileHashes.bin).>

* Try:
Run with --stacktrace option to get the stack trace. Run with --info or --debug option to get more log output.

BUILD FAILED

Total time: 12.864 secs
Build step 'Execute shell' marked build as failure
Recording test results
Setting JDK1_8_0_45_HOME=/home/jenkins/jenkins-slave/tools/hudson.model.JDK/jdk1.8.0_45
Setting GRADLE_2_4_RC_2_HOME=/home/jenkins/jenkins-slave/tools/hudson.plugins.gradle.GradleInstallation/Gradle_2.4-rc-2
ERROR: Step ‘Publish JUnit test result report’ failed: No test report files were found. Configuration error?
Setting JDK1_8_0_45_HOME=/home/jenkins/jenkins-slave/tools/hudson.model.JDK/jdk1.8.0_45
Setting GRADLE_2_4_RC_2_HOME=/home/jenkins/jenkins-slave/tools/hudson.plugins.gradle.GradleInstallation/Gradle_2.4-rc-2

Build failed in Jenkins: kafka-trunk-jdk8 #447

Posted by Apache Jenkins Server <je...@builds.apache.org>.
See <https://builds.apache.org/job/kafka-trunk-jdk8/447/changes>

Changes:

[me] MINOR: KAFKA-3260 follow up, fix commitRecord calls in tests

[me] KAFKA-3371: ClientCompatibilityTest system test failing

------------------------------------------
[...truncated 3701 lines...]

org.apache.kafka.clients.NetworkClientTest > testClose PASSED

org.apache.kafka.clients.NetworkClientTest > testLeastLoadedNode PASSED

org.apache.kafka.clients.NetworkClientTest > testConnectionDelayConnected PASSED

org.apache.kafka.clients.NetworkClientTest > testRequestTimeout PASSED

org.apache.kafka.clients.NetworkClientTest > testSimpleRequestResponseWithStaticNodes PASSED

org.apache.kafka.clients.NetworkClientTest > testConnectionDelay PASSED

org.apache.kafka.clients.NetworkClientTest > testSendToUnreadyNode PASSED

org.apache.kafka.clients.NetworkClientTest > testConnectionDelayDisconnected PASSED

org.apache.kafka.clients.MetadataTest > testListenerCanUnregister PASSED

org.apache.kafka.clients.MetadataTest > testFailedUpdate PASSED

org.apache.kafka.clients.MetadataTest > testMetadataUpdateWaitTime PASSED

org.apache.kafka.clients.MetadataTest > testUpdateWithNeedMetadataForAllTopics PASSED

org.apache.kafka.clients.MetadataTest > testMetadata PASSED

org.apache.kafka.clients.MetadataTest > testListenerGetsNotifiedOfUpdate PASSED

org.apache.kafka.common.SerializeCompatibilityTopicPartitionTest > testSerializationRoundtrip PASSED

org.apache.kafka.common.SerializeCompatibilityTopicPartitionTest > testTopiPartitionSerializationCompatibility PASSED

org.apache.kafka.common.serialization.SerializationTest > testStringSerializer PASSED

org.apache.kafka.common.serialization.SerializationTest > testIntegerSerializer PASSED

org.apache.kafka.common.serialization.SerializationTest > testByteBufferSerializer PASSED

org.apache.kafka.common.config.AbstractConfigTest > testOriginalsWithPrefix PASSED

org.apache.kafka.common.config.AbstractConfigTest > testConfiguredInstances PASSED

org.apache.kafka.common.config.ConfigDefTest > testBasicTypes PASSED

org.apache.kafka.common.config.ConfigDefTest > testNullDefault PASSED

org.apache.kafka.common.config.ConfigDefTest > testInvalidDefaultRange PASSED

org.apache.kafka.common.config.ConfigDefTest > testValidators PASSED

org.apache.kafka.common.config.ConfigDefTest > testInvalidDefaultString PASSED

org.apache.kafka.common.config.ConfigDefTest > testSslPasswords PASSED

org.apache.kafka.common.config.ConfigDefTest > testInvalidDefault PASSED

org.apache.kafka.common.config.ConfigDefTest > testMissingRequired PASSED

org.apache.kafka.common.config.ConfigDefTest > testNullDefaultWithValidator PASSED

org.apache.kafka.common.config.ConfigDefTest > testDefinedTwice PASSED

org.apache.kafka.common.config.ConfigDefTest > testBadInputs PASSED

org.apache.kafka.common.protocol.ErrorsTest > testForExceptionDefault PASSED

org.apache.kafka.common.protocol.ErrorsTest > testUniqueExceptions PASSED

org.apache.kafka.common.protocol.ErrorsTest > testForExceptionInheritance PASSED

org.apache.kafka.common.protocol.ErrorsTest > testNoneException PASSED

org.apache.kafka.common.protocol.ErrorsTest > testUniqueErrorCodes PASSED

org.apache.kafka.common.protocol.ErrorsTest > testExceptionsAreNotGeneric PASSED

org.apache.kafka.common.protocol.ApiKeysTest > testForIdWithInvalidIdLow PASSED

org.apache.kafka.common.protocol.ApiKeysTest > testForIdWithInvalidIdHigh PASSED

org.apache.kafka.common.protocol.ProtoUtilsTest > schemaVersionOutOfRange PASSED

org.apache.kafka.common.protocol.types.ProtocolSerializationTest > testArray PASSED

org.apache.kafka.common.protocol.types.ProtocolSerializationTest > testNulls PASSED

org.apache.kafka.common.protocol.types.ProtocolSerializationTest > testNullableDefault PASSED

org.apache.kafka.common.protocol.types.ProtocolSerializationTest > testDefault PASSED

org.apache.kafka.common.protocol.types.ProtocolSerializationTest > testSimple PASSED

org.apache.kafka.common.requests.RequestResponseTest > testSerialization PASSED

org.apache.kafka.common.requests.RequestResponseTest > fetchResponseVersionTest PASSED

org.apache.kafka.common.requests.RequestResponseTest > produceResponseVersionTest PASSED

org.apache.kafka.common.requests.RequestResponseTest > testControlledShutdownResponse PASSED

org.apache.kafka.common.requests.RequestResponseTest > testRequestHeaderWithNullClientId PASSED

org.apache.kafka.common.security.auth.KafkaPrincipalTest > testPrincipalNameCanContainSeparator PASSED

org.apache.kafka.common.security.auth.KafkaPrincipalTest > testEqualsAndHashCode PASSED

org.apache.kafka.common.security.kerberos.KerberosNameTest > testParse PASSED

org.apache.kafka.common.security.ssl.SslFactoryTest > testClientMode PASSED

org.apache.kafka.common.security.ssl.SslFactoryTest > testSslFactoryConfiguration PASSED

org.apache.kafka.common.metrics.MetricsTest > testSimpleStats PASSED

org.apache.kafka.common.metrics.MetricsTest > testOldDataHasNoEffect PASSED

org.apache.kafka.common.metrics.MetricsTest > testQuotasEquality PASSED

org.apache.kafka.common.metrics.MetricsTest > testRemoveInactiveMetrics PASSED

org.apache.kafka.common.metrics.MetricsTest > testMetricName PASSED

org.apache.kafka.common.metrics.MetricsTest > testRateWindowing PASSED

org.apache.kafka.common.metrics.MetricsTest > testTimeWindowing PASSED

org.apache.kafka.common.metrics.MetricsTest > testEventWindowing PASSED

org.apache.kafka.common.metrics.MetricsTest > testRemoveMetric PASSED

org.apache.kafka.common.metrics.MetricsTest > testBadSensorHierarchy PASSED

org.apache.kafka.common.metrics.MetricsTest > testRemoveSensor PASSED

org.apache.kafka.common.metrics.MetricsTest > testPercentiles PASSED

org.apache.kafka.common.metrics.MetricsTest > testDuplicateMetricName PASSED

org.apache.kafka.common.metrics.MetricsTest > testQuotas PASSED

org.apache.kafka.common.metrics.MetricsTest > testHierarchicalSensors PASSED

org.apache.kafka.common.metrics.JmxReporterTest > testJmxRegistration PASSED

org.apache.kafka.common.metrics.stats.HistogramTest > testHistogram PASSED

org.apache.kafka.common.metrics.stats.HistogramTest > testConstantBinScheme PASSED

org.apache.kafka.common.metrics.stats.HistogramTest > testLinearBinScheme PASSED

org.apache.kafka.common.utils.CrcTest > testUpdateInt PASSED

org.apache.kafka.common.utils.CrcTest > testUpdate PASSED

org.apache.kafka.common.utils.UtilsTest > testAbs PASSED

org.apache.kafka.common.utils.UtilsTest > testMin PASSED

org.apache.kafka.common.utils.UtilsTest > testJoin PASSED

org.apache.kafka.common.utils.UtilsTest > testReadBytes PASSED

org.apache.kafka.common.utils.UtilsTest > testGetHost PASSED

org.apache.kafka.common.utils.UtilsTest > testGetPort PASSED

org.apache.kafka.common.utils.UtilsTest > testFormatAddress PASSED

org.apache.kafka.common.utils.AbstractIteratorTest > testEmptyIterator PASSED

org.apache.kafka.common.utils.AbstractIteratorTest > testIterator PASSED

org.apache.kafka.common.ClusterTest > testBootstrap PASSED

org.apache.kafka.common.cache.LRUCacheTest > testEviction PASSED

org.apache.kafka.common.cache.LRUCacheTest > testPutGet PASSED

org.apache.kafka.common.cache.LRUCacheTest > testRemove PASSED

org.apache.kafka.common.network.SslTransportLayerTest > testClientAuthenticationRequestedValidProvided PASSED

org.apache.kafka.common.network.SslTransportLayerTest > testUnsupportedCiphers PASSED

org.apache.kafka.common.network.SslTransportLayerTest > testUnsupportedTLSVersion PASSED

org.apache.kafka.common.network.SslTransportLayerTest > testClientAuthenticationRequiredNotProvided PASSED

org.apache.kafka.common.network.SslTransportLayerTest > testClientAuthenticationRequestedNotProvided PASSED

org.apache.kafka.common.network.SslTransportLayerTest > testInvalidKeystorePassword PASSED

org.apache.kafka.common.network.SslTransportLayerTest > testClientAuthenticationDisabledNotProvided PASSED

org.apache.kafka.common.network.SslTransportLayerTest > testInvalidEndpointIdentification PASSED

org.apache.kafka.common.network.SslTransportLayerTest > testEndpointIdentificationDisabled PASSED

org.apache.kafka.common.network.SslTransportLayerTest > testClientAuthenticationRequiredUntrustedProvided PASSED

org.apache.kafka.common.network.SslTransportLayerTest > testClientAuthenticationDisabledUntrustedProvided PASSED

org.apache.kafka.common.network.SslTransportLayerTest > testNetReadBufferResize PASSED

org.apache.kafka.common.network.SslTransportLayerTest > testNetWriteBufferResize PASSED

org.apache.kafka.common.network.SslTransportLayerTest > testInvalidTruststorePassword PASSED

org.apache.kafka.common.network.SslTransportLayerTest > testApplicationBufferResize PASSED

org.apache.kafka.common.network.SslTransportLayerTest > testClientAuthenticationRequiredValidProvided PASSED

org.apache.kafka.common.network.SslTransportLayerTest > testInvalidKeyPassword PASSED

org.apache.kafka.common.network.SslTransportLayerTest > testValidEndpointIdentification PASSED

org.apache.kafka.common.network.SelectorTest > testSendLargeRequest PASSED

org.apache.kafka.common.network.SelectorTest > testLargeMessageSequence PASSED

org.apache.kafka.common.network.SelectorTest > testMute PASSED

org.apache.kafka.common.network.SelectorTest > testCantSendWithInProgress PASSED

org.apache.kafka.common.network.SelectorTest > testExistingConnectionId PASSED

org.apache.kafka.common.network.SelectorTest > testCantSendWithoutConnecting PASSED

org.apache.kafka.common.network.SelectorTest > testCloseOldestConnection PASSED

org.apache.kafka.common.network.SelectorTest > testServerDisconnect PASSED

org.apache.kafka.common.network.SelectorTest > testNoRouteToHost PASSED

org.apache.kafka.common.network.SelectorTest > testNormalOperation PASSED

org.apache.kafka.common.network.SelectorTest > testConnectionRefused PASSED

org.apache.kafka.common.network.SelectorTest > testEmptyRequest PASSED

org.apache.kafka.common.network.SslSelectorTest > testDisabledRenegotiation PASSED
Build timed out (after 120 minutes). Marking the build as failed.
Build was aborted
Recording test results
Setting JDK1_8_0_45_HOME=/home/jenkins/jenkins-slave/tools/hudson.model.JDK/jdk1.8.0_45
Setting GRADLE_2_4_RC_2_HOME=/home/jenkins/jenkins-slave/tools/hudson.plugins.gradle.GradleInstallation/Gradle_2.4-rc-2
Setting JDK1_8_0_45_HOME=/home/jenkins/jenkins-slave/tools/hudson.model.JDK/jdk1.8.0_45
Setting GRADLE_2_4_RC_2_HOME=/home/jenkins/jenkins-slave/tools/hudson.plugins.gradle.GradleInstallation/Gradle_2.4-rc-2

Build failed in Jenkins: kafka-trunk-jdk8 #446

Posted by Apache Jenkins Server <je...@builds.apache.org>.
See <https://builds.apache.org/job/kafka-trunk-jdk8/446/changes>

Changes:

[me] KAFKA-3260 - Added SourceTask.commitRecord

------------------------------------------
[...truncated 4940 lines...]

org.apache.kafka.common.record.RecordTest > testFields[168] PASSED

org.apache.kafka.common.record.RecordTest > testChecksum[169] PASSED

org.apache.kafka.common.record.RecordTest > testEquality[169] PASSED

org.apache.kafka.common.record.RecordTest > testFields[169] PASSED

org.apache.kafka.common.record.RecordTest > testChecksum[170] PASSED

org.apache.kafka.common.record.RecordTest > testEquality[170] PASSED

org.apache.kafka.common.record.RecordTest > testFields[170] PASSED

org.apache.kafka.common.record.RecordTest > testChecksum[171] PASSED

org.apache.kafka.common.record.RecordTest > testEquality[171] PASSED

org.apache.kafka.common.record.RecordTest > testFields[171] PASSED

org.apache.kafka.common.record.RecordTest > testChecksum[172] PASSED

org.apache.kafka.common.record.RecordTest > testEquality[172] PASSED

org.apache.kafka.common.record.RecordTest > testFields[172] PASSED

org.apache.kafka.common.record.RecordTest > testChecksum[173] PASSED

org.apache.kafka.common.record.RecordTest > testEquality[173] PASSED

org.apache.kafka.common.record.RecordTest > testFields[173] PASSED

org.apache.kafka.common.record.RecordTest > testChecksum[174] PASSED

org.apache.kafka.common.record.RecordTest > testEquality[174] PASSED

org.apache.kafka.common.record.RecordTest > testFields[174] PASSED

org.apache.kafka.common.record.RecordTest > testChecksum[175] PASSED

org.apache.kafka.common.record.RecordTest > testEquality[175] PASSED

org.apache.kafka.common.record.RecordTest > testFields[175] PASSED

org.apache.kafka.common.record.RecordTest > testChecksum[176] PASSED

org.apache.kafka.common.record.RecordTest > testEquality[176] PASSED

org.apache.kafka.common.record.RecordTest > testFields[176] PASSED

org.apache.kafka.common.record.RecordTest > testChecksum[177] PASSED

org.apache.kafka.common.record.RecordTest > testEquality[177] PASSED

org.apache.kafka.common.record.RecordTest > testFields[177] PASSED

org.apache.kafka.common.record.RecordTest > testChecksum[178] PASSED

org.apache.kafka.common.record.RecordTest > testEquality[178] PASSED

org.apache.kafka.common.record.RecordTest > testFields[178] PASSED

org.apache.kafka.common.record.RecordTest > testChecksum[179] PASSED

org.apache.kafka.common.record.RecordTest > testEquality[179] PASSED

org.apache.kafka.common.record.RecordTest > testFields[179] PASSED

org.apache.kafka.common.record.RecordTest > testChecksum[180] PASSED

org.apache.kafka.common.record.RecordTest > testEquality[180] PASSED

org.apache.kafka.common.record.RecordTest > testFields[180] PASSED

org.apache.kafka.common.record.RecordTest > testChecksum[181] PASSED

org.apache.kafka.common.record.RecordTest > testEquality[181] PASSED

org.apache.kafka.common.record.RecordTest > testFields[181] PASSED

org.apache.kafka.common.record.RecordTest > testChecksum[182] PASSED

org.apache.kafka.common.record.RecordTest > testEquality[182] PASSED

org.apache.kafka.common.record.RecordTest > testFields[182] PASSED

org.apache.kafka.common.record.RecordTest > testChecksum[183] PASSED

org.apache.kafka.common.record.RecordTest > testEquality[183] PASSED

org.apache.kafka.common.record.RecordTest > testFields[183] PASSED

org.apache.kafka.common.record.RecordTest > testChecksum[184] PASSED

org.apache.kafka.common.record.RecordTest > testEquality[184] PASSED

org.apache.kafka.common.record.RecordTest > testFields[184] PASSED

org.apache.kafka.common.record.RecordTest > testChecksum[185] PASSED

org.apache.kafka.common.record.RecordTest > testEquality[185] PASSED

org.apache.kafka.common.record.RecordTest > testFields[185] PASSED

org.apache.kafka.common.record.RecordTest > testChecksum[186] PASSED

org.apache.kafka.common.record.RecordTest > testEquality[186] PASSED

org.apache.kafka.common.record.RecordTest > testFields[186] PASSED

org.apache.kafka.common.record.RecordTest > testChecksum[187] PASSED

org.apache.kafka.common.record.RecordTest > testEquality[187] PASSED

org.apache.kafka.common.record.RecordTest > testFields[187] PASSED

org.apache.kafka.common.record.RecordTest > testChecksum[188] PASSED

org.apache.kafka.common.record.RecordTest > testEquality[188] PASSED

org.apache.kafka.common.record.RecordTest > testFields[188] PASSED

org.apache.kafka.common.record.RecordTest > testChecksum[189] PASSED

org.apache.kafka.common.record.RecordTest > testEquality[189] PASSED

org.apache.kafka.common.record.RecordTest > testFields[189] PASSED

org.apache.kafka.common.record.RecordTest > testChecksum[190] PASSED

org.apache.kafka.common.record.RecordTest > testEquality[190] PASSED

org.apache.kafka.common.record.RecordTest > testFields[190] PASSED

org.apache.kafka.common.record.RecordTest > testChecksum[191] PASSED

org.apache.kafka.common.record.RecordTest > testEquality[191] PASSED

org.apache.kafka.common.record.RecordTest > testFields[191] PASSED

org.apache.kafka.common.record.MemoryRecordsTest > testIterator[0] PASSED

org.apache.kafka.common.record.MemoryRecordsTest > testIterator[1] PASSED

org.apache.kafka.common.record.MemoryRecordsTest > testIterator[2] PASSED

org.apache.kafka.common.record.MemoryRecordsTest > testIterator[3] PASSED

org.apache.kafka.common.serialization.SerializationTest > testStringSerializer PASSED

org.apache.kafka.common.serialization.SerializationTest > testIntegerSerializer PASSED

org.apache.kafka.common.serialization.SerializationTest > testByteBufferSerializer PASSED

org.apache.kafka.common.config.ConfigDefTest > testBasicTypes PASSED

org.apache.kafka.common.config.ConfigDefTest > testNullDefault PASSED

org.apache.kafka.common.config.ConfigDefTest > testInvalidDefaultRange PASSED

org.apache.kafka.common.config.ConfigDefTest > testValidators PASSED

org.apache.kafka.common.config.ConfigDefTest > testInvalidDefaultString PASSED

org.apache.kafka.common.config.ConfigDefTest > testSslPasswords PASSED

org.apache.kafka.common.config.ConfigDefTest > testInvalidDefault PASSED

org.apache.kafka.common.config.ConfigDefTest > testMissingRequired PASSED

org.apache.kafka.common.config.ConfigDefTest > testNullDefaultWithValidator PASSED

org.apache.kafka.common.config.ConfigDefTest > testDefinedTwice PASSED

org.apache.kafka.common.config.ConfigDefTest > testBadInputs PASSED

org.apache.kafka.common.config.AbstractConfigTest > testOriginalsWithPrefix PASSED

org.apache.kafka.common.config.AbstractConfigTest > testConfiguredInstances PASSED

org.apache.kafka.common.security.auth.KafkaPrincipalTest > testPrincipalNameCanContainSeparator PASSED

org.apache.kafka.common.security.auth.KafkaPrincipalTest > testEqualsAndHashCode PASSED

org.apache.kafka.common.security.kerberos.KerberosNameTest > testParse PASSED

org.apache.kafka.common.security.ssl.SslFactoryTest > testClientMode PASSED

org.apache.kafka.common.security.ssl.SslFactoryTest > testSslFactoryConfiguration PASSED
:examples:checkstyleMain
:examples:compileTestJava UP-TO-DATE
:examples:processTestResources UP-TO-DATE
:examples:testClasses UP-TO-DATE
:examples:checkstyleTest UP-TO-DATE
:examples:test UP-TO-DATE
:log4j-appender:checkstyleMain
:log4j-appender:compileTestJavawarning: [options] bootstrap class path not set in conjunction with -source 1.7
1 warning

:log4j-appender:processTestResources UP-TO-DATE
:log4j-appender:testClasses
:log4j-appender:checkstyleTest
:log4j-appender:test

org.apache.kafka.log4jappender.KafkaLog4jAppenderTest > testLog4jAppends PASSED

org.apache.kafka.log4jappender.KafkaLog4jAppenderTest > testKafkaLog4jConfigs PASSED
:streams:checkstyleMain
:streams:compileTestJavawarning: [options] bootstrap class path not set in conjunction with -source 1.7
Note: Some input files use unchecked or unsafe operations.
Note: Recompile with -Xlint:unchecked for details.
1 warning

:streams:processTestResources UP-TO-DATE
:streams:testClasses
:streams:checkstyleTest
:streams:test

org.apache.kafka.streams.state.internals.StoreChangeLoggerTest > testRaw PASSED

org.apache.kafka.streams.state.internals.StoreChangeLoggerTest > testAddRemove PASSED

org.apache.kafka.streams.state.internals.InMemoryLRUCacheStoreTest > testEvict PASSED

org.apache.kafka.streams.state.internals.InMemoryLRUCacheStoreTest > testPutIfAbsent PASSED

org.apache.kafka.streams.state.internals.InMemoryLRUCacheStoreTest > testRestoreWithDefaultSerdes PASSED

org.apache.kafka.streams.state.internals.InMemoryLRUCacheStoreTest > testRestore PASSED

org.apache.kafka.streams.state.internals.InMemoryLRUCacheStoreTest > testPutGetRange PASSED

org.apache.kafka.streams.state.internals.InMemoryLRUCacheStoreTest > testPutGetRangeWithDefaultSerdes PASSED

org.apache.kafka.streams.state.internals.RocksDBKeyValueStoreTest > testPutIfAbsent PASSED

org.apache.kafka.streams.state.internals.RocksDBKeyValueStoreTest > testRestoreWithDefaultSerdes PASSED

org.apache.kafka.streams.state.internals.RocksDBKeyValueStoreTest > testRestore PASSED

org.apache.kafka.streams.state.internals.RocksDBKeyValueStoreTest > testPutGetRange PASSED
Build timed out (after 120 minutes). Marking the build as failed.
Build was aborted
Recording test results
Setting JDK1_8_0_45_HOME=/home/jenkins/jenkins-slave/tools/hudson.model.JDK/jdk1.8.0_45
Setting GRADLE_2_4_RC_2_HOME=/home/jenkins/jenkins-slave/tools/hudson.plugins.gradle.GradleInstallation/Gradle_2.4-rc-2
Setting JDK1_8_0_45_HOME=/home/jenkins/jenkins-slave/tools/hudson.model.JDK/jdk1.8.0_45
Setting GRADLE_2_4_RC_2_HOME=/home/jenkins/jenkins-slave/tools/hudson.plugins.gradle.GradleInstallation/Gradle_2.4-rc-2