You are viewing a plain text version of this content. The canonical link for it is here.
Posted to builds@solr.apache.org by Apache Jenkins Server <je...@builds.apache.org> on 2022/06/17 15:09:00 UTC

[JENKINS] Solr » Solr-Check-9.x - Build # 1307 - Unstable!

Build: https://ci-builds.apache.org/job/Solr/job/Solr-Check-9.x/1307/

1 tests failed.
FAILED:  org.apache.solr.client.solrj.impl.CloudHttp2SolrClientBuilderTest.classMethod

Error Message:
com.carrotsearch.randomizedtesting.ThreadLeakError: 1 thread leaked from SUITE scope at org.apache.solr.client.solrj.impl.CloudHttp2SolrClientBuilderTest: 
   1) Thread[id=4321, name=h2sc-2548-thread-1, state=RUNNABLE, group=TGRP-CloudHttp2SolrClientBuilderTest]
        at java.base@11.0.12/jdk.internal.misc.Unsafe.unpark(Native Method)
        at java.base@11.0.12/java.util.concurrent.locks.LockSupport.unpark(LockSupport.java:160)
        at java.base@11.0.12/java.util.concurrent.locks.AbstractQueuedSynchronizer.unparkSuccessor(AbstractQueuedSynchronizer.java:709)
        at java.base@11.0.12/java.util.concurrent.locks.AbstractQueuedSynchronizer.release(AbstractQueuedSynchronizer.java:1305)
        at java.base@11.0.12/java.util.concurrent.locks.ReentrantLock.unlock(ReentrantLock.java:439)
        at java.base@11.0.12/java.util.concurrent.ThreadPoolExecutor.tryTerminate(ThreadPoolExecutor.java:726)
        at java.base@11.0.12/java.util.concurrent.ThreadPoolExecutor.processWorkerExit(ThreadPoolExecutor.java:994)
        at java.base@11.0.12/java.util.concurrent.ThreadPoolExecutor.runWorker(ThreadPoolExecutor.java:1142)
        at java.base@11.0.12/java.util.concurrent.ThreadPoolExecutor$Worker.run(ThreadPoolExecutor.java:628)
        at java.base@11.0.12/java.lang.Thread.run(Thread.java:834)

Stack Trace:
com.carrotsearch.randomizedtesting.ThreadLeakError: 1 thread leaked from SUITE scope at org.apache.solr.client.solrj.impl.CloudHttp2SolrClientBuilderTest: 
   1) Thread[id=4321, name=h2sc-2548-thread-1, state=RUNNABLE, group=TGRP-CloudHttp2SolrClientBuilderTest]
        at java.base@11.0.12/jdk.internal.misc.Unsafe.unpark(Native Method)
        at java.base@11.0.12/java.util.concurrent.locks.LockSupport.unpark(LockSupport.java:160)
        at java.base@11.0.12/java.util.concurrent.locks.AbstractQueuedSynchronizer.unparkSuccessor(AbstractQueuedSynchronizer.java:709)
        at java.base@11.0.12/java.util.concurrent.locks.AbstractQueuedSynchronizer.release(AbstractQueuedSynchronizer.java:1305)
        at java.base@11.0.12/java.util.concurrent.locks.ReentrantLock.unlock(ReentrantLock.java:439)
        at java.base@11.0.12/java.util.concurrent.ThreadPoolExecutor.tryTerminate(ThreadPoolExecutor.java:726)
        at java.base@11.0.12/java.util.concurrent.ThreadPoolExecutor.processWorkerExit(ThreadPoolExecutor.java:994)
        at java.base@11.0.12/java.util.concurrent.ThreadPoolExecutor.runWorker(ThreadPoolExecutor.java:1142)
        at java.base@11.0.12/java.util.concurrent.ThreadPoolExecutor$Worker.run(ThreadPoolExecutor.java:628)
        at java.base@11.0.12/java.lang.Thread.run(Thread.java:834)
	at __randomizedtesting.SeedInfo.seed([C0077B6B86B3C72D]:0)




Build Log:
[...truncated 1070 lines...]
ERROR: The following test(s) have failed:
  - org.apache.solr.client.solrj.impl.CloudHttp2SolrClientBuilderTest.classMethod (:solr:solrj)
    Test output: /home/jenkins/jenkins-slave/workspace/Solr/Solr-Check-9.x/solr/solrj/build/test-results/test/outputs/OUTPUT-org.apache.solr.client.solrj.impl.CloudHttp2SolrClientBuilderTest.txt
    Reproduce with: gradlew :solr:solrj:test --tests "org.apache.solr.client.solrj.impl.CloudHttp2SolrClientBuilderTest.classMethod" -Ptests.jvms=4 -Ptests.haltonfailure=false "-Ptests.jvmargs=-XX:TieredStopAtLevel=1 -XX:ReservedCodeCacheSize=120m" -Ptests.seed=C0077B6B86B3C72D -Ptests.multiplier=2 -Ptests.badapples=false -Ptests.file.encoding=UTF-8


Deprecated Gradle features were used in this build, making it incompatible with Gradle 8.0.

You can use '--warning-mode all' to show the individual deprecation warnings and determine if they come from your own scripts or plugins.

See https://docs.gradle.org/7.2/userguide/command_line_interface.html#sec:command_line_warnings

BUILD SUCCESSFUL in 55m 48s
531 actionable tasks: 531 executed
Build step 'Invoke Gradle script' changed build result to SUCCESS
Archiving artifacts
java.lang.InterruptedException: no matches found within 10000
	at hudson.FilePath$ValidateAntFileMask.hasMatch(FilePath.java:3079)
	at hudson.FilePath$ValidateAntFileMask.invoke(FilePath.java:2958)
	at hudson.FilePath$ValidateAntFileMask.invoke(FilePath.java:2939)
	at hudson.FilePath$FileCallableWrapper.call(FilePath.java:3329)
Also:   hudson.remoting.Channel$CallSiteStackTrace: Remote call to lucene-solr-2
		at hudson.remoting.Channel.attachCallSiteStackTrace(Channel.java:1797)
		at hudson.remoting.UserRequest$ExceptionResponse.retrieve(UserRequest.java:356)
		at hudson.remoting.Channel.call(Channel.java:1001)
		at hudson.FilePath.act(FilePath.java:1165)
		at hudson.FilePath.act(FilePath.java:1154)
		at hudson.FilePath.validateAntFileMask(FilePath.java:2937)
		at hudson.tasks.ArtifactArchiver.perform(ArtifactArchiver.java:268)
		at hudson.tasks.BuildStepCompatibilityLayer.perform(BuildStepCompatibilityLayer.java:78)
		at hudson.tasks.BuildStepMonitor$1.perform(BuildStepMonitor.java:20)
		at hudson.model.AbstractBuild$AbstractBuildExecution.perform(AbstractBuild.java:806)
		at hudson.model.AbstractBuild$AbstractBuildExecution.performAllBuildSteps(AbstractBuild.java:755)
		at hudson.model.Build$BuildExecution.post2(Build.java:178)
		at hudson.model.AbstractBuild$AbstractBuildExecution.post(AbstractBuild.java:699)
		at hudson.model.Run.execute(Run.java:1913)
		at hudson.model.FreeStyleBuild.run(FreeStyleBuild.java:43)
		at hudson.model.ResourceController.execute(ResourceController.java:99)
		at hudson.model.Executor.run(Executor.java:432)
Caused: hudson.FilePath$TunneledInterruptedException
	at hudson.FilePath$FileCallableWrapper.call(FilePath.java:3331)
	at hudson.remoting.UserRequest.perform(UserRequest.java:211)
	at hudson.remoting.UserRequest.perform(UserRequest.java:54)
	at hudson.remoting.Request$2.run(Request.java:376)
	at hudson.remoting.InterceptingExecutorService.lambda$wrap$0(InterceptingExecutorService.java:78)
	at java.util.concurrent.FutureTask.run(FutureTask.java:266)
	at java.util.concurrent.ThreadPoolExecutor.runWorker(ThreadPoolExecutor.java:1149)
	at java.util.concurrent.ThreadPoolExecutor$Worker.run(ThreadPoolExecutor.java:624)
	at java.lang.Thread.run(Thread.java:748)
Caused: java.lang.InterruptedException: java.lang.InterruptedException: no matches found within 10000
	at hudson.FilePath.act(FilePath.java:1167)
	at hudson.FilePath.act(FilePath.java:1154)
	at hudson.FilePath.validateAntFileMask(FilePath.java:2937)
	at hudson.tasks.ArtifactArchiver.perform(ArtifactArchiver.java:268)
	at hudson.tasks.BuildStepCompatibilityLayer.perform(BuildStepCompatibilityLayer.java:78)
	at hudson.tasks.BuildStepMonitor$1.perform(BuildStepMonitor.java:20)
	at hudson.model.AbstractBuild$AbstractBuildExecution.perform(AbstractBuild.java:806)
	at hudson.model.AbstractBuild$AbstractBuildExecution.performAllBuildSteps(AbstractBuild.java:755)
	at hudson.model.Build$BuildExecution.post2(Build.java:178)
	at hudson.model.AbstractBuild$AbstractBuildExecution.post(AbstractBuild.java:699)
	at hudson.model.Run.execute(Run.java:1913)
	at hudson.model.FreeStyleBuild.run(FreeStyleBuild.java:43)
	at hudson.model.ResourceController.execute(ResourceController.java:99)
	at hudson.model.Executor.run(Executor.java:432)
No artifacts found that match the file pattern "**/*.events,heapdumps/**,**/hs_err_pid*". Configuration error?
Recording test results
[Checks API] No suitable checks publisher found.
Build step 'Publish JUnit test result report' changed build result to UNSTABLE
Email was triggered for: Unstable (Test Failures)
Sending email for trigger: Unstable (Test Failures)

[JENKINS] Solr » Solr-Check-9.x - Build # 1310 - Still Unstable!

Posted by Apache Jenkins Server <je...@builds.apache.org>.
Build: https://ci-builds.apache.org/job/Solr/job/Solr-Check-9.x/1310/

1 tests failed.
FAILED:  org.apache.solr.schema.TestBulkSchemaConcurrent.test

Error Message:
java.lang.AssertionError: [[CopyField source=a0,dest=hello_lol0 not created, new type mystr0  not created, dynamic field *_lol0 not created, field a0 not created], []]

Stack Trace:
java.lang.AssertionError: [[CopyField source=a0,dest=hello_lol0 not created, new type mystr0  not created, dynamic field *_lol0 not created, field a0 not created], []]
	at __randomizedtesting.SeedInfo.seed([987BF66EDC757278:102FC9B472891F80]:0)
	at org.junit.Assert.fail(Assert.java:89)
	at org.junit.Assert.assertTrue(Assert.java:42)
	at org.apache.solr.schema.TestBulkSchemaConcurrent.test(TestBulkSchemaConcurrent.java:121)
	at java.base/jdk.internal.reflect.NativeMethodAccessorImpl.invoke0(Native Method)
	at java.base/jdk.internal.reflect.NativeMethodAccessorImpl.invoke(NativeMethodAccessorImpl.java:62)
	at java.base/jdk.internal.reflect.DelegatingMethodAccessorImpl.invoke(DelegatingMethodAccessorImpl.java:43)
	at java.base/java.lang.reflect.Method.invoke(Method.java:566)
	at com.carrotsearch.randomizedtesting.RandomizedRunner.invoke(RandomizedRunner.java:1758)
	at com.carrotsearch.randomizedtesting.RandomizedRunner$8.evaluate(RandomizedRunner.java:946)
	at com.carrotsearch.randomizedtesting.RandomizedRunner$9.evaluate(RandomizedRunner.java:982)
	at com.carrotsearch.randomizedtesting.RandomizedRunner$10.evaluate(RandomizedRunner.java:996)
	at org.apache.solr.BaseDistributedSearchTestCase$ShardsRepeatRule$ShardsFixedStatement.callStatement(BaseDistributedSearchTestCase.java:1164)
	at org.apache.solr.BaseDistributedSearchTestCase$ShardsRepeatRule$ShardsStatement.evaluate(BaseDistributedSearchTestCase.java:1135)
	at com.carrotsearch.randomizedtesting.rules.SystemPropertiesRestoreRule$1.evaluate(SystemPropertiesRestoreRule.java:57)
	at org.junit.rules.RunRules.evaluate(RunRules.java:20)
	at org.apache.lucene.util.TestRuleSetupTeardownChained$1.evaluate(TestRuleSetupTeardownChained.java:44)
	at org.apache.lucene.util.AbstractBeforeAfterRule$1.evaluate(AbstractBeforeAfterRule.java:43)
	at org.apache.lucene.util.TestRuleThreadAndTestName$1.evaluate(TestRuleThreadAndTestName.java:45)
	at org.apache.lucene.util.TestRuleIgnoreAfterMaxFailures$1.evaluate(TestRuleIgnoreAfterMaxFailures.java:60)
	at org.apache.lucene.util.TestRuleMarkFailure$1.evaluate(TestRuleMarkFailure.java:44)
	at org.junit.rules.RunRules.evaluate(RunRules.java:20)
	at com.carrotsearch.randomizedtesting.rules.StatementAdapter.evaluate(StatementAdapter.java:36)
	at com.carrotsearch.randomizedtesting.ThreadLeakControl$StatementRunner.run(ThreadLeakControl.java:375)
	at com.carrotsearch.randomizedtesting.ThreadLeakControl.forkTimeoutingTask(ThreadLeakControl.java:824)
	at com.carrotsearch.randomizedtesting.ThreadLeakControl$3.evaluate(ThreadLeakControl.java:475)
	at com.carrotsearch.randomizedtesting.RandomizedRunner.runSingleTest(RandomizedRunner.java:955)
	at com.carrotsearch.randomizedtesting.RandomizedRunner$5.evaluate(RandomizedRunner.java:840)
	at com.carrotsearch.randomizedtesting.RandomizedRunner$6.evaluate(RandomizedRunner.java:891)
	at com.carrotsearch.randomizedtesting.RandomizedRunner$7.evaluate(RandomizedRunner.java:902)
	at com.carrotsearch.randomizedtesting.rules.StatementAdapter.evaluate(StatementAdapter.java:36)
	at org.apache.lucene.util.AbstractBeforeAfterRule$1.evaluate(AbstractBeforeAfterRule.java:43)
	at org.apache.lucene.util.AbstractBeforeAfterRule$1.evaluate(AbstractBeforeAfterRule.java:43)
	at com.carrotsearch.randomizedtesting.rules.SystemPropertiesRestoreRule$1.evaluate(SystemPropertiesRestoreRule.java:57)
	at org.junit.rules.RunRules.evaluate(RunRules.java:20)
	at org.apache.lucene.util.AbstractBeforeAfterRule$1.evaluate(AbstractBeforeAfterRule.java:43)
	at com.carrotsearch.randomizedtesting.rules.StatementAdapter.evaluate(StatementAdapter.java:36)
	at org.apache.lucene.util.TestRuleStoreClassName$1.evaluate(TestRuleStoreClassName.java:38)
	at com.carrotsearch.randomizedtesting.rules.NoShadowingOrOverridesOnMethodsRule$1.evaluate(NoShadowingOrOverridesOnMethodsRule.java:40)
	at com.carrotsearch.randomizedtesting.rules.NoShadowingOrOverridesOnMethodsRule$1.evaluate(NoShadowingOrOverridesOnMethodsRule.java:40)
	at com.carrotsearch.randomizedtesting.rules.StatementAdapter.evaluate(StatementAdapter.java:36)
	at com.carrotsearch.randomizedtesting.rules.StatementAdapter.evaluate(StatementAdapter.java:36)
	at org.apache.lucene.util.TestRuleAssertionsRequired$1.evaluate(TestRuleAssertionsRequired.java:53)
	at org.apache.lucene.util.AbstractBeforeAfterRule$1.evaluate(AbstractBeforeAfterRule.java:43)
	at org.apache.lucene.util.TestRuleMarkFailure$1.evaluate(TestRuleMarkFailure.java:44)
	at org.apache.lucene.util.TestRuleIgnoreAfterMaxFailures$1.evaluate(TestRuleIgnoreAfterMaxFailures.java:60)
	at org.apache.lucene.util.TestRuleIgnoreTestSuites$1.evaluate(TestRuleIgnoreTestSuites.java:47)
	at org.junit.rules.RunRules.evaluate(RunRules.java:20)
	at com.carrotsearch.randomizedtesting.rules.StatementAdapter.evaluate(StatementAdapter.java:36)
	at com.carrotsearch.randomizedtesting.ThreadLeakControl$StatementRunner.run(ThreadLeakControl.java:375)
	at com.carrotsearch.randomizedtesting.ThreadLeakControl.lambda$forkTimeoutingTask$0(ThreadLeakControl.java:831)
	at java.base/java.lang.Thread.run(Thread.java:834)




Build Log:
[...truncated 3093 lines...]
ERROR: The following test(s) have failed:
  - org.apache.solr.schema.TestBulkSchemaConcurrent.test (:solr:core)
    Test output: /home/jenkins/jenkins-slave/workspace/Solr/Solr-Check-9.x/solr/core/build/test-results/test/outputs/OUTPUT-org.apache.solr.schema.TestBulkSchemaConcurrent.txt
    Reproduce with: gradlew :solr:core:test --tests "org.apache.solr.schema.TestBulkSchemaConcurrent.test" -Ptests.jvms=4 -Ptests.haltonfailure=false "-Ptests.jvmargs=-XX:TieredStopAtLevel=1 -XX:ReservedCodeCacheSize=120m" -Ptests.seed=987BF66EDC757278 -Ptests.multiplier=2 -Ptests.badapples=false -Ptests.file.encoding=US-ASCII


Deprecated Gradle features were used in this build, making it incompatible with Gradle 8.0.

You can use '--warning-mode all' to show the individual deprecation warnings and determine if they come from your own scripts or plugins.

See https://docs.gradle.org/7.2/userguide/command_line_interface.html#sec:command_line_warnings

BUILD SUCCESSFUL in 55m 48s
531 actionable tasks: 531 executed
Build step 'Invoke Gradle script' changed build result to SUCCESS
Archiving artifacts
java.lang.InterruptedException: no matches found within 10000
	at hudson.FilePath$ValidateAntFileMask.hasMatch(FilePath.java:3079)
	at hudson.FilePath$ValidateAntFileMask.invoke(FilePath.java:2958)
	at hudson.FilePath$ValidateAntFileMask.invoke(FilePath.java:2939)
	at hudson.FilePath$FileCallableWrapper.call(FilePath.java:3329)
Also:   hudson.remoting.Channel$CallSiteStackTrace: Remote call to lucene-solr-2
		at hudson.remoting.Channel.attachCallSiteStackTrace(Channel.java:1797)
		at hudson.remoting.UserRequest$ExceptionResponse.retrieve(UserRequest.java:356)
		at hudson.remoting.Channel.call(Channel.java:1001)
		at hudson.FilePath.act(FilePath.java:1165)
		at hudson.FilePath.act(FilePath.java:1154)
		at hudson.FilePath.validateAntFileMask(FilePath.java:2937)
		at hudson.tasks.ArtifactArchiver.perform(ArtifactArchiver.java:268)
		at hudson.tasks.BuildStepCompatibilityLayer.perform(BuildStepCompatibilityLayer.java:78)
		at hudson.tasks.BuildStepMonitor$1.perform(BuildStepMonitor.java:20)
		at hudson.model.AbstractBuild$AbstractBuildExecution.perform(AbstractBuild.java:806)
		at hudson.model.AbstractBuild$AbstractBuildExecution.performAllBuildSteps(AbstractBuild.java:755)
		at hudson.model.Build$BuildExecution.post2(Build.java:178)
		at hudson.model.AbstractBuild$AbstractBuildExecution.post(AbstractBuild.java:699)
		at hudson.model.Run.execute(Run.java:1913)
		at hudson.model.FreeStyleBuild.run(FreeStyleBuild.java:43)
		at hudson.model.ResourceController.execute(ResourceController.java:99)
		at hudson.model.Executor.run(Executor.java:432)
Caused: hudson.FilePath$TunneledInterruptedException
	at hudson.FilePath$FileCallableWrapper.call(FilePath.java:3331)
	at hudson.remoting.UserRequest.perform(UserRequest.java:211)
	at hudson.remoting.UserRequest.perform(UserRequest.java:54)
	at hudson.remoting.Request$2.run(Request.java:376)
	at hudson.remoting.InterceptingExecutorService.lambda$wrap$0(InterceptingExecutorService.java:78)
	at java.util.concurrent.FutureTask.run(FutureTask.java:266)
	at java.util.concurrent.ThreadPoolExecutor.runWorker(ThreadPoolExecutor.java:1149)
	at java.util.concurrent.ThreadPoolExecutor$Worker.run(ThreadPoolExecutor.java:624)
	at java.lang.Thread.run(Thread.java:748)
Caused: java.lang.InterruptedException: java.lang.InterruptedException: no matches found within 10000
	at hudson.FilePath.act(FilePath.java:1167)
	at hudson.FilePath.act(FilePath.java:1154)
	at hudson.FilePath.validateAntFileMask(FilePath.java:2937)
	at hudson.tasks.ArtifactArchiver.perform(ArtifactArchiver.java:268)
	at hudson.tasks.BuildStepCompatibilityLayer.perform(BuildStepCompatibilityLayer.java:78)
	at hudson.tasks.BuildStepMonitor$1.perform(BuildStepMonitor.java:20)
	at hudson.model.AbstractBuild$AbstractBuildExecution.perform(AbstractBuild.java:806)
	at hudson.model.AbstractBuild$AbstractBuildExecution.performAllBuildSteps(AbstractBuild.java:755)
	at hudson.model.Build$BuildExecution.post2(Build.java:178)
	at hudson.model.AbstractBuild$AbstractBuildExecution.post(AbstractBuild.java:699)
	at hudson.model.Run.execute(Run.java:1913)
	at hudson.model.FreeStyleBuild.run(FreeStyleBuild.java:43)
	at hudson.model.ResourceController.execute(ResourceController.java:99)
	at hudson.model.Executor.run(Executor.java:432)
No artifacts found that match the file pattern "**/*.events,heapdumps/**,**/hs_err_pid*". Configuration error?
Recording test results
[Checks API] No suitable checks publisher found.
Build step 'Publish JUnit test result report' changed build result to UNSTABLE
Email was triggered for: Unstable (Test Failures)
Sending email for trigger: Unstable (Test Failures)

[JENKINS] Solr » Solr-Check-9.x - Build # 1309 - Still Unstable!

Posted by Apache Jenkins Server <je...@builds.apache.org>.
Build: https://ci-builds.apache.org/job/Solr/job/Solr-Check-9.x/1309/

1 tests failed.
FAILED:  org.apache.solr.client.solrj.impl.CloudHttp2SolrClientBuilderTest.classMethod

Error Message:
com.carrotsearch.randomizedtesting.ThreadLeakError: 1 thread leaked from SUITE scope at org.apache.solr.client.solrj.impl.CloudHttp2SolrClientBuilderTest: 
   1) Thread[id=2582, name=h2sc-1836-thread-1, state=RUNNABLE, group=TGRP-CloudHttp2SolrClientBuilderTest]
        at java.base@11.0.12/jdk.internal.misc.Unsafe.unpark(Native Method)
        at java.base@11.0.12/java.util.concurrent.locks.LockSupport.unpark(LockSupport.java:160)
        at java.base@11.0.12/java.util.concurrent.locks.AbstractQueuedSynchronizer.unparkSuccessor(AbstractQueuedSynchronizer.java:709)
        at java.base@11.0.12/java.util.concurrent.locks.AbstractQueuedSynchronizer.release(AbstractQueuedSynchronizer.java:1305)
        at java.base@11.0.12/java.util.concurrent.locks.ReentrantLock.unlock(ReentrantLock.java:439)
        at java.base@11.0.12/java.util.concurrent.ThreadPoolExecutor.tryTerminate(ThreadPoolExecutor.java:726)
        at java.base@11.0.12/java.util.concurrent.ThreadPoolExecutor.processWorkerExit(ThreadPoolExecutor.java:994)
        at java.base@11.0.12/java.util.concurrent.ThreadPoolExecutor.runWorker(ThreadPoolExecutor.java:1142)
        at java.base@11.0.12/java.util.concurrent.ThreadPoolExecutor$Worker.run(ThreadPoolExecutor.java:628)
        at java.base@11.0.12/java.lang.Thread.run(Thread.java:834)

Stack Trace:
com.carrotsearch.randomizedtesting.ThreadLeakError: 1 thread leaked from SUITE scope at org.apache.solr.client.solrj.impl.CloudHttp2SolrClientBuilderTest: 
   1) Thread[id=2582, name=h2sc-1836-thread-1, state=RUNNABLE, group=TGRP-CloudHttp2SolrClientBuilderTest]
        at java.base@11.0.12/jdk.internal.misc.Unsafe.unpark(Native Method)
        at java.base@11.0.12/java.util.concurrent.locks.LockSupport.unpark(LockSupport.java:160)
        at java.base@11.0.12/java.util.concurrent.locks.AbstractQueuedSynchronizer.unparkSuccessor(AbstractQueuedSynchronizer.java:709)
        at java.base@11.0.12/java.util.concurrent.locks.AbstractQueuedSynchronizer.release(AbstractQueuedSynchronizer.java:1305)
        at java.base@11.0.12/java.util.concurrent.locks.ReentrantLock.unlock(ReentrantLock.java:439)
        at java.base@11.0.12/java.util.concurrent.ThreadPoolExecutor.tryTerminate(ThreadPoolExecutor.java:726)
        at java.base@11.0.12/java.util.concurrent.ThreadPoolExecutor.processWorkerExit(ThreadPoolExecutor.java:994)
        at java.base@11.0.12/java.util.concurrent.ThreadPoolExecutor.runWorker(ThreadPoolExecutor.java:1142)
        at java.base@11.0.12/java.util.concurrent.ThreadPoolExecutor$Worker.run(ThreadPoolExecutor.java:628)
        at java.base@11.0.12/java.lang.Thread.run(Thread.java:834)
	at __randomizedtesting.SeedInfo.seed([3A230F5BCF15AC2A]:0)




Build Log:
[...truncated 1066 lines...]
ERROR: The following test(s) have failed:
  - org.apache.solr.client.solrj.impl.CloudHttp2SolrClientBuilderTest.classMethod (:solr:solrj)
    Test output: /home/jenkins/jenkins-slave/workspace/Solr/Solr-Check-9.x/solr/solrj/build/test-results/test/outputs/OUTPUT-org.apache.solr.client.solrj.impl.CloudHttp2SolrClientBuilderTest.txt
    Reproduce with: gradlew :solr:solrj:test --tests "org.apache.solr.client.solrj.impl.CloudHttp2SolrClientBuilderTest.classMethod" -Ptests.jvms=4 -Ptests.haltonfailure=false "-Ptests.jvmargs=-XX:TieredStopAtLevel=1 -XX:ReservedCodeCacheSize=120m" -Ptests.seed=3A230F5BCF15AC2A -Ptests.multiplier=2 -Ptests.badapples=false -Ptests.file.encoding=UTF-8


Deprecated Gradle features were used in this build, making it incompatible with Gradle 8.0.

You can use '--warning-mode all' to show the individual deprecation warnings and determine if they come from your own scripts or plugins.

See https://docs.gradle.org/7.2/userguide/command_line_interface.html#sec:command_line_warnings

BUILD SUCCESSFUL in 54m 18s
531 actionable tasks: 531 executed
Build step 'Invoke Gradle script' changed build result to SUCCESS
Archiving artifacts
java.lang.InterruptedException: no matches found within 10000
	at hudson.FilePath$ValidateAntFileMask.hasMatch(FilePath.java:3079)
	at hudson.FilePath$ValidateAntFileMask.invoke(FilePath.java:2958)
	at hudson.FilePath$ValidateAntFileMask.invoke(FilePath.java:2939)
	at hudson.FilePath$FileCallableWrapper.call(FilePath.java:3329)
Also:   hudson.remoting.Channel$CallSiteStackTrace: Remote call to lucene-solr-1
		at hudson.remoting.Channel.attachCallSiteStackTrace(Channel.java:1797)
		at hudson.remoting.UserRequest$ExceptionResponse.retrieve(UserRequest.java:356)
		at hudson.remoting.Channel.call(Channel.java:1001)
		at hudson.FilePath.act(FilePath.java:1165)
		at hudson.FilePath.act(FilePath.java:1154)
		at hudson.FilePath.validateAntFileMask(FilePath.java:2937)
		at hudson.tasks.ArtifactArchiver.perform(ArtifactArchiver.java:268)
		at hudson.tasks.BuildStepCompatibilityLayer.perform(BuildStepCompatibilityLayer.java:78)
		at hudson.tasks.BuildStepMonitor$1.perform(BuildStepMonitor.java:20)
		at hudson.model.AbstractBuild$AbstractBuildExecution.perform(AbstractBuild.java:806)
		at hudson.model.AbstractBuild$AbstractBuildExecution.performAllBuildSteps(AbstractBuild.java:755)
		at hudson.model.Build$BuildExecution.post2(Build.java:178)
		at hudson.model.AbstractBuild$AbstractBuildExecution.post(AbstractBuild.java:699)
		at hudson.model.Run.execute(Run.java:1913)
		at hudson.model.FreeStyleBuild.run(FreeStyleBuild.java:43)
		at hudson.model.ResourceController.execute(ResourceController.java:99)
		at hudson.model.Executor.run(Executor.java:432)
Caused: hudson.FilePath$TunneledInterruptedException
	at hudson.FilePath$FileCallableWrapper.call(FilePath.java:3331)
	at hudson.remoting.UserRequest.perform(UserRequest.java:211)
	at hudson.remoting.UserRequest.perform(UserRequest.java:54)
	at hudson.remoting.Request$2.run(Request.java:376)
	at hudson.remoting.InterceptingExecutorService.lambda$wrap$0(InterceptingExecutorService.java:78)
	at java.util.concurrent.FutureTask.run(FutureTask.java:266)
	at java.util.concurrent.ThreadPoolExecutor.runWorker(ThreadPoolExecutor.java:1149)
	at java.util.concurrent.ThreadPoolExecutor$Worker.run(ThreadPoolExecutor.java:624)
	at java.lang.Thread.run(Thread.java:748)
Caused: java.lang.InterruptedException: java.lang.InterruptedException: no matches found within 10000
	at hudson.FilePath.act(FilePath.java:1167)
	at hudson.FilePath.act(FilePath.java:1154)
	at hudson.FilePath.validateAntFileMask(FilePath.java:2937)
	at hudson.tasks.ArtifactArchiver.perform(ArtifactArchiver.java:268)
	at hudson.tasks.BuildStepCompatibilityLayer.perform(BuildStepCompatibilityLayer.java:78)
	at hudson.tasks.BuildStepMonitor$1.perform(BuildStepMonitor.java:20)
	at hudson.model.AbstractBuild$AbstractBuildExecution.perform(AbstractBuild.java:806)
	at hudson.model.AbstractBuild$AbstractBuildExecution.performAllBuildSteps(AbstractBuild.java:755)
	at hudson.model.Build$BuildExecution.post2(Build.java:178)
	at hudson.model.AbstractBuild$AbstractBuildExecution.post(AbstractBuild.java:699)
	at hudson.model.Run.execute(Run.java:1913)
	at hudson.model.FreeStyleBuild.run(FreeStyleBuild.java:43)
	at hudson.model.ResourceController.execute(ResourceController.java:99)
	at hudson.model.Executor.run(Executor.java:432)
No artifacts found that match the file pattern "**/*.events,heapdumps/**,**/hs_err_pid*". Configuration error?
Recording test results
[Checks API] No suitable checks publisher found.
Build step 'Publish JUnit test result report' changed build result to UNSTABLE
Email was triggered for: Unstable (Test Failures)
Sending email for trigger: Unstable (Test Failures)

[JENKINS] Solr » Solr-Check-9.x - Build # 1308 - Still Unstable!

Posted by Apache Jenkins Server <je...@builds.apache.org>.
Build: https://ci-builds.apache.org/job/Solr/job/Solr-Check-9.x/1308/

1 tests failed.
FAILED:  org.apache.solr.client.solrj.impl.CloudSolrClientBuilderTest.classMethod

Error Message:
com.carrotsearch.randomizedtesting.ThreadLeakError: 1 thread leaked from SUITE scope at org.apache.solr.client.solrj.impl.CloudSolrClientBuilderTest: 
   1) Thread[id=439, name=h2sc-251-thread-1, state=RUNNABLE, group=TGRP-CloudSolrClientBuilderTest]
        at java.base@11.0.12/jdk.internal.misc.Unsafe.unpark(Native Method)
        at java.base@11.0.12/java.util.concurrent.locks.LockSupport.unpark(LockSupport.java:160)
        at java.base@11.0.12/java.util.concurrent.locks.AbstractQueuedSynchronizer.unparkSuccessor(AbstractQueuedSynchronizer.java:709)
        at java.base@11.0.12/java.util.concurrent.locks.AbstractQueuedSynchronizer.release(AbstractQueuedSynchronizer.java:1305)
        at java.base@11.0.12/java.util.concurrent.locks.ReentrantLock.unlock(ReentrantLock.java:439)
        at java.base@11.0.12/java.util.concurrent.ThreadPoolExecutor.tryTerminate(ThreadPoolExecutor.java:726)
        at java.base@11.0.12/java.util.concurrent.ThreadPoolExecutor.processWorkerExit(ThreadPoolExecutor.java:994)
        at java.base@11.0.12/java.util.concurrent.ThreadPoolExecutor.runWorker(ThreadPoolExecutor.java:1142)
        at java.base@11.0.12/java.util.concurrent.ThreadPoolExecutor$Worker.run(ThreadPoolExecutor.java:628)
        at java.base@11.0.12/java.lang.Thread.run(Thread.java:834)

Stack Trace:
com.carrotsearch.randomizedtesting.ThreadLeakError: 1 thread leaked from SUITE scope at org.apache.solr.client.solrj.impl.CloudSolrClientBuilderTest: 
   1) Thread[id=439, name=h2sc-251-thread-1, state=RUNNABLE, group=TGRP-CloudSolrClientBuilderTest]
        at java.base@11.0.12/jdk.internal.misc.Unsafe.unpark(Native Method)
        at java.base@11.0.12/java.util.concurrent.locks.LockSupport.unpark(LockSupport.java:160)
        at java.base@11.0.12/java.util.concurrent.locks.AbstractQueuedSynchronizer.unparkSuccessor(AbstractQueuedSynchronizer.java:709)
        at java.base@11.0.12/java.util.concurrent.locks.AbstractQueuedSynchronizer.release(AbstractQueuedSynchronizer.java:1305)
        at java.base@11.0.12/java.util.concurrent.locks.ReentrantLock.unlock(ReentrantLock.java:439)
        at java.base@11.0.12/java.util.concurrent.ThreadPoolExecutor.tryTerminate(ThreadPoolExecutor.java:726)
        at java.base@11.0.12/java.util.concurrent.ThreadPoolExecutor.processWorkerExit(ThreadPoolExecutor.java:994)
        at java.base@11.0.12/java.util.concurrent.ThreadPoolExecutor.runWorker(ThreadPoolExecutor.java:1142)
        at java.base@11.0.12/java.util.concurrent.ThreadPoolExecutor$Worker.run(ThreadPoolExecutor.java:628)
        at java.base@11.0.12/java.lang.Thread.run(Thread.java:834)
	at __randomizedtesting.SeedInfo.seed([F124EDFA0EDDECE7]:0)




Build Log:
[...truncated 1067 lines...]
ERROR: The following test(s) have failed:
  - org.apache.solr.client.solrj.impl.CloudSolrClientBuilderTest.classMethod (:solr:solrj)
    Test output: /home/jenkins/jenkins-slave/workspace/Solr/Solr-Check-9.x/solr/solrj/build/test-results/test/outputs/OUTPUT-org.apache.solr.client.solrj.impl.CloudSolrClientBuilderTest.txt
    Reproduce with: gradlew :solr:solrj:test --tests "org.apache.solr.client.solrj.impl.CloudSolrClientBuilderTest.classMethod" -Ptests.jvms=4 -Ptests.haltonfailure=false "-Ptests.jvmargs=-XX:TieredStopAtLevel=1 -XX:ReservedCodeCacheSize=120m" -Ptests.seed=F124EDFA0EDDECE7 -Ptests.multiplier=2 -Ptests.badapples=false -Ptests.file.encoding=UTF-8


Deprecated Gradle features were used in this build, making it incompatible with Gradle 8.0.

You can use '--warning-mode all' to show the individual deprecation warnings and determine if they come from your own scripts or plugins.

See https://docs.gradle.org/7.2/userguide/command_line_interface.html#sec:command_line_warnings

BUILD SUCCESSFUL in 56m 19s
531 actionable tasks: 531 executed
Build step 'Invoke Gradle script' changed build result to SUCCESS
Archiving artifacts
java.lang.InterruptedException: no matches found within 10000
	at hudson.FilePath$ValidateAntFileMask.hasMatch(FilePath.java:3079)
	at hudson.FilePath$ValidateAntFileMask.invoke(FilePath.java:2958)
	at hudson.FilePath$ValidateAntFileMask.invoke(FilePath.java:2939)
	at hudson.FilePath$FileCallableWrapper.call(FilePath.java:3329)
Also:   hudson.remoting.Channel$CallSiteStackTrace: Remote call to lucene-solr-2
		at hudson.remoting.Channel.attachCallSiteStackTrace(Channel.java:1797)
		at hudson.remoting.UserRequest$ExceptionResponse.retrieve(UserRequest.java:356)
		at hudson.remoting.Channel.call(Channel.java:1001)
		at hudson.FilePath.act(FilePath.java:1165)
		at hudson.FilePath.act(FilePath.java:1154)
		at hudson.FilePath.validateAntFileMask(FilePath.java:2937)
		at hudson.tasks.ArtifactArchiver.perform(ArtifactArchiver.java:268)
		at hudson.tasks.BuildStepCompatibilityLayer.perform(BuildStepCompatibilityLayer.java:78)
		at hudson.tasks.BuildStepMonitor$1.perform(BuildStepMonitor.java:20)
		at hudson.model.AbstractBuild$AbstractBuildExecution.perform(AbstractBuild.java:806)
		at hudson.model.AbstractBuild$AbstractBuildExecution.performAllBuildSteps(AbstractBuild.java:755)
		at hudson.model.Build$BuildExecution.post2(Build.java:178)
		at hudson.model.AbstractBuild$AbstractBuildExecution.post(AbstractBuild.java:699)
		at hudson.model.Run.execute(Run.java:1913)
		at hudson.model.FreeStyleBuild.run(FreeStyleBuild.java:43)
		at hudson.model.ResourceController.execute(ResourceController.java:99)
		at hudson.model.Executor.run(Executor.java:432)
Caused: hudson.FilePath$TunneledInterruptedException
	at hudson.FilePath$FileCallableWrapper.call(FilePath.java:3331)
	at hudson.remoting.UserRequest.perform(UserRequest.java:211)
	at hudson.remoting.UserRequest.perform(UserRequest.java:54)
	at hudson.remoting.Request$2.run(Request.java:376)
	at hudson.remoting.InterceptingExecutorService.lambda$wrap$0(InterceptingExecutorService.java:78)
	at java.util.concurrent.FutureTask.run(FutureTask.java:266)
	at java.util.concurrent.ThreadPoolExecutor.runWorker(ThreadPoolExecutor.java:1149)
	at java.util.concurrent.ThreadPoolExecutor$Worker.run(ThreadPoolExecutor.java:624)
	at java.lang.Thread.run(Thread.java:748)
Caused: java.lang.InterruptedException: java.lang.InterruptedException: no matches found within 10000
	at hudson.FilePath.act(FilePath.java:1167)
	at hudson.FilePath.act(FilePath.java:1154)
	at hudson.FilePath.validateAntFileMask(FilePath.java:2937)
	at hudson.tasks.ArtifactArchiver.perform(ArtifactArchiver.java:268)
	at hudson.tasks.BuildStepCompatibilityLayer.perform(BuildStepCompatibilityLayer.java:78)
	at hudson.tasks.BuildStepMonitor$1.perform(BuildStepMonitor.java:20)
	at hudson.model.AbstractBuild$AbstractBuildExecution.perform(AbstractBuild.java:806)
	at hudson.model.AbstractBuild$AbstractBuildExecution.performAllBuildSteps(AbstractBuild.java:755)
	at hudson.model.Build$BuildExecution.post2(Build.java:178)
	at hudson.model.AbstractBuild$AbstractBuildExecution.post(AbstractBuild.java:699)
	at hudson.model.Run.execute(Run.java:1913)
	at hudson.model.FreeStyleBuild.run(FreeStyleBuild.java:43)
	at hudson.model.ResourceController.execute(ResourceController.java:99)
	at hudson.model.Executor.run(Executor.java:432)
No artifacts found that match the file pattern "**/*.events,heapdumps/**,**/hs_err_pid*". Configuration error?
Recording test results
[Checks API] No suitable checks publisher found.
Build step 'Publish JUnit test result report' changed build result to UNSTABLE
Email was triggered for: Unstable (Test Failures)
Sending email for trigger: Unstable (Test Failures)