You are viewing a plain text version of this content. The canonical link for it is here.
Posted to builds@beam.apache.org by Apache Jenkins Server <je...@builds.apache.org> on 2022/04/20 03:52:00 UTC

Build failed in Jenkins: beam_PostCommit_Python38 #2538

See <https://ci-beam.apache.org/job/beam_PostCommit_Python38/2538/display/redirect?page=changes>

Changes:

[noreply] Populate actual dataflow job id to bigquery write trace id (#17130)

[relax] mark static thread as a daemon thread

[noreply] [BEAM-13866] Add miscellaneous exec unit tests (#17363)


------------------------------------------
[...truncated 35.61 MB...]
}
message: "Closing all cached grpc data channels."
log_location: "/usr/local/lib/python3.8/site-packages/apache_beam/runners/worker/data_plane.py:782"
thread: "MainThread"

INFO:root:severity: INFO
timestamp {
  seconds: 1650421658
  nanos: 886775970
}
message: "Closing all cached gRPC state handlers."
log_location: "/usr/local/lib/python3.8/site-packages/apache_beam/runners/worker/sdk_worker.py:859"
thread: "MainThread"

INFO:root:severity: INFO
timestamp {
  seconds: 1650421658
  nanos: 887006998
}
message: "Done consuming work."
log_location: "/usr/local/lib/python3.8/site-packages/apache_beam/runners/worker/sdk_worker.py:257"
thread: "MainThread"

INFO:root:severity: INFO
timestamp {
  seconds: 1650421658
  nanos: 887089967
}
message: "Python sdk harness exiting."
log_location: "/usr/local/lib/python3.8/site-packages/apache_beam/runners/worker/sdk_worker_main.py:181"
thread: "MainThread"

INFO:apache_beam.runners.portability.local_job_service:Completed job in 10.519564628601074 seconds with state DONE.
INFO:root:Completed job in 10.519564628601074 seconds with state DONE.
INFO:apache_beam.runners.portability.portable_runner:Job state changed to DONE

> Task :sdks:python:test-suites:portable:py38:portableWordCountSparkRunnerBatch
INFO:apache_beam.runners.worker.worker_pool_main:Listening for workers at localhost:33277
WARNING:root:Make sure that locally built Python SDK docker image has Python 3.8 interpreter.
INFO:root:Default Python SDK image for environment is apache/beam_python3.8_sdk:2.39.0.dev
INFO:apache_beam.runners.portability.fn_api_runner.translations:==================== <function pack_combiners at 0x7f53f8c1f310> ====================
INFO:apache_beam.runners.portability.fn_api_runner.translations:==================== <function lift_combiners at 0x7f53f8c1f3a0> ====================
INFO:apache_beam.runners.portability.fn_api_runner.translations:==================== <function sort_stages at 0x7f53f8c1faf0> ====================
INFO:apache_beam.utils.subprocess_server:Starting service with ['java' '-jar' '<https://ci-beam.apache.org/job/beam_PostCommit_Python38/ws/src/runners/spark/2/job-server/build/libs/beam-runners-spark-job-server-2.39.0-SNAPSHOT.jar'> '--spark-master-url' 'local[4]' '--artifacts-dir' '/tmp/beam-temp04lysup2/artifacts4xf91ljx' '--job-port' '34223' '--artifact-port' '0' '--expansion-port' '0']
E0420 02:27:42.157673489 3637300 fork_posix.cc:70]           Fork support is only compatible with the epoll1 and poll polling strategies
INFO:apache_beam.utils.subprocess_server:b'22/04/20 02:27:43 WARN software.amazon.awssdk.regions.internal.util.EC2MetadataUtils: Unable to retrieve the requested metadata.'
INFO:apache_beam.utils.subprocess_server:b'22/04/20 02:27:44 INFO org.apache.beam.runners.jobsubmission.JobServerDriver: ArtifactStagingService started on localhost:44345'
INFO:apache_beam.utils.subprocess_server:b'22/04/20 02:27:44 INFO org.apache.beam.runners.jobsubmission.JobServerDriver: Java ExpansionService started on localhost:46021'
INFO:apache_beam.utils.subprocess_server:b'22/04/20 02:27:44 INFO org.apache.beam.runners.jobsubmission.JobServerDriver: JobService started on localhost:34223'
INFO:apache_beam.utils.subprocess_server:b'22/04/20 02:27:44 INFO org.apache.beam.runners.jobsubmission.JobServerDriver: Job server now running, terminate with Ctrl+C'
WARNING:apache_beam.options.pipeline_options:Discarding unparseable args: ['--parallelism=2']
INFO:apache_beam.utils.subprocess_server:b'22/04/20 02:27:45 INFO org.apache.beam.runners.fnexecution.artifact.ArtifactStagingService: Staging artifacts for job_589eafdc-4e33-40b9-8f50-99f4d6606c6e.'
INFO:apache_beam.utils.subprocess_server:b'22/04/20 02:27:45 INFO org.apache.beam.runners.fnexecution.artifact.ArtifactStagingService: Resolving artifacts for job_589eafdc-4e33-40b9-8f50-99f4d6606c6e.ref_Environment_default_environment_1.'
INFO:apache_beam.utils.subprocess_server:b'22/04/20 02:27:45 INFO org.apache.beam.runners.fnexecution.artifact.ArtifactStagingService: Getting 1 artifacts for job_589eafdc-4e33-40b9-8f50-99f4d6606c6e.null.'
INFO:apache_beam.utils.subprocess_server:b'22/04/20 02:27:45 INFO org.apache.beam.runners.fnexecution.artifact.ArtifactStagingService: Artifacts fully staged for job_589eafdc-4e33-40b9-8f50-99f4d6606c6e.'
INFO:apache_beam.utils.subprocess_server:b'22/04/20 02:27:45 INFO org.apache.beam.runners.spark.SparkJobInvoker: Invoking job BeamApp-jenkins-0420022745-b52edcd0_7f11dfea-335b-4cf2-a555-2375596c1247'
INFO:apache_beam.utils.subprocess_server:b'22/04/20 02:27:45 INFO org.apache.beam.runners.jobsubmission.JobInvocation: Starting job invocation BeamApp-jenkins-0420022745-b52edcd0_7f11dfea-335b-4cf2-a555-2375596c1247'
INFO:apache_beam.runners.portability.portable_runner:Environment "LOOPBACK" has started a component necessary for the execution. Be sure to run the pipeline using
  with Pipeline() as p:
    p.apply(..)
This ensures that the pipeline finishes before this program exits.
INFO:apache_beam.runners.portability.portable_runner:Job state changed to STOPPED
INFO:apache_beam.runners.portability.portable_runner:Job state changed to STARTING
INFO:apache_beam.runners.portability.portable_runner:Job state changed to RUNNING
INFO:apache_beam.utils.subprocess_server:b'22/04/20 02:27:45 INFO org.apache.beam.runners.spark.translation.SparkContextFactory: Creating a brand new Spark Context.'
INFO:apache_beam.utils.subprocess_server:b'22/04/20 02:27:46 WARN org.apache.hadoop.util.NativeCodeLoader: Unable to load native-hadoop library for your platform... using builtin-java classes where applicable'
INFO:apache_beam.utils.subprocess_server:b'22/04/20 02:27:46 INFO org.apache.beam.runners.spark.aggregators.AggregatorsAccumulator: Instantiated aggregators accumulator:'
INFO:apache_beam.utils.subprocess_server:b'22/04/20 02:27:46 INFO org.apache.beam.runners.spark.metrics.MetricsAccumulator: Instantiated metrics accumulator: MetricQueryResults()'
INFO:apache_beam.utils.subprocess_server:b'22/04/20 02:27:46 WARN software.amazon.awssdk.regions.internal.util.EC2MetadataUtils: Unable to retrieve the requested metadata.'
INFO:apache_beam.utils.subprocess_server:b'22/04/20 02:27:46 INFO org.apache.beam.runners.spark.SparkPipelineRunner: Running job BeamApp-jenkins-0420022745-b52edcd0_7f11dfea-335b-4cf2-a555-2375596c1247 on Spark master local[4]'
INFO:apache_beam.utils.subprocess_server:b'22/04/20 02:27:47 WARN software.amazon.awssdk.regions.internal.util.EC2MetadataUtils: Unable to retrieve the requested metadata.'
INFO:apache_beam.utils.subprocess_server:b'22/04/20 02:27:47 WARN software.amazon.awssdk.regions.internal.util.EC2MetadataUtils: Unable to retrieve the requested metadata.'
INFO:apache_beam.utils.subprocess_server:b'22/04/20 02:27:47 WARN software.amazon.awssdk.regions.internal.util.EC2MetadataUtils: Unable to retrieve the requested metadata.'
INFO:apache_beam.utils.subprocess_server:b'22/04/20 02:27:47 WARN software.amazon.awssdk.regions.internal.util.EC2MetadataUtils: Unable to retrieve the requested metadata.'
INFO:apache_beam.runners.worker.statecache:Creating state cache with size 0
INFO:apache_beam.runners.worker.sdk_worker:Creating insecure control channel for localhost:46243.
INFO:apache_beam.runners.worker.sdk_worker:Control channel established.
INFO:apache_beam.runners.worker.sdk_worker:Initializing SDKHarness with unbounded number of workers.
INFO:apache_beam.utils.subprocess_server:b'22/04/20 02:27:48 INFO org.apache.beam.runners.fnexecution.control.FnApiControlClientPoolService: Beam Fn Control client connected with id 1-1'
INFO:apache_beam.utils.subprocess_server:b'22/04/20 02:27:48 INFO org.apache.beam.runners.fnexecution.control.FnApiControlClientPoolService: getProcessBundleDescriptor request with id 1-2'
INFO:apache_beam.runners.worker.sdk_worker:Creating insecure state channel for localhost:38207.
INFO:apache_beam.runners.worker.sdk_worker:State channel established.
INFO:apache_beam.runners.worker.data_plane:Creating client data channel for localhost:35507
INFO:apache_beam.utils.subprocess_server:b'22/04/20 02:27:48 INFO org.apache.beam.runners.fnexecution.data.GrpcDataService: Beam Fn Data client connected.'
INFO:apache_beam.utils.subprocess_server:b'22/04/20 02:27:48 INFO org.apache.beam.runners.fnexecution.control.FnApiControlClientPoolService: getProcessBundleDescriptor request with id 1-3'
INFO:apache_beam.utils.subprocess_server:b'22/04/20 02:27:48 WARN software.amazon.awssdk.regions.internal.util.EC2MetadataUtils: Unable to retrieve the requested metadata.'
INFO:apache_beam.utils.subprocess_server:b'22/04/20 02:27:48 WARN software.amazon.awssdk.regions.internal.util.EC2MetadataUtils: Unable to retrieve the requested metadata.'
INFO:apache_beam.utils.subprocess_server:b'22/04/20 02:27:48 WARN software.amazon.awssdk.regions.internal.util.EC2MetadataUtils: Unable to retrieve the requested metadata.'
INFO:apache_beam.utils.subprocess_server:b'22/04/20 02:27:48 WARN software.amazon.awssdk.regions.internal.util.EC2MetadataUtils: Unable to retrieve the requested metadata.'
INFO:apache_beam.utils.subprocess_server:b'22/04/20 02:27:48 INFO org.apache.beam.runners.fnexecution.control.FnApiControlClientPoolService: getProcessBundleDescriptor request with id 1-4'
INFO:apache_beam.utils.subprocess_server:b'22/04/20 02:27:48 INFO org.apache.beam.runners.fnexecution.control.FnApiControlClientPoolService: getProcessBundleDescriptor request with id 1-5'
INFO:apache_beam.utils.subprocess_server:b'22/04/20 02:27:48 WARN software.amazon.awssdk.regions.internal.util.EC2MetadataUtils: Unable to retrieve the requested metadata.'
INFO:apache_beam.utils.subprocess_server:b'22/04/20 02:27:48 WARN software.amazon.awssdk.regions.internal.util.EC2MetadataUtils: Unable to retrieve the requested metadata.'
INFO:apache_beam.utils.subprocess_server:b'22/04/20 02:27:48 WARN software.amazon.awssdk.regions.internal.util.EC2MetadataUtils: Unable to retrieve the requested metadata.'
INFO:apache_beam.utils.subprocess_server:b'22/04/20 02:27:48 WARN software.amazon.awssdk.regions.internal.util.EC2MetadataUtils: Unable to retrieve the requested metadata.'
INFO:apache_beam.utils.subprocess_server:b'22/04/20 02:27:48 INFO org.apache.beam.runners.fnexecution.control.FnApiControlClientPoolService: getProcessBundleDescriptor request with id 1-9'
INFO:apache_beam.utils.subprocess_server:b'22/04/20 02:27:48 INFO org.apache.beam.runners.fnexecution.control.FnApiControlClientPoolService: getProcessBundleDescriptor request with id 1-6'
INFO:apache_beam.utils.subprocess_server:b'22/04/20 02:27:48 INFO org.apache.beam.runners.fnexecution.control.FnApiControlClientPoolService: getProcessBundleDescriptor request with id 1-8'
INFO:apache_beam.utils.subprocess_server:b'22/04/20 02:27:48 INFO org.apache.beam.runners.fnexecution.control.FnApiControlClientPoolService: getProcessBundleDescriptor request with id 1-7'
INFO:apache_beam.utils.subprocess_server:b'22/04/20 02:27:49 INFO org.apache.beam.runners.fnexecution.control.FnApiControlClientPoolService: getProcessBundleDescriptor request with id 1-10'
INFO:apache_beam.utils.subprocess_server:b'22/04/20 02:27:49 INFO org.apache.beam.runners.fnexecution.control.FnApiControlClientPoolService: getProcessBundleDescriptor request with id 1-12'
INFO:apache_beam.utils.subprocess_server:b'22/04/20 02:27:49 INFO org.apache.beam.runners.fnexecution.control.FnApiControlClientPoolService: getProcessBundleDescriptor request with id 1-11'
INFO:apache_beam.utils.subprocess_server:b'22/04/20 02:27:49 INFO org.apache.beam.runners.fnexecution.control.FnApiControlClientPoolService: getProcessBundleDescriptor request with id 1-13'
INFO:apache_beam.utils.subprocess_server:b'22/04/20 02:27:49 WARN software.amazon.awssdk.regions.internal.util.EC2MetadataUtils: Unable to retrieve the requested metadata.'
INFO:apache_beam.utils.subprocess_server:b'22/04/20 02:27:49 WARN software.amazon.awssdk.regions.internal.util.EC2MetadataUtils: Unable to retrieve the requested metadata.'
INFO:apache_beam.utils.subprocess_server:b'22/04/20 02:27:49 WARN software.amazon.awssdk.regions.internal.util.EC2MetadataUtils: Unable to retrieve the requested metadata.'
INFO:apache_beam.utils.subprocess_server:b'22/04/20 02:27:49 WARN software.amazon.awssdk.regions.internal.util.EC2MetadataUtils: Unable to retrieve the requested metadata.'
INFO:apache_beam.utils.subprocess_server:b'22/04/20 02:27:49 INFO org.apache.beam.runners.fnexecution.control.FnApiControlClientPoolService: getProcessBundleDescriptor request with id 1-14'
INFO:apache_beam.utils.subprocess_server:b'22/04/20 02:27:49 WARN software.amazon.awssdk.regions.internal.util.EC2MetadataUtils: Unable to retrieve the requested metadata.'
INFO:apache_beam.utils.subprocess_server:b'22/04/20 02:27:49 WARN software.amazon.awssdk.regions.internal.util.EC2MetadataUtils: Unable to retrieve the requested metadata.'
INFO:apache_beam.utils.subprocess_server:b'22/04/20 02:27:49 WARN software.amazon.awssdk.regions.internal.util.EC2MetadataUtils: Unable to retrieve the requested metadata.'
INFO:apache_beam.utils.subprocess_server:b'22/04/20 02:27:49 WARN software.amazon.awssdk.regions.internal.util.EC2MetadataUtils: Unable to retrieve the requested metadata.'
INFO:apache_beam.utils.subprocess_server:b'22/04/20 02:27:49 INFO org.apache.beam.runners.fnexecution.control.FnApiControlClientPoolService: getProcessBundleDescriptor request with id 1-15'
INFO:apache_beam.utils.subprocess_server:b'22/04/20 02:27:49 INFO org.apache.beam.runners.spark.SparkPipelineRunner: Job BeamApp-jenkins-0420022745-b52edcd0_7f11dfea-335b-4cf2-a555-2375596c1247: Pipeline translated successfully. Computing outputs'
INFO:apache_beam.utils.subprocess_server:b'22/04/20 02:27:49 WARN software.amazon.awssdk.regions.internal.util.EC2MetadataUtils: Unable to retrieve the requested metadata.'
INFO:apache_beam.utils.subprocess_server:b'22/04/20 02:27:49 WARN software.amazon.awssdk.regions.internal.util.EC2MetadataUtils: Unable to retrieve the requested metadata.'
INFO:apache_beam.utils.subprocess_server:b'22/04/20 02:27:49 WARN software.amazon.awssdk.regions.internal.util.EC2MetadataUtils: Unable to retrieve the requested metadata.'
INFO:apache_beam.utils.subprocess_server:b'22/04/20 02:27:49 WARN software.amazon.awssdk.regions.internal.util.EC2MetadataUtils: Unable to retrieve the requested metadata.'
INFO:apache_beam.utils.subprocess_server:b'22/04/20 02:27:49 INFO org.apache.beam.runners.fnexecution.control.FnApiControlClientPoolService: getProcessBundleDescriptor request with id 1-16'
INFO:apache_beam.io.filebasedsink:Starting finalize_write threads with num_shards: 4 (skipped: 0), batches: 4, num_threads: 4
INFO:apache_beam.io.filebasedsink:Renamed 4 shards in 0.01 seconds.
INFO:apache_beam.utils.subprocess_server:b'22/04/20 02:27:49 INFO org.apache.beam.runners.spark.SparkPipelineRunner: Job BeamApp-jenkins-0420022745-b52edcd0_7f11dfea-335b-4cf2-a555-2375596c1247 finished.'
INFO:apache_beam.runners.portability.portable_runner:Job state changed to DONE
Exception in thread run_worker_1-1:
Traceback (most recent call last):
  File "/usr/lib/python3.8/threading.py", line 932, in _bootstrap_inner
Exception in thread read_state:
Traceback (most recent call last):
  File "/usr/lib/python3.8/threading.py", line 932, in _bootstrap_inner
    self.run()
  File "/usr/lib/python3.8/threading.py", line 870, in run
    self._target(*self._args, **self._kwargs)
  File "<https://ci-beam.apache.org/job/beam_PostCommit_Python38/ws/src/sdks/python/apache_beam/runners/worker/sdk_worker.py",> line 234, in run
    self.run()
  File "/usr/lib/python3.8/threading.py", line 870, in run
    for work_request in self._control_stub.Control(get_responses()):
  File "<https://ci-beam.apache.org/job/beam_PostCommit_Python38/ws/src/build/gradleenv/2022703442/lib/python3.8/site-packages/grpc/_channel.py",> line 426, in __next__
    self._target(*self._args, **self._kwargs)
  File "<https://ci-beam.apache.org/job/beam_PostCommit_Python38/ws/src/sdks/python/apache_beam/runners/worker/sdk_worker.py",> line 990, in pull_responses
    return self._next()
  File "<https://ci-beam.apache.org/job/beam_PostCommit_Python38/ws/src/build/gradleenv/2022703442/lib/python3.8/site-packages/grpc/_channel.py",> line 826, in _next
    raise self
grpc._channel._MultiThreadedRendezvous: <_MultiThreadedRendezvous of RPC that terminated with:
	status = StatusCode.UNAVAILABLE
	details = "Connection reset by peer"
	debug_error_string = "{"created":"@1650421669.915931241","description":"Error received from peer ipv6:[::1]:46243","file":"src/core/lib/surface/call.cc","file_line":903,"grpc_message":"Connection reset by peer","grpc_status":14}"
>
ERROR:apache_beam.runners.worker.data_plane:Failed to read inputs in the data plane.
Traceback (most recent call last):
  File "<https://ci-beam.apache.org/job/beam_PostCommit_Python38/ws/src/sdks/python/apache_beam/runners/worker/data_plane.py",> line 634, in _read_inputs
    for elements in elements_iterator:
  File "<https://ci-beam.apache.org/job/beam_PostCommit_Python38/ws/src/build/gradleenv/2022703442/lib/python3.8/site-packages/grpc/_channel.py",> line 426, in __next__
    return self._next()
  File "<https://ci-beam.apache.org/job/beam_PostCommit_Python38/ws/src/build/gradleenv/2022703442/lib/python3.8/site-packages/grpc/_channel.py",> line 826, in _next
    raise self
grpc._channel._MultiThreadedRendezvous: <_MultiThreadedRendezvous of RPC that terminated with:
	status = StatusCode.UNAVAILABLE
	details = "Socket closed"
	debug_error_string = "{"created":"@1650421669.915879994","description":"Error received from peer ipv6:[::1]:35507","file":"src/core/lib/surface/call.cc","file_line":903,"grpc_message":"Socket closed","grpc_status":14}"
>
Exception in thread read_grpc_client_inputs:
Traceback (most recent call last):
  File "/usr/lib/python3.8/threading.py", line 932, in _bootstrap_inner
    for response in responses:
  File "<https://ci-beam.apache.org/job/beam_PostCommit_Python38/ws/src/build/gradleenv/2022703442/lib/python3.8/site-packages/grpc/_channel.py",> line 426, in __next__
    self.run()
  File "/usr/lib/python3.8/threading.py", line 870, in run
    return self._next()
  File "<https://ci-beam.apache.org/job/beam_PostCommit_Python38/ws/src/build/gradleenv/2022703442/lib/python3.8/site-packages/grpc/_channel.py",> line 826, in _next
    self._target(*self._args, **self._kwargs)
  File "<https://ci-beam.apache.org/job/beam_PostCommit_Python38/ws/src/sdks/python/apache_beam/runners/worker/data_plane.py",> line 651, in <lambda>
    raise self
grpc._channel._MultiThreadedRendezvous: <_MultiThreadedRendezvous of RPC that terminated with:
	status = StatusCode.UNAVAILABLE
	details = "Socket closed"
	debug_error_string = "{"created":"@1650421669.915888761","description":"Error received from peer ipv6:[::1]:38207","file":"src/core/lib/surface/call.cc","file_line":903,"grpc_message":"Socket closed","grpc_status":14}"
>
    target=lambda: self._read_inputs(elements_iterator),
  File "<https://ci-beam.apache.org/job/beam_PostCommit_Python38/ws/src/sdks/python/apache_beam/runners/worker/data_plane.py",> line 634, in _read_inputs
    for elements in elements_iterator:
  File "<https://ci-beam.apache.org/job/beam_PostCommit_Python38/ws/src/build/gradleenv/2022703442/lib/python3.8/site-packages/grpc/_channel.py",> line 426, in __next__
    return self._next()
  File "<https://ci-beam.apache.org/job/beam_PostCommit_Python38/ws/src/build/gradleenv/2022703442/lib/python3.8/site-packages/grpc/_channel.py",> line 826, in _next
    raise self
grpc._channel._MultiThreadedRendezvous: <_MultiThreadedRendezvous of RPC that terminated with:
	status = StatusCode.UNAVAILABLE
	details = "Socket closed"
	debug_error_string = "{"created":"@1650421669.915879994","description":"Error received from peer ipv6:[::1]:35507","file":"src/core/lib/surface/call.cc","file_line":903,"grpc_message":"Socket closed","grpc_status":14}"
>

> Task :sdks:python:test-suites:portable:py38:postCommitPy38

> Task :sdks:python:test-suites:dataflow:py38:postCommitIT
E0420 02:28:26.016427430 3613423 fork_posix.cc:70]           Fork support is only compatible with the epoll1 and poll polling strategies
E0420 02:30:48.312648471 3613463 fork_posix.cc:70]           Fork support is only compatible with the epoll1 and poll polling strategies
E0420 02:33:15.443168881 3613482 fork_posix.cc:70]           Fork support is only compatible with the epoll1 and poll polling strategies
E0420 02:35:03.415400966 3613440 fork_posix.cc:70]           Fork support is only compatible with the epoll1 and poll polling strategies
E0420 02:40:30.536181744 3613482 fork_posix.cc:70]           Fork support is only compatible with the epoll1 and poll polling strategies
E0420 02:41:48.423836324 3613440 fork_posix.cc:70]           Fork support is only compatible with the epoll1 and poll polling strategies
E0420 02:47:51.165084097 3613482 fork_posix.cc:70]           Fork support is only compatible with the epoll1 and poll polling strategies
E0420 02:49:49.118317737 3613440 fork_posix.cc:70]           Fork support is only compatible with the epoll1 and poll polling strategies
E0420 02:52:56.107860431 3613463 fork_posix.cc:70]           Fork support is only compatible with the epoll1 and poll polling strategies
E0420 02:58:49.057390956 3613440 fork_posix.cc:70]           Fork support is only compatible with the epoll1 and poll polling strategies
E0420 03:05:10.914759550 3613440 fork_posix.cc:70]           Fork support is only compatible with the epoll1 and poll polling strategies
E0420 03:09:38.894184513 3613463 fork_posix.cc:70]           Fork support is only compatible with the epoll1 and poll polling strategies
E0420 03:13:15.865887932 3613440 fork_posix.cc:70]           Fork support is only compatible with the epoll1 and poll polling strategies
E0420 03:21:05.379210193 3613440 fork_posix.cc:70]           Fork support is only compatible with the epoll1 and poll polling strategies
E0420 03:26:07.734007930 3613444 fork_posix.cc:70]           Fork support is only compatible with the epoll1 and poll polling strategies
E0420 03:26:25.593357075 3613463 fork_posix.cc:70]           Fork support is only compatible with the epoll1 and poll polling strategies
E0420 03:28:12.723705620 3613440 fork_posix.cc:70]           Fork support is only compatible with the epoll1 and poll polling strategies
E0420 03:36:05.997792917 3613440 fork_posix.cc:70]           Fork support is only compatible with the epoll1 and poll polling strategies
E0420 03:36:41.880163800 3613444 fork_posix.cc:70]           Fork support is only compatible with the epoll1 and poll polling strategies
E0420 03:43:58.766049277 3613440 fork_posix.cc:70]           Fork support is only compatible with the epoll1 and poll polling strategies

> Task :sdks:python:test-suites:dataflow:py38:postCommitIT FAILED

FAILURE: Build failed with an exception.

* Where:
Script '<https://ci-beam.apache.org/job/beam_PostCommit_Python38/ws/src/sdks/python/test-suites/dataflow/common.gradle'> line: 121

* What went wrong:
Execution failed for task ':sdks:python:test-suites:dataflow:py38:postCommitIT'.
> Process 'command 'sh'' finished with non-zero exit value 1

* Try:
> Run with --stacktrace option to get the stack trace.
> Run with --info or --debug option to get more log output.
> Run with --scan to get full insights.

* Get more help at https://help.gradle.org

Deprecated Gradle features were used in this build, making it incompatible with Gradle 8.0.

You can use '--warning-mode all' to show the individual deprecation warnings and determine if they come from your own scripts or plugins.

See https://docs.gradle.org/7.4/userguide/command_line_interface.html#sec:command_line_warnings

Execution optimizations have been disabled for 1 invalid unit(s) of work during this build to ensure correctness.
Please consult deprecation warnings for more details.

BUILD FAILED in 1h 36m 33s
219 actionable tasks: 153 executed, 60 from cache, 6 up-to-date

Publishing build scan...
https://gradle.com/s/q26fiulrtdpyc

Build step 'Invoke Gradle script' changed build result to FAILURE
Build step 'Invoke Gradle script' marked build as failure

---------------------------------------------------------------------
To unsubscribe, e-mail: builds-unsubscribe@beam.apache.org
For additional commands, e-mail: builds-help@beam.apache.org


Jenkins build is back to normal : beam_PostCommit_Python38 #2542

Posted by Apache Jenkins Server <je...@builds.apache.org>.
See <https://ci-beam.apache.org/job/beam_PostCommit_Python38/2542/display/redirect?page=changes>


---------------------------------------------------------------------
To unsubscribe, e-mail: builds-unsubscribe@beam.apache.org
For additional commands, e-mail: builds-help@beam.apache.org


Build failed in Jenkins: beam_PostCommit_Python38 #2541

Posted by Apache Jenkins Server <je...@builds.apache.org>.
See <https://ci-beam.apache.org/job/beam_PostCommit_Python38/2541/display/redirect?page=changes>

Changes:

[noreply] [BEAM-14112] Fixed ReadFromBigQuery with Interactive Beam (#17306)


------------------------------------------
[...truncated 31.35 MB...]
log_location: "/usr/local/lib/python3.8/site-packages/apache_beam/runners/worker/data_plane.py:782"
thread: "MainThread"

INFO:root:severity: INFO
timestamp {
  seconds: 1650478743
  nanos: 445564985
}
message: "Closing all cached gRPC state handlers."
log_location: "/usr/local/lib/python3.8/site-packages/apache_beam/runners/worker/sdk_worker.py:859"
thread: "MainThread"

INFO:root:severity: INFO
timestamp {
  seconds: 1650478743
  nanos: 445911407
}
message: "Done consuming work."
log_location: "/usr/local/lib/python3.8/site-packages/apache_beam/runners/worker/sdk_worker.py:257"
thread: "MainThread"

INFO:root:severity: INFO
timestamp {
  seconds: 1650478743
  nanos: 446068048
}
message: "Python sdk harness exiting."
log_location: "/usr/local/lib/python3.8/site-packages/apache_beam/runners/worker/sdk_worker_main.py:181"
thread: "MainThread"

INFO:apache_beam.runners.portability.local_job_service:Completed job in 12.575263738632202 seconds with state DONE.
INFO:root:Completed job in 12.575263738632202 seconds with state DONE.
INFO:apache_beam.runners.portability.portable_runner:Job state changed to DONE

> Task :sdks:python:test-suites:portable:py38:portableWordCountSparkRunnerBatch
INFO:apache_beam.runners.worker.worker_pool_main:Listening for workers at localhost:41593
WARNING:root:Make sure that locally built Python SDK docker image has Python 3.8 interpreter.
INFO:root:Default Python SDK image for environment is apache/beam_python3.8_sdk:2.39.0.dev
INFO:apache_beam.runners.portability.fn_api_runner.translations:==================== <function pack_combiners at 0x7f7aeb7b6430> ====================
INFO:apache_beam.runners.portability.fn_api_runner.translations:==================== <function lift_combiners at 0x7f7aeb7b64c0> ====================
INFO:apache_beam.runners.portability.fn_api_runner.translations:==================== <function sort_stages at 0x7f7aeb7b6c10> ====================
INFO:apache_beam.utils.subprocess_server:Starting service with ['java' '-jar' '<https://ci-beam.apache.org/job/beam_PostCommit_Python38/ws/src/runners/spark/2/job-server/build/libs/beam-runners-spark-job-server-2.39.0-SNAPSHOT.jar'> '--spark-master-url' 'local[4]' '--artifacts-dir' '/tmp/beam-temphnk09mvk/artifactsgny5xmhs' '--job-port' '43255' '--artifact-port' '0' '--expansion-port' '0']
E0420 18:19:06.861619409  437799 fork_posix.cc:70]           Fork support is only compatible with the epoll1 and poll polling strategies
WARNING:root:Waiting for grpc channel to be ready at localhost:43255.
INFO:apache_beam.utils.subprocess_server:b'22/04/20 18:19:11 WARN software.amazon.awssdk.regions.internal.util.EC2MetadataUtils: Unable to retrieve the requested metadata.'
WARNING:root:Waiting for grpc channel to be ready at localhost:43255.
INFO:apache_beam.utils.subprocess_server:b'22/04/20 18:19:13 INFO org.apache.beam.runners.jobsubmission.JobServerDriver: ArtifactStagingService started on localhost:35333'
WARNING:root:Waiting for grpc channel to be ready at localhost:43255.
INFO:apache_beam.utils.subprocess_server:b'22/04/20 18:19:14 INFO org.apache.beam.runners.jobsubmission.JobServerDriver: Java ExpansionService started on localhost:42685'
INFO:apache_beam.utils.subprocess_server:b'22/04/20 18:19:14 INFO org.apache.beam.runners.jobsubmission.JobServerDriver: JobService started on localhost:43255'
INFO:apache_beam.utils.subprocess_server:b'22/04/20 18:19:14 INFO org.apache.beam.runners.jobsubmission.JobServerDriver: Job server now running, terminate with Ctrl+C'
WARNING:root:Waiting for grpc channel to be ready at localhost:43255.
WARNING:apache_beam.options.pipeline_options:Discarding unparseable args: ['--parallelism=2']
INFO:apache_beam.utils.subprocess_server:b'22/04/20 18:19:16 INFO org.apache.beam.runners.fnexecution.artifact.ArtifactStagingService: Staging artifacts for job_f79d83f3-25a1-4f92-b437-c52c3d5a381a.'
INFO:apache_beam.utils.subprocess_server:b'22/04/20 18:19:16 INFO org.apache.beam.runners.fnexecution.artifact.ArtifactStagingService: Resolving artifacts for job_f79d83f3-25a1-4f92-b437-c52c3d5a381a.ref_Environment_default_environment_1.'
INFO:apache_beam.utils.subprocess_server:b'22/04/20 18:19:16 INFO org.apache.beam.runners.fnexecution.artifact.ArtifactStagingService: Getting 1 artifacts for job_f79d83f3-25a1-4f92-b437-c52c3d5a381a.null.'
INFO:apache_beam.utils.subprocess_server:b'22/04/20 18:19:16 INFO org.apache.beam.runners.fnexecution.artifact.ArtifactStagingService: Artifacts fully staged for job_f79d83f3-25a1-4f92-b437-c52c3d5a381a.'
INFO:apache_beam.utils.subprocess_server:b'22/04/20 18:19:17 INFO org.apache.beam.runners.spark.SparkJobInvoker: Invoking job BeamApp-jenkins-0420181917-86414bcd_5a0ff5b8-80e6-4077-9499-b94c1d1a3e82'
INFO:apache_beam.utils.subprocess_server:b'22/04/20 18:19:17 INFO org.apache.beam.runners.jobsubmission.JobInvocation: Starting job invocation BeamApp-jenkins-0420181917-86414bcd_5a0ff5b8-80e6-4077-9499-b94c1d1a3e82'
INFO:apache_beam.runners.portability.portable_runner:Environment "LOOPBACK" has started a component necessary for the execution. Be sure to run the pipeline using
  with Pipeline() as p:
    p.apply(..)
This ensures that the pipeline finishes before this program exits.
INFO:apache_beam.runners.portability.portable_runner:Job state changed to STOPPED
INFO:apache_beam.runners.portability.portable_runner:Job state changed to STARTING
INFO:apache_beam.runners.portability.portable_runner:Job state changed to RUNNING
INFO:apache_beam.utils.subprocess_server:b'22/04/20 18:19:18 INFO org.apache.beam.runners.spark.translation.SparkContextFactory: Creating a brand new Spark Context.'
INFO:apache_beam.utils.subprocess_server:b'22/04/20 18:19:19 WARN org.apache.hadoop.util.NativeCodeLoader: Unable to load native-hadoop library for your platform... using builtin-java classes where applicable'
INFO:apache_beam.utils.subprocess_server:b'22/04/20 18:19:22 INFO org.apache.beam.runners.spark.aggregators.AggregatorsAccumulator: Instantiated aggregators accumulator:'
INFO:apache_beam.utils.subprocess_server:b'22/04/20 18:19:22 INFO org.apache.beam.runners.spark.metrics.MetricsAccumulator: Instantiated metrics accumulator: MetricQueryResults()'
INFO:apache_beam.utils.subprocess_server:b'22/04/20 18:19:23 WARN software.amazon.awssdk.regions.internal.util.EC2MetadataUtils: Unable to retrieve the requested metadata.'
INFO:apache_beam.utils.subprocess_server:b'22/04/20 18:19:23 INFO org.apache.beam.runners.spark.SparkPipelineRunner: Running job BeamApp-jenkins-0420181917-86414bcd_5a0ff5b8-80e6-4077-9499-b94c1d1a3e82 on Spark master local[4]'
INFO:apache_beam.utils.subprocess_server:b'22/04/20 18:19:24 WARN software.amazon.awssdk.regions.internal.util.EC2MetadataUtils: Unable to retrieve the requested metadata.'
INFO:apache_beam.utils.subprocess_server:b'22/04/20 18:19:24 WARN software.amazon.awssdk.regions.internal.util.EC2MetadataUtils: Unable to retrieve the requested metadata.'
INFO:apache_beam.utils.subprocess_server:b'22/04/20 18:19:24 WARN software.amazon.awssdk.regions.internal.util.EC2MetadataUtils: Unable to retrieve the requested metadata.'
INFO:apache_beam.utils.subprocess_server:b'22/04/20 18:19:24 WARN software.amazon.awssdk.regions.internal.util.EC2MetadataUtils: Unable to retrieve the requested metadata.'
INFO:apache_beam.runners.worker.statecache:Creating state cache with size 0
INFO:apache_beam.runners.worker.sdk_worker:Creating insecure control channel for localhost:41477.
INFO:apache_beam.runners.worker.sdk_worker:Control channel established.
INFO:apache_beam.runners.worker.sdk_worker:Initializing SDKHarness with unbounded number of workers.
INFO:apache_beam.utils.subprocess_server:b'22/04/20 18:19:25 INFO org.apache.beam.runners.fnexecution.control.FnApiControlClientPoolService: Beam Fn Control client connected with id 1-1'
INFO:apache_beam.utils.subprocess_server:b'22/04/20 18:19:25 INFO org.apache.beam.runners.fnexecution.control.FnApiControlClientPoolService: getProcessBundleDescriptor request with id 1-2'
INFO:apache_beam.runners.worker.sdk_worker:Creating insecure state channel for localhost:38309.
INFO:apache_beam.runners.worker.sdk_worker:State channel established.
INFO:apache_beam.runners.worker.data_plane:Creating client data channel for localhost:45309
INFO:apache_beam.utils.subprocess_server:b'22/04/20 18:19:25 INFO org.apache.beam.runners.fnexecution.data.GrpcDataService: Beam Fn Data client connected.'
INFO:apache_beam.utils.subprocess_server:b'22/04/20 18:19:25 INFO org.apache.beam.runners.fnexecution.control.FnApiControlClientPoolService: getProcessBundleDescriptor request with id 1-3'
INFO:apache_beam.utils.subprocess_server:b'22/04/20 18:19:25 WARN software.amazon.awssdk.regions.internal.util.EC2MetadataUtils: Unable to retrieve the requested metadata.'
INFO:apache_beam.utils.subprocess_server:b'22/04/20 18:19:25 WARN software.amazon.awssdk.regions.internal.util.EC2MetadataUtils: Unable to retrieve the requested metadata.'
INFO:apache_beam.utils.subprocess_server:b'22/04/20 18:19:25 WARN software.amazon.awssdk.regions.internal.util.EC2MetadataUtils: Unable to retrieve the requested metadata.'
INFO:apache_beam.utils.subprocess_server:b'22/04/20 18:19:25 WARN software.amazon.awssdk.regions.internal.util.EC2MetadataUtils: Unable to retrieve the requested metadata.'
INFO:apache_beam.utils.subprocess_server:b'22/04/20 18:19:25 INFO org.apache.beam.runners.fnexecution.control.FnApiControlClientPoolService: getProcessBundleDescriptor request with id 1-4'
INFO:apache_beam.utils.subprocess_server:b'22/04/20 18:19:25 INFO org.apache.beam.runners.fnexecution.control.FnApiControlClientPoolService: getProcessBundleDescriptor request with id 1-5'
INFO:apache_beam.utils.subprocess_server:b'22/04/20 18:19:25 WARN software.amazon.awssdk.regions.internal.util.EC2MetadataUtils: Unable to retrieve the requested metadata.'
INFO:apache_beam.utils.subprocess_server:b'22/04/20 18:19:25 WARN software.amazon.awssdk.regions.internal.util.EC2MetadataUtils: Unable to retrieve the requested metadata.'
INFO:apache_beam.utils.subprocess_server:b'22/04/20 18:19:25 WARN software.amazon.awssdk.regions.internal.util.EC2MetadataUtils: Unable to retrieve the requested metadata.'
INFO:apache_beam.utils.subprocess_server:b'22/04/20 18:19:25 WARN software.amazon.awssdk.regions.internal.util.EC2MetadataUtils: Unable to retrieve the requested metadata.'
INFO:apache_beam.utils.subprocess_server:b'22/04/20 18:19:25 INFO org.apache.beam.runners.fnexecution.control.FnApiControlClientPoolService: getProcessBundleDescriptor request with id 1-7'
INFO:apache_beam.utils.subprocess_server:b'22/04/20 18:19:25 INFO org.apache.beam.runners.fnexecution.control.FnApiControlClientPoolService: getProcessBundleDescriptor request with id 1-6'
INFO:apache_beam.utils.subprocess_server:b'22/04/20 18:19:25 INFO org.apache.beam.runners.fnexecution.control.FnApiControlClientPoolService: getProcessBundleDescriptor request with id 1-8'
INFO:apache_beam.utils.subprocess_server:b'22/04/20 18:19:25 INFO org.apache.beam.runners.fnexecution.control.FnApiControlClientPoolService: getProcessBundleDescriptor request with id 1-9'
INFO:apache_beam.utils.subprocess_server:b'22/04/20 18:19:25 INFO org.apache.beam.runners.fnexecution.control.FnApiControlClientPoolService: getProcessBundleDescriptor request with id 1-10'
INFO:apache_beam.utils.subprocess_server:b'22/04/20 18:19:25 INFO org.apache.beam.runners.fnexecution.control.FnApiControlClientPoolService: getProcessBundleDescriptor request with id 1-11'
INFO:apache_beam.utils.subprocess_server:b'22/04/20 18:19:25 INFO org.apache.beam.runners.fnexecution.control.FnApiControlClientPoolService: getProcessBundleDescriptor request with id 1-12'
INFO:apache_beam.utils.subprocess_server:b'22/04/20 18:19:25 INFO org.apache.beam.runners.fnexecution.control.FnApiControlClientPoolService: getProcessBundleDescriptor request with id 1-13'
INFO:apache_beam.utils.subprocess_server:b'22/04/20 18:19:25 WARN software.amazon.awssdk.regions.internal.util.EC2MetadataUtils: Unable to retrieve the requested metadata.'
INFO:apache_beam.utils.subprocess_server:b'22/04/20 18:19:25 WARN software.amazon.awssdk.regions.internal.util.EC2MetadataUtils: Unable to retrieve the requested metadata.'
INFO:apache_beam.utils.subprocess_server:b'22/04/20 18:19:25 WARN software.amazon.awssdk.regions.internal.util.EC2MetadataUtils: Unable to retrieve the requested metadata.'
INFO:apache_beam.utils.subprocess_server:b'22/04/20 18:19:25 WARN software.amazon.awssdk.regions.internal.util.EC2MetadataUtils: Unable to retrieve the requested metadata.'
INFO:apache_beam.utils.subprocess_server:b'22/04/20 18:19:26 INFO org.apache.beam.runners.fnexecution.control.FnApiControlClientPoolService: getProcessBundleDescriptor request with id 1-14'
INFO:apache_beam.utils.subprocess_server:b'22/04/20 18:19:26 WARN software.amazon.awssdk.regions.internal.util.EC2MetadataUtils: Unable to retrieve the requested metadata.'
INFO:apache_beam.utils.subprocess_server:b'22/04/20 18:19:26 WARN software.amazon.awssdk.regions.internal.util.EC2MetadataUtils: Unable to retrieve the requested metadata.'
INFO:apache_beam.utils.subprocess_server:b'22/04/20 18:19:26 WARN software.amazon.awssdk.regions.internal.util.EC2MetadataUtils: Unable to retrieve the requested metadata.'
INFO:apache_beam.utils.subprocess_server:b'22/04/20 18:19:26 WARN software.amazon.awssdk.regions.internal.util.EC2MetadataUtils: Unable to retrieve the requested metadata.'
INFO:apache_beam.utils.subprocess_server:b'22/04/20 18:19:26 INFO org.apache.beam.runners.fnexecution.control.FnApiControlClientPoolService: getProcessBundleDescriptor request with id 1-15'
INFO:apache_beam.utils.subprocess_server:b'22/04/20 18:19:26 INFO org.apache.beam.runners.spark.SparkPipelineRunner: Job BeamApp-jenkins-0420181917-86414bcd_5a0ff5b8-80e6-4077-9499-b94c1d1a3e82: Pipeline translated successfully. Computing outputs'
INFO:apache_beam.utils.subprocess_server:b'22/04/20 18:19:26 WARN software.amazon.awssdk.regions.internal.util.EC2MetadataUtils: Unable to retrieve the requested metadata.'
INFO:apache_beam.utils.subprocess_server:b'22/04/20 18:19:26 WARN software.amazon.awssdk.regions.internal.util.EC2MetadataUtils: Unable to retrieve the requested metadata.'
INFO:apache_beam.utils.subprocess_server:b'22/04/20 18:19:26 WARN software.amazon.awssdk.regions.internal.util.EC2MetadataUtils: Unable to retrieve the requested metadata.'
INFO:apache_beam.utils.subprocess_server:b'22/04/20 18:19:26 WARN software.amazon.awssdk.regions.internal.util.EC2MetadataUtils: Unable to retrieve the requested metadata.'
INFO:apache_beam.utils.subprocess_server:b'22/04/20 18:19:26 INFO org.apache.beam.runners.fnexecution.control.FnApiControlClientPoolService: getProcessBundleDescriptor request with id 1-16'
INFO:apache_beam.io.filebasedsink:Starting finalize_write threads with num_shards: 4 (skipped: 0), batches: 4, num_threads: 4
INFO:apache_beam.io.filebasedsink:Renamed 4 shards in 0.01 seconds.
INFO:apache_beam.utils.subprocess_server:b'22/04/20 18:19:26 INFO org.apache.beam.runners.spark.SparkPipelineRunner: Job BeamApp-jenkins-0420181917-86414bcd_5a0ff5b8-80e6-4077-9499-b94c1d1a3e82 finished.'
INFO:apache_beam.runners.portability.portable_runner:Job state changed to DONE
Exception in thread read_state:
Traceback (most recent call last):
  File "/usr/lib/python3.8/threading.py", line 932, in _bootstrap_inner
Exception in thread run_worker_1-1:
Traceback (most recent call last):
  File "/usr/lib/python3.8/threading.py", line 932, in _bootstrap_inner
    self.run()
  File "/usr/lib/python3.8/threading.py", line 870, in run
    self.run()
  File "/usr/lib/python3.8/threading.py", line 870, in run
    self._target(*self._args, **self._kwargs)
  File "<https://ci-beam.apache.org/job/beam_PostCommit_Python38/ws/src/sdks/python/apache_beam/runners/worker/sdk_worker.py",> line 990, in pull_responses
    for response in responses:
  File "<https://ci-beam.apache.org/job/beam_PostCommit_Python38/ws/src/build/gradleenv/2022703442/lib/python3.8/site-packages/grpc/_channel.py",> line 426, in __next__
    self._target(*self._args, **self._kwargs)
  File "<https://ci-beam.apache.org/job/beam_PostCommit_Python38/ws/src/sdks/python/apache_beam/runners/worker/sdk_worker.py",> line 234, in run
    return self._next()
  File "<https://ci-beam.apache.org/job/beam_PostCommit_Python38/ws/src/build/gradleenv/2022703442/lib/python3.8/site-packages/grpc/_channel.py",> line 826, in _next
    raise self
grpc._channel._MultiThreadedRendezvous: <_MultiThreadedRendezvous of RPC that terminated with:
	status = StatusCode.UNAVAILABLE
	details = "Socket closed"
	debug_error_string = "{"created":"@1650478767.059456787","description":"Error received from peer ipv6:[::1]:38309","file":"src/core/lib/surface/call.cc","file_line":903,"grpc_message":"Socket closed","grpc_status":14}"
>
    for work_request in self._control_stub.Control(get_responses()):
  File "<https://ci-beam.apache.org/job/beam_PostCommit_Python38/ws/src/build/gradleenv/2022703442/lib/python3.8/site-packages/grpc/_channel.py",> line 426, in __next__
    return self._next()
  File "<https://ci-beam.apache.org/job/beam_PostCommit_Python38/ws/src/build/gradleenv/2022703442/lib/python3.8/site-packages/grpc/_channel.py",> line 826, in _next
ERROR:apache_beam.runners.worker.data_plane:Failed to read inputs in the data plane.
Traceback (most recent call last):
  File "<https://ci-beam.apache.org/job/beam_PostCommit_Python38/ws/src/sdks/python/apache_beam/runners/worker/data_plane.py",> line 634, in _read_inputs
    for elements in elements_iterator:
  File "<https://ci-beam.apache.org/job/beam_PostCommit_Python38/ws/src/build/gradleenv/2022703442/lib/python3.8/site-packages/grpc/_channel.py",> line 426, in __next__
    return self._next()
  File "<https://ci-beam.apache.org/job/beam_PostCommit_Python38/ws/src/build/gradleenv/2022703442/lib/python3.8/site-packages/grpc/_channel.py",> line 826, in _next
    raise self
grpc._channel._MultiThreadedRendezvous: <_MultiThreadedRendezvous of RPC that terminated with:
	status = StatusCode.UNAVAILABLE
	details = "Connection reset by peer"
	debug_error_string = "{"created":"@1650478767.059456211","description":"Error received from peer ipv6:[::1]:45309","file":"src/core/lib/surface/call.cc","file_line":903,"grpc_message":"Connection reset by peer","grpc_status":14}"
>
    raise self
grpc._channel._MultiThreadedRendezvous: <_MultiThreadedRendezvous of RPC that terminated with:
	status = StatusCode.UNAVAILABLE
	details = "Socket closed"
	debug_error_string = "{"created":"@1650478767.059456631","description":"Error received from peer ipv6:[::1]:41477","file":"src/core/lib/surface/call.cc","file_line":903,"grpc_message":"Socket closed","grpc_status":14}"
>
Exception in thread read_grpc_client_inputs:
Traceback (most recent call last):
  File "/usr/lib/python3.8/threading.py", line 932, in _bootstrap_inner
    self.run()
  File "/usr/lib/python3.8/threading.py", line 870, in run
    self._target(*self._args, **self._kwargs)
  File "<https://ci-beam.apache.org/job/beam_PostCommit_Python38/ws/src/sdks/python/apache_beam/runners/worker/data_plane.py",> line 651, in <lambda>
    target=lambda: self._read_inputs(elements_iterator),
  File "<https://ci-beam.apache.org/job/beam_PostCommit_Python38/ws/src/sdks/python/apache_beam/runners/worker/data_plane.py",> line 634, in _read_inputs
    for elements in elements_iterator:
  File "<https://ci-beam.apache.org/job/beam_PostCommit_Python38/ws/src/build/gradleenv/2022703442/lib/python3.8/site-packages/grpc/_channel.py",> line 426, in __next__
    return self._next()
  File "<https://ci-beam.apache.org/job/beam_PostCommit_Python38/ws/src/build/gradleenv/2022703442/lib/python3.8/site-packages/grpc/_channel.py",> line 826, in _next
    raise self
grpc._channel._MultiThreadedRendezvous: <_MultiThreadedRendezvous of RPC that terminated with:
	status = StatusCode.UNAVAILABLE
	details = "Connection reset by peer"
	debug_error_string = "{"created":"@1650478767.059456211","description":"Error received from peer ipv6:[::1]:45309","file":"src/core/lib/surface/call.cc","file_line":903,"grpc_message":"Connection reset by peer","grpc_status":14}"
>

> Task :sdks:python:test-suites:portable:py38:postCommitPy38

> Task :sdks:python:test-suites:dataflow:py38:postCommitIT
E0420 18:20:41.368176369  343780 fork_posix.cc:70]           Fork support is only compatible with the epoll1 and poll polling strategies
E0420 18:23:47.856387854  343980 fork_posix.cc:70]           Fork support is only compatible with the epoll1 and poll polling strategies
E0420 18:25:38.152582915  344032 fork_posix.cc:70]           Fork support is only compatible with the epoll1 and poll polling strategies
E0420 18:28:57.368380595  343780 fork_posix.cc:70]           Fork support is only compatible with the epoll1 and poll polling strategies
E0420 18:31:34.800346959  343980 fork_posix.cc:70]           Fork support is only compatible with the epoll1 and poll polling strategies
E0420 18:36:34.363430857  343780 fork_posix.cc:70]           Fork support is only compatible with the epoll1 and poll polling strategies
E0420 18:39:44.095371040  343980 fork_posix.cc:70]           Fork support is only compatible with the epoll1 and poll polling strategies
E0420 18:40:27.826433168  344032 fork_posix.cc:70]           Fork support is only compatible with the epoll1 and poll polling strategies
E0420 18:48:06.062192464  343980 fork_posix.cc:70]           Fork support is only compatible with the epoll1 and poll polling strategies
E0420 18:55:43.629966430  343980 fork_posix.cc:70]           Fork support is only compatible with the epoll1 and poll polling strategies
E0420 18:57:22.492906061  344032 fork_posix.cc:70]           Fork support is only compatible with the epoll1 and poll polling strategies
E0420 19:04:06.802796669  343980 fork_posix.cc:70]           Fork support is only compatible with the epoll1 and poll polling strategies
E0420 19:10:41.446403463  343980 fork_posix.cc:70]           Fork support is only compatible with the epoll1 and poll polling strategies
E0420 19:12:34.919685373  344018 fork_posix.cc:70]           Fork support is only compatible with the epoll1 and poll polling strategies
E0420 19:14:07.132500543  344032 fork_posix.cc:70]           Fork support is only compatible with the epoll1 and poll polling strategies
E0420 19:21:26.023116912  343980 fork_posix.cc:70]           Fork support is only compatible with the epoll1 and poll polling strategies
E0420 19:23:31.810573031  344018 fork_posix.cc:70]           Fork support is only compatible with the epoll1 and poll polling strategies
E0420 19:28:25.390610151  343980 fork_posix.cc:70]           Fork support is only compatible with the epoll1 and poll polling strategies

> Task :sdks:python:test-suites:dataflow:py38:postCommitIT FAILED

FAILURE: Build failed with an exception.

* Where:
Script '<https://ci-beam.apache.org/job/beam_PostCommit_Python38/ws/src/sdks/python/test-suites/dataflow/common.gradle'> line: 121

* What went wrong:
Execution failed for task ':sdks:python:test-suites:dataflow:py38:postCommitIT'.
> Process 'command 'sh'' finished with non-zero exit value 1

* Try:
> Run with --stacktrace option to get the stack trace.
> Run with --info or --debug option to get more log output.
> Run with --scan to get full insights.

* Get more help at https://help.gradle.org

Deprecated Gradle features were used in this build, making it incompatible with Gradle 8.0.

You can use '--warning-mode all' to show the individual deprecation warnings and determine if they come from your own scripts or plugins.

See https://docs.gradle.org/7.4/userguide/command_line_interface.html#sec:command_line_warnings

Execution optimizations have been disabled for 1 invalid unit(s) of work during this build to ensure correctness.
Please consult deprecation warnings for more details.

BUILD FAILED in 1h 34m 25s
220 actionable tasks: 150 executed, 64 from cache, 6 up-to-date

Publishing build scan...
https://gradle.com/s/nvfwdfzgoh2d2

Build step 'Invoke Gradle script' changed build result to FAILURE
Build step 'Invoke Gradle script' marked build as failure

---------------------------------------------------------------------
To unsubscribe, e-mail: builds-unsubscribe@beam.apache.org
For additional commands, e-mail: builds-help@beam.apache.org


Build failed in Jenkins: beam_PostCommit_Python38 #2540

Posted by Apache Jenkins Server <je...@builds.apache.org>.
See <https://ci-beam.apache.org/job/beam_PostCommit_Python38/2540/display/redirect?page=changes>

Changes:

[mmack] [BEAM-14323] Improve IDE integration of Spark cross version builds


------------------------------------------
[...truncated 35.79 MB...]
apache_beam/io/gcp/bigquery.py:2143
apache_beam/io/gcp/bigquery.py:2143
apache_beam/io/gcp/bigquery.py:2143
apache_beam/io/gcp/bigquery.py:2143
apache_beam/io/gcp/bigquery.py:2143
apache_beam/io/gcp/bigquery.py:2143
apache_beam/io/gcp/bigquery.py:2143
apache_beam/io/gcp/bigquery.py:2143
  <https://ci-beam.apache.org/job/beam_PostCommit_Python38/ws/src/sdks/python/apache_beam/io/gcp/bigquery.py>:2143: BeamDeprecationWarning: options is deprecated since First stable release. References to <pipeline>.options will not be supported
    is_streaming_pipeline = p.options.view_as(StandardOptions).streaming

apache_beam/io/gcp/bigquery.py:2149
apache_beam/io/gcp/bigquery.py:2149
apache_beam/io/gcp/bigquery.py:2149
apache_beam/io/gcp/bigquery.py:2149
apache_beam/io/gcp/bigquery.py:2149
apache_beam/io/gcp/bigquery.py:2149
apache_beam/io/gcp/bigquery.py:2149
apache_beam/io/gcp/bigquery.py:2149
apache_beam/io/gcp/bigquery.py:2149
apache_beam/io/gcp/bigquery.py:2149
apache_beam/io/gcp/bigquery.py:2149
apache_beam/io/gcp/bigquery.py:2149
apache_beam/io/gcp/bigquery.py:2149
apache_beam/io/gcp/bigquery.py:2149
apache_beam/io/gcp/bigquery.py:2149
apache_beam/io/gcp/bigquery.py:2149
apache_beam/io/gcp/bigquery.py:2149
apache_beam/io/gcp/bigquery.py:2149
apache_beam/io/gcp/bigquery.py:2149
apache_beam/io/gcp/bigquery.py:2149
apache_beam/io/gcp/bigquery.py:2149
apache_beam/io/gcp/bigquery.py:2149
apache_beam/io/gcp/bigquery.py:2149
apache_beam/io/gcp/bigquery.py:2149
  <https://ci-beam.apache.org/job/beam_PostCommit_Python38/ws/src/sdks/python/apache_beam/io/gcp/bigquery.py>:2149: BeamDeprecationWarning: options is deprecated since First stable release. References to <pipeline>.options will not be supported
    experiments = p.options.view_as(DebugOptions).experiments or []

apache_beam/io/gcp/bigquery.py:2443
apache_beam/io/gcp/bigquery.py:2443
apache_beam/io/gcp/bigquery.py:2443
apache_beam/io/gcp/bigquery.py:2443
apache_beam/io/gcp/bigquery.py:2443
apache_beam/io/gcp/bigquery.py:2443
apache_beam/io/gcp/bigquery.py:2443
apache_beam/io/gcp/bigquery.py:2443
apache_beam/io/gcp/bigquery.py:2443
apache_beam/io/gcp/bigquery.py:2443
apache_beam/io/gcp/bigquery.py:2443
apache_beam/io/gcp/bigquery.py:2443
apache_beam/io/gcp/bigquery.py:2443
apache_beam/io/gcp/bigquery.py:2443
  <https://ci-beam.apache.org/job/beam_PostCommit_Python38/ws/src/sdks/python/apache_beam/io/gcp/bigquery.py>:2443: BeamDeprecationWarning: options is deprecated since First stable release. References to <pipeline>.options will not be supported
    temp_location = pcoll.pipeline.options.view_as(

apache_beam/io/gcp/bigquery.py:2445
apache_beam/io/gcp/bigquery.py:2445
apache_beam/io/gcp/bigquery.py:2445
apache_beam/io/gcp/bigquery.py:2445
apache_beam/io/gcp/bigquery.py:2445
apache_beam/io/gcp/bigquery.py:2445
apache_beam/io/gcp/bigquery.py:2445
apache_beam/io/gcp/bigquery.py:2445
apache_beam/io/gcp/bigquery.py:2445
apache_beam/io/gcp/bigquery.py:2445
apache_beam/io/gcp/bigquery.py:2445
apache_beam/io/gcp/bigquery.py:2445
apache_beam/io/gcp/bigquery.py:2445
apache_beam/io/gcp/bigquery.py:2445
  <https://ci-beam.apache.org/job/beam_PostCommit_Python38/ws/src/sdks/python/apache_beam/io/gcp/bigquery.py>:2445: BeamDeprecationWarning: options is deprecated since First stable release. References to <pipeline>.options will not be supported
    job_name = pcoll.pipeline.options.view_as(GoogleCloudOptions).job_name

apache_beam/io/gcp/bigquery.py:2469
apache_beam/io/gcp/bigquery.py:2469
apache_beam/io/gcp/bigquery.py:2469
apache_beam/io/gcp/bigquery.py:2469
apache_beam/io/gcp/bigquery.py:2469
apache_beam/io/gcp/bigquery.py:2469
apache_beam/io/gcp/bigquery.py:2469
apache_beam/io/gcp/bigquery.py:2469
apache_beam/io/gcp/bigquery.py:2469
apache_beam/io/gcp/bigquery.py:2469
apache_beam/io/gcp/bigquery.py:2469
apache_beam/io/gcp/bigquery.py:2469
apache_beam/io/gcp/bigquery.py:2469
apache_beam/io/gcp/bigquery.py:2469
  <https://ci-beam.apache.org/job/beam_PostCommit_Python38/ws/src/sdks/python/apache_beam/io/gcp/bigquery.py>:2469: BeamDeprecationWarning: options is deprecated since First stable release. References to <pipeline>.options will not be supported
    pipeline_options=pcoll.pipeline.options,

apache_beam/io/gcp/bigquery.py:2139
apache_beam/io/gcp/bigquery.py:2139
apache_beam/io/gcp/bigquery.py:2139
apache_beam/io/gcp/bigquery.py:2139
apache_beam/io/gcp/bigquery.py:2139
apache_beam/io/gcp/bigquery.py:2139
apache_beam/io/gcp/bigquery.py:2139
apache_beam/io/gcp/bigquery.py:2139
apache_beam/io/gcp/bigquery.py:2139
apache_beam/io/gcp/bigquery.py:2139
apache_beam/io/gcp/bigquery.py:2139
apache_beam/io/gcp/bigquery.py:2139
  <https://ci-beam.apache.org/job/beam_PostCommit_Python38/ws/src/sdks/python/apache_beam/io/gcp/bigquery.py>:2139: BeamDeprecationWarning: options is deprecated since First stable release. References to <pipeline>.options will not be supported
    self.table_reference.projectId = pcoll.pipeline.options.view_as(

apache_beam/io/gcp/bigquery_file_loads.py:1128
apache_beam/io/gcp/bigquery_file_loads.py:1128
apache_beam/io/gcp/bigquery_file_loads.py:1128
apache_beam/io/gcp/bigquery_file_loads.py:1128
apache_beam/io/gcp/bigquery_file_loads.py:1128
apache_beam/io/gcp/bigquery_file_loads.py:1128
apache_beam/io/gcp/bigquery_file_loads.py:1128
apache_beam/io/gcp/bigquery_file_loads.py:1128
apache_beam/io/gcp/bigquery_file_loads.py:1128
apache_beam/io/gcp/bigquery_file_loads.py:1128
apache_beam/io/gcp/bigquery_file_loads.py:1128
apache_beam/io/gcp/bigquery_file_loads.py:1128
apache_beam/io/gcp/bigquery_file_loads.py:1128
apache_beam/io/gcp/bigquery_file_loads.py:1128
apache_beam/io/gcp/bigquery_file_loads.py:1128
apache_beam/io/gcp/bigquery_file_loads.py:1128
apache_beam/io/gcp/bigquery_file_loads.py:1128
  <https://ci-beam.apache.org/job/beam_PostCommit_Python38/ws/src/sdks/python/apache_beam/io/gcp/bigquery_file_loads.py>:1128: BeamDeprecationWarning: options is deprecated since First stable release. References to <pipeline>.options will not be supported
    temp_location = p.options.view_as(GoogleCloudOptions).temp_location

apache_beam/io/gcp/bigquery_file_loads.py:1130
apache_beam/io/gcp/bigquery_file_loads.py:1130
apache_beam/io/gcp/bigquery_file_loads.py:1130
apache_beam/io/gcp/bigquery_file_loads.py:1130
apache_beam/io/gcp/bigquery_file_loads.py:1130
apache_beam/io/gcp/bigquery_file_loads.py:1130
apache_beam/io/gcp/bigquery_file_loads.py:1130
apache_beam/io/gcp/bigquery_file_loads.py:1130
apache_beam/io/gcp/bigquery_file_loads.py:1130
apache_beam/io/gcp/bigquery_file_loads.py:1130
apache_beam/io/gcp/bigquery_file_loads.py:1130
apache_beam/io/gcp/bigquery_file_loads.py:1130
apache_beam/io/gcp/bigquery_file_loads.py:1130
apache_beam/io/gcp/bigquery_file_loads.py:1130
apache_beam/io/gcp/bigquery_file_loads.py:1130
apache_beam/io/gcp/bigquery_file_loads.py:1130
apache_beam/io/gcp/bigquery_file_loads.py:1130
  <https://ci-beam.apache.org/job/beam_PostCommit_Python38/ws/src/sdks/python/apache_beam/io/gcp/bigquery_file_loads.py>:1130: BeamDeprecationWarning: options is deprecated since First stable release. References to <pipeline>.options will not be supported
    p.options.view_as(GoogleCloudOptions).job_name or 'AUTOMATIC_JOB_NAME')

apache_beam/io/gcp/tests/utils.py:100
  <https://ci-beam.apache.org/job/beam_PostCommit_Python38/ws/src/sdks/python/apache_beam/io/gcp/tests/utils.py>:100: PendingDeprecationWarning: Client.dataset is deprecated and will be removed in a future version. Use a string like 'my_project.my_dataset' or a cloud.google.bigquery.DatasetReference object, instead.
    table_ref = client.dataset(dataset_id).table(table_id)

apache_beam/examples/dataframe/flight_delays.py:47
  <https://ci-beam.apache.org/job/beam_PostCommit_Python38/ws/src/sdks/python/apache_beam/examples/dataframe/flight_delays.py>:47: FutureWarning: Dropping of nuisance columns in DataFrame reductions (with 'numeric_only=None') is deprecated; in a future version this will raise TypeError.  Select only valid columns before calling the reduction.
    return airline_df[at_top_airports].mean()

apache_beam/dataframe/io.py:629
apache_beam/dataframe/io.py:629
apache_beam/dataframe/io.py:629
  <https://ci-beam.apache.org/job/beam_PostCommit_Python38/ws/src/sdks/python/apache_beam/dataframe/io.py>:629: FutureWarning: WriteToFiles is experimental.
    return pcoll | fileio.WriteToFiles(

apache_beam/io/fileio.py:550
apache_beam/io/fileio.py:550
apache_beam/io/fileio.py:550
  <https://ci-beam.apache.org/job/beam_PostCommit_Python38/ws/src/sdks/python/apache_beam/io/fileio.py>:550: BeamDeprecationWarning: options is deprecated since First stable release. References to <pipeline>.options will not be supported
    p.options.view_as(GoogleCloudOptions).temp_location or

apache_beam/io/gcp/bigquery_test.py:1183
  <https://ci-beam.apache.org/job/beam_PostCommit_Python38/ws/src/sdks/python/apache_beam/io/gcp/bigquery_test.py>:1183: BeamDeprecationWarning: options is deprecated since First stable release. References to <pipeline>.options will not be supported
    streaming = self.test_pipeline.options.view_as(StandardOptions).streaming

apache_beam/ml/gcp/cloud_dlp_it_test.py:74
  <https://ci-beam.apache.org/job/beam_PostCommit_Python38/ws/src/sdks/python/apache_beam/ml/gcp/cloud_dlp_it_test.py>:74: FutureWarning: MaskDetectedDetails is experimental.
    | MaskDetectedDetails(

apache_beam/io/gcp/bigquery_read_it_test.py:167
  <https://ci-beam.apache.org/job/beam_PostCommit_Python38/ws/src/sdks/python/apache_beam/io/gcp/bigquery_read_it_test.py>:167: BeamDeprecationWarning: BigQuerySource is deprecated since 2.25.0. Use ReadFromBigQuery instead.
    beam.io.BigQuerySource(query=self.query, use_standard_sql=True)))

apache_beam/io/gcp/big_query_query_to_table_pipeline.py:81
apache_beam/io/gcp/big_query_query_to_table_pipeline.py:81
  <https://ci-beam.apache.org/job/beam_PostCommit_Python38/ws/src/sdks/python/apache_beam/io/gcp/big_query_query_to_table_pipeline.py>:81: BeamDeprecationWarning: BigQuerySource is deprecated since 2.25.0. Use ReadFromBigQuery instead.
    beam.io.BigQuerySource(

apache_beam/runners/dataflow/ptransform_overrides.py:316
apache_beam/runners/dataflow/ptransform_overrides.py:316
  <https://ci-beam.apache.org/job/beam_PostCommit_Python38/ws/src/sdks/python/apache_beam/runners/dataflow/ptransform_overrides.py>:316: BeamDeprecationWarning: BigQuerySink is deprecated since 2.11.0. Use WriteToBigQuery instead.
    io.BigQuerySink(

apache_beam/ml/gcp/cloud_dlp_it_test.py:85
  <https://ci-beam.apache.org/job/beam_PostCommit_Python38/ws/src/sdks/python/apache_beam/ml/gcp/cloud_dlp_it_test.py>:85: FutureWarning: InspectForDetails is experimental.
    | InspectForDetails(

apache_beam/io/gcp/bigquery_read_it_test.py:556
  <https://ci-beam.apache.org/job/beam_PostCommit_Python38/ws/src/sdks/python/apache_beam/io/gcp/bigquery_read_it_test.py>:556: BeamDeprecationWarning: BigQuerySource is deprecated since 2.25.0. Use ReadFromBigQuery instead.
    beam.io.BigQuerySource(query=self.query, use_standard_sql=True)))

apache_beam/io/gcp/bigquery_read_it_test.py:670
  <https://ci-beam.apache.org/job/beam_PostCommit_Python38/ws/src/sdks/python/apache_beam/io/gcp/bigquery_read_it_test.py>:670: FutureWarning: ReadAllFromBigQuery is experimental.
    | beam.io.ReadAllFromBigQuery())

apache_beam/io/gcp/bigquery.py:2617
  <https://ci-beam.apache.org/job/beam_PostCommit_Python38/ws/src/sdks/python/apache_beam/io/gcp/bigquery.py>:2617: BeamDeprecationWarning: options is deprecated since First stable release. References to <pipeline>.options will not be supported
    job_name = pcoll.pipeline.options.view_as(GoogleCloudOptions).job_name

apache_beam/io/gcp/bigquery.py:2618
  <https://ci-beam.apache.org/job/beam_PostCommit_Python38/ws/src/sdks/python/apache_beam/io/gcp/bigquery.py>:2618: BeamDeprecationWarning: options is deprecated since First stable release. References to <pipeline>.options will not be supported
    project = pcoll.pipeline.options.view_as(GoogleCloudOptions).project

apache_beam/io/gcp/bigquery.py:2631
  <https://ci-beam.apache.org/job/beam_PostCommit_Python38/ws/src/sdks/python/apache_beam/io/gcp/bigquery.py>:2631: BeamDeprecationWarning: options is deprecated since First stable release. References to <pipeline>.options will not be supported
    options=pcoll.pipeline.options,

-- Docs: https://docs.pytest.org/en/latest/warnings.html
- generated xml file: <https://ci-beam.apache.org/job/beam_PostCommit_Python38/ws/src/sdks/python/pytest_postCommitIT-df-py38.xml> -
======= 1 failed, 60 passed, 8 skipped, 178 warnings in 7708.66 seconds ========

> Task :sdks:python:test-suites:dataflow:py38:postCommitIT FAILED

FAILURE: Build failed with an exception.

* Where:
Script '<https://ci-beam.apache.org/job/beam_PostCommit_Python38/ws/src/sdks/python/test-suites/dataflow/common.gradle'> line: 121

* What went wrong:
Execution failed for task ':sdks:python:test-suites:dataflow:py38:postCommitIT'.
> Process 'command 'sh'' finished with non-zero exit value 1

* Try:
> Run with --stacktrace option to get the stack trace.
> Run with --info or --debug option to get more log output.
> Run with --scan to get full insights.

* Get more help at https://help.gradle.org

Deprecated Gradle features were used in this build, making it incompatible with Gradle 8.0.

You can use '--warning-mode all' to show the individual deprecation warnings and determine if they come from your own scripts or plugins.

See https://docs.gradle.org/7.4/userguide/command_line_interface.html#sec:command_line_warnings

Execution optimizations have been disabled for 1 invalid unit(s) of work during this build to ensure correctness.
Please consult deprecation warnings for more details.

BUILD FAILED in 2h 10m 21s
220 actionable tasks: 150 executed, 64 from cache, 6 up-to-date

Publishing build scan...
https://gradle.com/s/no7xqgh42wdgo

Build step 'Invoke Gradle script' changed build result to FAILURE
Build step 'Invoke Gradle script' marked build as failure

---------------------------------------------------------------------
To unsubscribe, e-mail: builds-unsubscribe@beam.apache.org
For additional commands, e-mail: builds-help@beam.apache.org


Build failed in Jenkins: beam_PostCommit_Python38 #2539

Posted by Apache Jenkins Server <je...@builds.apache.org>.
See <https://ci-beam.apache.org/job/beam_PostCommit_Python38/2539/display/redirect>

Changes:


------------------------------------------
[...truncated 35.74 MB...]
apache_beam/io/gcp/bigquery.py:2143
apache_beam/io/gcp/bigquery.py:2143
apache_beam/io/gcp/bigquery.py:2143
apache_beam/io/gcp/bigquery.py:2143
apache_beam/io/gcp/bigquery.py:2143
apache_beam/io/gcp/bigquery.py:2143
apache_beam/io/gcp/bigquery.py:2143
apache_beam/io/gcp/bigquery.py:2143
  <https://ci-beam.apache.org/job/beam_PostCommit_Python38/ws/src/sdks/python/apache_beam/io/gcp/bigquery.py>:2143: BeamDeprecationWarning: options is deprecated since First stable release. References to <pipeline>.options will not be supported
    is_streaming_pipeline = p.options.view_as(StandardOptions).streaming

apache_beam/io/gcp/bigquery.py:2149
apache_beam/io/gcp/bigquery.py:2149
apache_beam/io/gcp/bigquery.py:2149
apache_beam/io/gcp/bigquery.py:2149
apache_beam/io/gcp/bigquery.py:2149
apache_beam/io/gcp/bigquery.py:2149
apache_beam/io/gcp/bigquery.py:2149
apache_beam/io/gcp/bigquery.py:2149
apache_beam/io/gcp/bigquery.py:2149
apache_beam/io/gcp/bigquery.py:2149
apache_beam/io/gcp/bigquery.py:2149
apache_beam/io/gcp/bigquery.py:2149
apache_beam/io/gcp/bigquery.py:2149
apache_beam/io/gcp/bigquery.py:2149
apache_beam/io/gcp/bigquery.py:2149
apache_beam/io/gcp/bigquery.py:2149
apache_beam/io/gcp/bigquery.py:2149
apache_beam/io/gcp/bigquery.py:2149
apache_beam/io/gcp/bigquery.py:2149
apache_beam/io/gcp/bigquery.py:2149
apache_beam/io/gcp/bigquery.py:2149
apache_beam/io/gcp/bigquery.py:2149
apache_beam/io/gcp/bigquery.py:2149
apache_beam/io/gcp/bigquery.py:2149
  <https://ci-beam.apache.org/job/beam_PostCommit_Python38/ws/src/sdks/python/apache_beam/io/gcp/bigquery.py>:2149: BeamDeprecationWarning: options is deprecated since First stable release. References to <pipeline>.options will not be supported
    experiments = p.options.view_as(DebugOptions).experiments or []

apache_beam/io/gcp/bigquery.py:2443
apache_beam/io/gcp/bigquery.py:2443
apache_beam/io/gcp/bigquery.py:2443
apache_beam/io/gcp/bigquery.py:2443
apache_beam/io/gcp/bigquery.py:2443
apache_beam/io/gcp/bigquery.py:2443
apache_beam/io/gcp/bigquery.py:2443
apache_beam/io/gcp/bigquery.py:2443
apache_beam/io/gcp/bigquery.py:2443
apache_beam/io/gcp/bigquery.py:2443
apache_beam/io/gcp/bigquery.py:2443
apache_beam/io/gcp/bigquery.py:2443
apache_beam/io/gcp/bigquery.py:2443
apache_beam/io/gcp/bigquery.py:2443
  <https://ci-beam.apache.org/job/beam_PostCommit_Python38/ws/src/sdks/python/apache_beam/io/gcp/bigquery.py>:2443: BeamDeprecationWarning: options is deprecated since First stable release. References to <pipeline>.options will not be supported
    temp_location = pcoll.pipeline.options.view_as(

apache_beam/io/gcp/bigquery.py:2445
apache_beam/io/gcp/bigquery.py:2445
apache_beam/io/gcp/bigquery.py:2445
apache_beam/io/gcp/bigquery.py:2445
apache_beam/io/gcp/bigquery.py:2445
apache_beam/io/gcp/bigquery.py:2445
apache_beam/io/gcp/bigquery.py:2445
apache_beam/io/gcp/bigquery.py:2445
apache_beam/io/gcp/bigquery.py:2445
apache_beam/io/gcp/bigquery.py:2445
apache_beam/io/gcp/bigquery.py:2445
apache_beam/io/gcp/bigquery.py:2445
apache_beam/io/gcp/bigquery.py:2445
apache_beam/io/gcp/bigquery.py:2445
  <https://ci-beam.apache.org/job/beam_PostCommit_Python38/ws/src/sdks/python/apache_beam/io/gcp/bigquery.py>:2445: BeamDeprecationWarning: options is deprecated since First stable release. References to <pipeline>.options will not be supported
    job_name = pcoll.pipeline.options.view_as(GoogleCloudOptions).job_name

apache_beam/io/gcp/bigquery.py:2469
apache_beam/io/gcp/bigquery.py:2469
apache_beam/io/gcp/bigquery.py:2469
apache_beam/io/gcp/bigquery.py:2469
apache_beam/io/gcp/bigquery.py:2469
apache_beam/io/gcp/bigquery.py:2469
apache_beam/io/gcp/bigquery.py:2469
apache_beam/io/gcp/bigquery.py:2469
apache_beam/io/gcp/bigquery.py:2469
apache_beam/io/gcp/bigquery.py:2469
apache_beam/io/gcp/bigquery.py:2469
apache_beam/io/gcp/bigquery.py:2469
apache_beam/io/gcp/bigquery.py:2469
apache_beam/io/gcp/bigquery.py:2469
  <https://ci-beam.apache.org/job/beam_PostCommit_Python38/ws/src/sdks/python/apache_beam/io/gcp/bigquery.py>:2469: BeamDeprecationWarning: options is deprecated since First stable release. References to <pipeline>.options will not be supported
    pipeline_options=pcoll.pipeline.options,

apache_beam/io/gcp/bigquery.py:2139
apache_beam/io/gcp/bigquery.py:2139
apache_beam/io/gcp/bigquery.py:2139
apache_beam/io/gcp/bigquery.py:2139
apache_beam/io/gcp/bigquery.py:2139
apache_beam/io/gcp/bigquery.py:2139
apache_beam/io/gcp/bigquery.py:2139
apache_beam/io/gcp/bigquery.py:2139
apache_beam/io/gcp/bigquery.py:2139
apache_beam/io/gcp/bigquery.py:2139
apache_beam/io/gcp/bigquery.py:2139
apache_beam/io/gcp/bigquery.py:2139
  <https://ci-beam.apache.org/job/beam_PostCommit_Python38/ws/src/sdks/python/apache_beam/io/gcp/bigquery.py>:2139: BeamDeprecationWarning: options is deprecated since First stable release. References to <pipeline>.options will not be supported
    self.table_reference.projectId = pcoll.pipeline.options.view_as(

apache_beam/io/gcp/bigquery_file_loads.py:1128
apache_beam/io/gcp/bigquery_file_loads.py:1128
apache_beam/io/gcp/bigquery_file_loads.py:1128
apache_beam/io/gcp/bigquery_file_loads.py:1128
apache_beam/io/gcp/bigquery_file_loads.py:1128
apache_beam/io/gcp/bigquery_file_loads.py:1128
apache_beam/io/gcp/bigquery_file_loads.py:1128
apache_beam/io/gcp/bigquery_file_loads.py:1128
apache_beam/io/gcp/bigquery_file_loads.py:1128
apache_beam/io/gcp/bigquery_file_loads.py:1128
apache_beam/io/gcp/bigquery_file_loads.py:1128
apache_beam/io/gcp/bigquery_file_loads.py:1128
apache_beam/io/gcp/bigquery_file_loads.py:1128
apache_beam/io/gcp/bigquery_file_loads.py:1128
apache_beam/io/gcp/bigquery_file_loads.py:1128
apache_beam/io/gcp/bigquery_file_loads.py:1128
apache_beam/io/gcp/bigquery_file_loads.py:1128
  <https://ci-beam.apache.org/job/beam_PostCommit_Python38/ws/src/sdks/python/apache_beam/io/gcp/bigquery_file_loads.py>:1128: BeamDeprecationWarning: options is deprecated since First stable release. References to <pipeline>.options will not be supported
    temp_location = p.options.view_as(GoogleCloudOptions).temp_location

apache_beam/io/gcp/bigquery_file_loads.py:1130
apache_beam/io/gcp/bigquery_file_loads.py:1130
apache_beam/io/gcp/bigquery_file_loads.py:1130
apache_beam/io/gcp/bigquery_file_loads.py:1130
apache_beam/io/gcp/bigquery_file_loads.py:1130
apache_beam/io/gcp/bigquery_file_loads.py:1130
apache_beam/io/gcp/bigquery_file_loads.py:1130
apache_beam/io/gcp/bigquery_file_loads.py:1130
apache_beam/io/gcp/bigquery_file_loads.py:1130
apache_beam/io/gcp/bigquery_file_loads.py:1130
apache_beam/io/gcp/bigquery_file_loads.py:1130
apache_beam/io/gcp/bigquery_file_loads.py:1130
apache_beam/io/gcp/bigquery_file_loads.py:1130
apache_beam/io/gcp/bigquery_file_loads.py:1130
apache_beam/io/gcp/bigquery_file_loads.py:1130
apache_beam/io/gcp/bigquery_file_loads.py:1130
apache_beam/io/gcp/bigquery_file_loads.py:1130
  <https://ci-beam.apache.org/job/beam_PostCommit_Python38/ws/src/sdks/python/apache_beam/io/gcp/bigquery_file_loads.py>:1130: BeamDeprecationWarning: options is deprecated since First stable release. References to <pipeline>.options will not be supported
    p.options.view_as(GoogleCloudOptions).job_name or 'AUTOMATIC_JOB_NAME')

apache_beam/io/gcp/tests/utils.py:100
  <https://ci-beam.apache.org/job/beam_PostCommit_Python38/ws/src/sdks/python/apache_beam/io/gcp/tests/utils.py>:100: PendingDeprecationWarning: Client.dataset is deprecated and will be removed in a future version. Use a string like 'my_project.my_dataset' or a cloud.google.bigquery.DatasetReference object, instead.
    table_ref = client.dataset(dataset_id).table(table_id)

apache_beam/examples/dataframe/flight_delays.py:47
  <https://ci-beam.apache.org/job/beam_PostCommit_Python38/ws/src/sdks/python/apache_beam/examples/dataframe/flight_delays.py>:47: FutureWarning: Dropping of nuisance columns in DataFrame reductions (with 'numeric_only=None') is deprecated; in a future version this will raise TypeError.  Select only valid columns before calling the reduction.
    return airline_df[at_top_airports].mean()

apache_beam/dataframe/io.py:629
apache_beam/dataframe/io.py:629
apache_beam/dataframe/io.py:629
  <https://ci-beam.apache.org/job/beam_PostCommit_Python38/ws/src/sdks/python/apache_beam/dataframe/io.py>:629: FutureWarning: WriteToFiles is experimental.
    return pcoll | fileio.WriteToFiles(

apache_beam/io/fileio.py:550
apache_beam/io/fileio.py:550
apache_beam/io/fileio.py:550
  <https://ci-beam.apache.org/job/beam_PostCommit_Python38/ws/src/sdks/python/apache_beam/io/fileio.py>:550: BeamDeprecationWarning: options is deprecated since First stable release. References to <pipeline>.options will not be supported
    p.options.view_as(GoogleCloudOptions).temp_location or

apache_beam/io/gcp/bigquery_test.py:1183
  <https://ci-beam.apache.org/job/beam_PostCommit_Python38/ws/src/sdks/python/apache_beam/io/gcp/bigquery_test.py>:1183: BeamDeprecationWarning: options is deprecated since First stable release. References to <pipeline>.options will not be supported
    streaming = self.test_pipeline.options.view_as(StandardOptions).streaming

apache_beam/io/gcp/bigquery_read_it_test.py:167
  <https://ci-beam.apache.org/job/beam_PostCommit_Python38/ws/src/sdks/python/apache_beam/io/gcp/bigquery_read_it_test.py>:167: BeamDeprecationWarning: BigQuerySource is deprecated since 2.25.0. Use ReadFromBigQuery instead.
    beam.io.BigQuerySource(query=self.query, use_standard_sql=True)))

apache_beam/io/gcp/bigquery_read_it_test.py:556
  <https://ci-beam.apache.org/job/beam_PostCommit_Python38/ws/src/sdks/python/apache_beam/io/gcp/bigquery_read_it_test.py>:556: BeamDeprecationWarning: BigQuerySource is deprecated since 2.25.0. Use ReadFromBigQuery instead.
    beam.io.BigQuerySource(query=self.query, use_standard_sql=True)))

apache_beam/io/gcp/big_query_query_to_table_pipeline.py:81
apache_beam/io/gcp/big_query_query_to_table_pipeline.py:81
  <https://ci-beam.apache.org/job/beam_PostCommit_Python38/ws/src/sdks/python/apache_beam/io/gcp/big_query_query_to_table_pipeline.py>:81: BeamDeprecationWarning: BigQuerySource is deprecated since 2.25.0. Use ReadFromBigQuery instead.
    beam.io.BigQuerySource(

apache_beam/runners/dataflow/ptransform_overrides.py:316
apache_beam/runners/dataflow/ptransform_overrides.py:316
  <https://ci-beam.apache.org/job/beam_PostCommit_Python38/ws/src/sdks/python/apache_beam/runners/dataflow/ptransform_overrides.py>:316: BeamDeprecationWarning: BigQuerySink is deprecated since 2.11.0. Use WriteToBigQuery instead.
    io.BigQuerySink(

apache_beam/io/gcp/bigquery_read_it_test.py:670
  <https://ci-beam.apache.org/job/beam_PostCommit_Python38/ws/src/sdks/python/apache_beam/io/gcp/bigquery_read_it_test.py>:670: FutureWarning: ReadAllFromBigQuery is experimental.
    | beam.io.ReadAllFromBigQuery())

apache_beam/io/gcp/bigquery.py:2617
  <https://ci-beam.apache.org/job/beam_PostCommit_Python38/ws/src/sdks/python/apache_beam/io/gcp/bigquery.py>:2617: BeamDeprecationWarning: options is deprecated since First stable release. References to <pipeline>.options will not be supported
    job_name = pcoll.pipeline.options.view_as(GoogleCloudOptions).job_name

apache_beam/io/gcp/bigquery.py:2618
  <https://ci-beam.apache.org/job/beam_PostCommit_Python38/ws/src/sdks/python/apache_beam/io/gcp/bigquery.py>:2618: BeamDeprecationWarning: options is deprecated since First stable release. References to <pipeline>.options will not be supported
    project = pcoll.pipeline.options.view_as(GoogleCloudOptions).project

apache_beam/io/gcp/bigquery.py:2631
  <https://ci-beam.apache.org/job/beam_PostCommit_Python38/ws/src/sdks/python/apache_beam/io/gcp/bigquery.py>:2631: BeamDeprecationWarning: options is deprecated since First stable release. References to <pipeline>.options will not be supported
    options=pcoll.pipeline.options,

apache_beam/ml/gcp/cloud_dlp_it_test.py:74
  <https://ci-beam.apache.org/job/beam_PostCommit_Python38/ws/src/sdks/python/apache_beam/ml/gcp/cloud_dlp_it_test.py>:74: FutureWarning: MaskDetectedDetails is experimental.
    | MaskDetectedDetails(

apache_beam/ml/gcp/cloud_dlp_it_test.py:85
  <https://ci-beam.apache.org/job/beam_PostCommit_Python38/ws/src/sdks/python/apache_beam/ml/gcp/cloud_dlp_it_test.py>:85: FutureWarning: InspectForDetails is experimental.
    | InspectForDetails(

-- Docs: https://docs.pytest.org/en/latest/warnings.html
- generated xml file: <https://ci-beam.apache.org/job/beam_PostCommit_Python38/ws/src/sdks/python/pytest_postCommitIT-df-py38.xml> -
======= 1 failed, 60 passed, 8 skipped, 176 warnings in 5482.57 seconds ========

> Task :sdks:python:test-suites:dataflow:py38:postCommitIT FAILED

FAILURE: Build failed with an exception.

* Where:
Script '<https://ci-beam.apache.org/job/beam_PostCommit_Python38/ws/src/sdks/python/test-suites/dataflow/common.gradle'> line: 121

* What went wrong:
Execution failed for task ':sdks:python:test-suites:dataflow:py38:postCommitIT'.
> Process 'command 'sh'' finished with non-zero exit value 1

* Try:
> Run with --stacktrace option to get the stack trace.
> Run with --info or --debug option to get more log output.
> Run with --scan to get full insights.

* Get more help at https://help.gradle.org

Deprecated Gradle features were used in this build, making it incompatible with Gradle 8.0.

You can use '--warning-mode all' to show the individual deprecation warnings and determine if they come from your own scripts or plugins.

See https://docs.gradle.org/7.4/userguide/command_line_interface.html#sec:command_line_warnings

Execution optimizations have been disabled for 1 invalid unit(s) of work during this build to ensure correctness.
Please consult deprecation warnings for more details.

BUILD FAILED in 1h 33m 16s
219 actionable tasks: 149 executed, 64 from cache, 6 up-to-date

Publishing build scan...
https://gradle.com/s/wl63fwkvmz3i2

Build step 'Invoke Gradle script' changed build result to FAILURE
Build step 'Invoke Gradle script' marked build as failure

---------------------------------------------------------------------
To unsubscribe, e-mail: builds-unsubscribe@beam.apache.org
For additional commands, e-mail: builds-help@beam.apache.org