You are viewing a plain text version of this content. The canonical link for it is here.
Posted to builds@beam.apache.org by Apache Jenkins Server <je...@builds.apache.org> on 2023/02/10 11:36:42 UTC
Build failed in Jenkins: beam_PostCommit_XVR_PythonUsingJava_Dataflow #1509
See <https://ci-beam.apache.org/job/beam_PostCommit_XVR_PythonUsingJava_Dataflow/1509/display/redirect?page=changes>
Changes:
[noreply] fix doc on bq sxtorage (#25353)
[noreply] [Playground] Fix Test_getRunOrTestCmd on Go 1.20 (#25379)
[noreply] Fix typo - metdata -> metadata (#25399)
[noreply] [prism] Initial commit for READMEs and go.mod (#25404)
[noreply] [prism] Add urns package (#25405)
[noreply] Add Two Counter Metric in BigQuery Write Schema Transform (#25155)
[noreply] [prism] Add internal/config package (#25406)
------------------------------------------
[...truncated 1.09 MB...]
orjson==3.8.5
overrides==6.5.0
packaging==23.0
pandas==1.5.3
parameterized==0.8.1
pbr==5.11.1
pip==23.0
pluggy==1.0.0
proto-plus==1.22.2
protobuf==3.19.6
psycopg2-binary==2.9.5
py==1.11.0
pyarrow==9.0.0
pyasn1==0.4.8
pyasn1-modules==0.2.8
pycparser==2.21
pydot==1.4.2
PyHamcrest==1.10.1
pymongo==3.13.0
PyMySQL==1.0.2
pyparsing==3.0.9
pytest==7.2.1
pytest-forked==1.4.0
pytest-timeout==2.1.0
pytest-xdist==2.5.0
python-dateutil==2.8.2
python-snappy==0.6.1
pytz==2022.7.1
PyYAML==6.0
regex==2022.10.31
requests==2.28.2
requests-mock==1.10.0
requests-oauthlib==1.3.1
rsa==4.9
scikit-learn==1.2.1
scipy==1.10.0
setuptools==67.2.0
six==1.16.0
sortedcontainers==2.4.0
soupsieve==2.3.2.post1
SQLAlchemy==1.4.46
sqlparse==0.4.3
tenacity==5.1.5
tensorboard==2.11.2
tensorboard-data-server==0.6.1
tensorboard-plugin-wit==1.8.1
tensorflow==2.11.0
tensorflow-estimator==2.11.0
tensorflow-io-gcs-filesystem==0.30.0
termcolor==2.2.0
testcontainers==3.7.1
threadpoolctl==3.1.0
tomli==2.0.1
tqdm==4.64.1
typing_extensions==4.4.0
uritemplate==4.1.1
urllib3==1.26.14
websocket-client==1.4.2
Werkzeug==2.2.2
wheel==0.38.4
wrapt==1.14.1
zstandard==0.19.0
Removing intermediate container d95838882b92
---> b7d17f366372
Step 17/32 : COPY target/LICENSE /opt/apache/beam/
---> c6536dca3d89
Step 18/32 : COPY target/LICENSE.python /opt/apache/beam/
---> 1ab6aac15726
Step 19/32 : COPY target/NOTICE /opt/apache/beam/
---> 84a63da9e446
Step 20/32 : COPY target/launcher/linux_amd64/boot /opt/apache/beam/
---> 47cd32a584f0
Step 21/32 : ENTRYPOINT ["/opt/apache/beam/boot"]
---> Running in 27a3fea74f64
Removing intermediate container 27a3fea74f64
---> 97e621d64824
Step 22/32 : FROM beam as third_party_licenses
---> 97e621d64824
Step 23/32 : ARG pull_licenses
---> Running in 1c3f826ed574
Removing intermediate container 1c3f826ed574
---> 15835bdf3b1c
Step 24/32 : COPY target/license_scripts /tmp/license_scripts/
---> 21ae2d3eb623
Step 25/32 : COPY target/LICENSE target/go-licenses/* /opt/apache/beam/third_party_licenses/golang/
---> c500ff00c380
Step 26/32 : RUN rm /opt/apache/beam/third_party_licenses/golang/LICENSE
---> Running in b8551fa1a156
Removing intermediate container b8551fa1a156
---> dece5a7b0f5d
Step 27/32 : COPY target/license_scripts /tmp/license_scripts/
---> e94e83394f3f
Step 28/32 : RUN if [ "$pull_licenses" = "true" ] ; then pip install 'pip-licenses<4.0.0' pyyaml tenacity && python /tmp/license_scripts/pull_licenses_py.py ; fi
---> Running in 01a7ac2b0017
Collecting pip-licenses<4.0.0
Downloading pip_licenses-3.5.5-py3-none-any.whl (17 kB)
Requirement already satisfied: pyyaml in /usr/local/lib/python3.10/site-packages (6.0)
Requirement already satisfied: tenacity in /usr/local/lib/python3.10/site-packages (5.1.5)
Collecting PTable
Downloading PTable-0.9.2.tar.gz (31 kB)
Preparing metadata (setup.py): started
Preparing metadata (setup.py): finished with status 'done'
Requirement already satisfied: six>=1.9.0 in /usr/local/lib/python3.10/site-packages (from tenacity) (1.16.0)
Building wheels for collected packages: PTable
Building wheel for PTable (setup.py): started
Building wheel for PTable (setup.py): finished with status 'done'
Created wheel for PTable: filename=PTable-0.9.2-py3-none-any.whl size=22908 sha256=72f7288c29fd3bc22953cda630dcfa10ac79791cfe7fda7764a6a5b4278542b7
Stored in directory: /root/.cache/pip/wheels/bc/88/52/f2e9fc70f3a657cf256e9b01a8a42938c4c5ee69118d51ed90
Successfully built PTable
Installing collected packages: PTable, pip-licenses
Successfully installed PTable-0.9.2 pip-licenses-3.5.5
[91mWARNING: Running pip as the 'root' user can result in broken permissions and conflicting behaviour with the system package manager. It is recommended to use a virtual environment instead: https://pip.pypa.io/warnings/venv
[0mSkip pulling license for bs4
[91mINFO:root:Successfully pulled licenses for 134 dependencies
[0mRemoving intermediate container 01a7ac2b0017
---> bc4460ad0378
Step 29/32 : FROM beam
---> 97e621d64824
Step 30/32 : ARG pull_licenses
---> Running in 56a189c3d107
Removing intermediate container 56a189c3d107
---> 52e525cd41f9
Step 31/32 : COPY --from=third_party_licenses /opt/apache/beam/third_party_licenses /opt/apache/beam/third_party_licenses
---> 23d9564cec35
Step 32/32 : RUN if [ "$pull_licenses" != "true" ] ; then rm -rf /opt/apache/beam/third_party_licenses ; fi
---> Running in 1ecc4f72e079
Removing intermediate container 1ecc4f72e079
---> 9369fd060b12
Successfully built 9369fd060b12
Successfully tagged apache/beam_python3.10_sdk:2.46.0.dev
> Task :runners:google-cloud-dataflow-java:buildAndPushDockerPythonContainer
WARNING: `gcloud docker` will not be supported for Docker client versions above 18.03.
As an alternative, use `gcloud auth configure-docker` to configure `docker` to
use `gcloud` as a credential helper, then use `docker` as you would for non-GCR
registries, e.g. `docker pull gcr.io/project-id/my-image`. Add
`--verbosity=error` to silence this warning: `gcloud docker
--verbosity=error -- pull gcr.io/project-id/my-image`.
See: https://cloud.google.com/container-registry/docs/support/deprecation-notices#gcloud-docker
The push refers to repository [us.gcr.io/apache-beam-testing/java-postcommit-it/python]
ebfe447b4ab1: Preparing
846c586fae65: Preparing
e00a359c484d: Preparing
d9ac3db73d57: Preparing
2b00ce717cc9: Preparing
45093f3e5c37: Preparing
1c60262e337d: Preparing
6c82b4913dcf: Preparing
a602a60d6bcb: Preparing
162c32eb102c: Preparing
c3734fb0eedf: Preparing
ded75821234f: Preparing
683ae46a23e4: Preparing
2a56a0762df2: Preparing
43baf6b523ba: Preparing
fca1c1ac5753: Preparing
45093f3e5c37: Waiting
eed756075072: Preparing
e4c97b13f26a: Preparing
6c82b4913dcf: Waiting
a602a60d6bcb: Waiting
52fb12b3f764: Preparing
0dafd2b156dd: Preparing
1c60262e337d: Waiting
162c32eb102c: Waiting
ded75821234f: Waiting
683ae46a23e4: Waiting
c3734fb0eedf: Waiting
43baf6b523ba: Waiting
52fb12b3f764: Waiting
eed756075072: Waiting
e4c97b13f26a: Waiting
2a56a0762df2: Waiting
152e2eadff76: Preparing
738226f36892: Preparing
8fcfc59d80ac: Preparing
0dafd2b156dd: Waiting
8fcfc59d80ac: Waiting
738226f36892: Waiting
ebfe447b4ab1: Pushed
2b00ce717cc9: Pushed
e00a359c484d: Pushed
d9ac3db73d57: Pushed
846c586fae65: Pushed
a602a60d6bcb: Pushed
6c82b4913dcf: Pushed
1c60262e337d: Pushed
683ae46a23e4: Pushed
c3734fb0eedf: Pushed
43baf6b523ba: Layer already exists
fca1c1ac5753: Layer already exists
eed756075072: Layer already exists
e4c97b13f26a: Layer already exists
52fb12b3f764: Layer already exists
0dafd2b156dd: Layer already exists
152e2eadff76: Layer already exists
738226f36892: Layer already exists
8fcfc59d80ac: Layer already exists
2a56a0762df2: Pushed
45093f3e5c37: Pushed
162c32eb102c: Pushed
ded75821234f: Pushed
name unknown: Failed to get blob sizes.
> Task :runners:google-cloud-dataflow-java:buildAndPushDockerPythonContainer FAILED
> Task :runners:google-cloud-dataflow-java:validatesCrossLanguageRunnerSetup
Launching Java expansion service @ 36991
Launching Python expansion service @ 42365
> Task :runners:google-cloud-dataflow-java:validatesCrossLanguageRunnerCleanup
Stopping expansion service pid: 2619450.
Stopping expansion service pid: 2619451.
FAILURE: Build failed with an exception.
* Where:
Build file '<https://ci-beam.apache.org/job/beam_PostCommit_XVR_PythonUsingJava_Dataflow/ws/src/runners/google-cloud-dataflow-java/build.gradle'> line: 330
* What went wrong:
Execution failed for task ':runners:google-cloud-dataflow-java:buildAndPushDockerPythonContainer'.
> Process 'command 'gcloud'' finished with non-zero exit value 1
* Try:
> Run with --stacktrace option to get the stack trace.
> Run with --info or --debug option to get more log output.
* Get more help at https://help.gradle.org
Deprecated Gradle features were used in this build, making it incompatible with Gradle 8.0.
You can use '--warning-mode all' to show the individual deprecation warnings and determine if they come from your own scripts or plugins.
See https://docs.gradle.org/7.5.1/userguide/command_line_interface.html#sec:command_line_warnings
Execution optimizations have been disabled for 1 invalid unit(s) of work during this build to ensure correctness.
Please consult deprecation warnings for more details.
BUILD FAILED in 12m 41s
127 actionable tasks: 22 executed, 105 up-to-date
Publishing build scan...
https://gradle.com/s/ixkpaeigkyip4
Build step 'Invoke Gradle script' changed build result to FAILURE
Build step 'Invoke Gradle script' marked build as failure
---------------------------------------------------------------------
To unsubscribe, e-mail: builds-unsubscribe@beam.apache.org
For additional commands, e-mail: builds-help@beam.apache.org
Jenkins build is back to normal : beam_PostCommit_XVR_PythonUsingJava_Dataflow #1510
Posted by Apache Jenkins Server <je...@builds.apache.org>.
See <https://ci-beam.apache.org/job/beam_PostCommit_XVR_PythonUsingJava_Dataflow/1510/display/redirect?page=changes>
---------------------------------------------------------------------
To unsubscribe, e-mail: builds-unsubscribe@beam.apache.org
For additional commands, e-mail: builds-help@beam.apache.org