You are viewing a plain text version of this content. The canonical link for it is here.
Posted to commits@beam.apache.org by Apache Jenkins Server <je...@builds.apache.org> on 2018/09/08 18:35:25 UTC

Build failed in Jenkins: beam_PerformanceTests_Compressed_TextIOIT #955

See <https://builds.apache.org/job/beam_PerformanceTests_Compressed_TextIOIT/955/display/redirect>

------------------------------------------
Started by timer
[EnvInject] - Loading node environment variables.
Building remotely on beam6 (beam) in workspace <https://builds.apache.org/job/beam_PerformanceTests_Compressed_TextIOIT/ws/>
 > git rev-parse --is-inside-work-tree # timeout=10
Fetching changes from the remote Git repository
 > git config remote.origin.url https://github.com/apache/beam.git # timeout=10
Fetching upstream changes from https://github.com/apache/beam.git
 > git --version # timeout=10
 > git fetch --tags --progress https://github.com/apache/beam.git +refs/heads/*:refs/remotes/origin/* +refs/pull/${ghprbPullId}/*:refs/remotes/origin/pr/${ghprbPullId}/*
 > git rev-parse origin/master^{commit} # timeout=10
Checking out Revision 6aa2cf55376481de83a801cd9d79fb775916ee88 (origin/master)
 > git config core.sparsecheckout # timeout=10
 > git checkout -f 6aa2cf55376481de83a801cd9d79fb775916ee88
Commit message: "Merge pull request #6337 from apilloud/metadata"
 > git rev-list --no-walk 6aa2cf55376481de83a801cd9d79fb775916ee88 # timeout=10
Cleaning workspace
 > git rev-parse --verify HEAD # timeout=10
Resetting working tree
 > git reset --hard # timeout=10
 > git clean -fdx # timeout=10
[EnvInject] - Executing scripts and injecting environment variables after the SCM step.
[EnvInject] - Injecting as environment variables the properties content 
SPARK_LOCAL_IP=127.0.0.1

[EnvInject] - Variables injected successfully.
[beam_PerformanceTests_Compressed_TextIOIT] $ /bin/bash -xe /tmp/jenkins7985609749676014107.sh
+ rm -rf <https://builds.apache.org/job/beam_PerformanceTests_Compressed_TextIOIT/ws/PerfKitBenchmarker>
[beam_PerformanceTests_Compressed_TextIOIT] $ /bin/bash -xe /tmp/jenkins183972799048237361.sh
+ rm -rf <https://builds.apache.org/job/beam_PerformanceTests_Compressed_TextIOIT/ws/env/.beam_env>
[beam_PerformanceTests_Compressed_TextIOIT] $ /bin/bash -xe /tmp/jenkins4061031716282788282.sh
+ rm -rf <https://builds.apache.org/job/beam_PerformanceTests_Compressed_TextIOIT/ws/env/.perfkit_env>
[beam_PerformanceTests_Compressed_TextIOIT] $ /bin/bash -xe /tmp/jenkins5816095489861832261.sh
+ virtualenv <https://builds.apache.org/job/beam_PerformanceTests_Compressed_TextIOIT/ws/env/.beam_env> --system-site-packages
New python executable in <https://builds.apache.org/job/beam_PerformanceTests_Compressed_TextIOIT/ws/env/.beam_env/bin/python2>
Also creating executable in <https://builds.apache.org/job/beam_PerformanceTests_Compressed_TextIOIT/ws/env/.beam_env/bin/python>
Installing setuptools, pkg_resources, pip, wheel...done.
Running virtualenv with interpreter /usr/bin/python2
[beam_PerformanceTests_Compressed_TextIOIT] $ /bin/bash -xe /tmp/jenkins1471834634287828862.sh
+ virtualenv <https://builds.apache.org/job/beam_PerformanceTests_Compressed_TextIOIT/ws/env/.perfkit_env> --system-site-packages
New python executable in <https://builds.apache.org/job/beam_PerformanceTests_Compressed_TextIOIT/ws/env/.perfkit_env/bin/python2>
Also creating executable in <https://builds.apache.org/job/beam_PerformanceTests_Compressed_TextIOIT/ws/env/.perfkit_env/bin/python>
Installing setuptools, pkg_resources, pip, wheel...done.
Running virtualenv with interpreter /usr/bin/python2
[beam_PerformanceTests_Compressed_TextIOIT] $ /bin/bash -xe /tmp/jenkins6307046663365336924.sh
+ <https://builds.apache.org/job/beam_PerformanceTests_Compressed_TextIOIT/ws/env/.beam_env/bin/pip> install --upgrade setuptools pip grpcio-tools==1.3.5
Requirement already up-to-date: setuptools in ./env/.beam_env/lib/python2.7/site-packages (40.2.0)
Requirement already up-to-date: pip in ./env/.beam_env/lib/python2.7/site-packages (18.0)
Collecting grpcio-tools==1.3.5
  Using cached https://files.pythonhosted.org/packages/05/f6/0296e29b1bac6f85d2a8556d48adf825307f73109a3c2c17fb734292db0a/grpcio_tools-1.3.5-cp27-cp27mu-manylinux1_x86_64.whl
Requirement already satisfied, skipping upgrade: grpcio>=1.3.5 in /home/jenkins/.local/lib/python2.7/site-packages (from grpcio-tools==1.3.5) (1.13.0)
Requirement already satisfied, skipping upgrade: protobuf>=3.2.0 in /home/jenkins/.local/lib/python2.7/site-packages (from grpcio-tools==1.3.5) (3.6.0)
Requirement already satisfied, skipping upgrade: six>=1.5.2 in /usr/local/lib/python2.7/dist-packages (from grpcio>=1.3.5->grpcio-tools==1.3.5) (1.11.0)
Requirement already satisfied, skipping upgrade: enum34>=1.0.4 in /usr/local/lib/python2.7/dist-packages (from grpcio>=1.3.5->grpcio-tools==1.3.5) (1.1.6)
Requirement already satisfied, skipping upgrade: futures>=2.2.0 in /home/jenkins/.local/lib/python2.7/site-packages (from grpcio>=1.3.5->grpcio-tools==1.3.5) (3.2.0)
Installing collected packages: grpcio-tools
Successfully installed grpcio-tools-1.3.5
[beam_PerformanceTests_Compressed_TextIOIT] $ /bin/bash -xe /tmp/jenkins2529861865901489333.sh
+ <https://builds.apache.org/job/beam_PerformanceTests_Compressed_TextIOIT/ws/env/.perfkit_env/bin/pip> install --upgrade setuptools pip
Requirement already up-to-date: setuptools in ./env/.perfkit_env/lib/python2.7/site-packages (40.2.0)
Requirement already up-to-date: pip in ./env/.perfkit_env/lib/python2.7/site-packages (18.0)
[beam_PerformanceTests_Compressed_TextIOIT] $ /bin/bash -xe /tmp/jenkins8284481920702716439.sh
+ git clone https://github.com/GoogleCloudPlatform/PerfKitBenchmarker.git <https://builds.apache.org/job/beam_PerformanceTests_Compressed_TextIOIT/ws/PerfKitBenchmarker>
Cloning into '<https://builds.apache.org/job/beam_PerformanceTests_Compressed_TextIOIT/ws/PerfKitBenchmarker'...>
[beam_PerformanceTests_Compressed_TextIOIT] $ /bin/bash -xe /tmp/jenkins7019706948386936853.sh
+ <https://builds.apache.org/job/beam_PerformanceTests_Compressed_TextIOIT/ws/env/.beam_env/bin/pip> install -e '<https://builds.apache.org/job/beam_PerformanceTests_Compressed_TextIOIT/ws/src/sdks/python/[gcp,test]'>
Obtaining file://<https://builds.apache.org/job/beam_PerformanceTests_Compressed_TextIOIT/ws/src/sdks/python>
    Complete output from command python setup.py egg_info:
    <https://builds.apache.org/job/beam_PerformanceTests_Compressed_TextIOIT/ws/env/.beam_env/local/lib/python2.7/site-packages/setuptools/dist.py>:398: UserWarning: Normalizing '2.8.0.dev' to '2.8.0.dev0'
      normalized_version,
    running egg_info
    Requirement already satisfied: future==0.16.0 in /home/jenkins/.local/lib/python2.7/site-packages (0.16.0)
    gapic-google-cloud-pubsub-v1 0.15.4 has requirement oauth2client<4.0dev,>=2.0.0, but you'll have oauth2client 4.1.2 which is incompatible.
    proto-google-cloud-datastore-v1 0.90.4 has requirement oauth2client<4.0dev,>=2.0.0, but you'll have oauth2client 4.1.2 which is incompatible.
    proto-google-cloud-pubsub-v1 0.15.4 has requirement oauth2client<4.0dev,>=2.0.0, but you'll have oauth2client 4.1.2 which is incompatible.
    googledatastore 7.0.1 has requirement httplib2<0.10,>=0.9.1, but you'll have httplib2 0.11.3 which is incompatible.
    googledatastore 7.0.1 has requirement oauth2client<4.0.0,>=2.0.1, but you'll have oauth2client 4.1.2 which is incompatible.
    You are using pip version 10.0.1, however version 18.0 is available.
    You should consider upgrading via the 'pip install --upgrade pip' command.
    error: [Errno 2] No such file or directory
    
    ----------------------------------------
Command "python setup.py egg_info" failed with error code 1 in <https://builds.apache.org/job/beam_PerformanceTests_Compressed_TextIOIT/ws/src/sdks/python/>
Build step 'Execute shell' marked build as failure

Jenkins build is back to normal : beam_PerformanceTests_Compressed_TextIOIT #966

Posted by Apache Jenkins Server <je...@builds.apache.org>.
See <https://builds.apache.org/job/beam_PerformanceTests_Compressed_TextIOIT/966/display/redirect?page=changes>


Build failed in Jenkins: beam_PerformanceTests_Compressed_TextIOIT #965

Posted by Apache Jenkins Server <je...@builds.apache.org>.
See <https://builds.apache.org/job/beam_PerformanceTests_Compressed_TextIOIT/965/display/redirect>

------------------------------------------
Started by timer
[EnvInject] - Loading node environment variables.
Building remotely on beam6 (beam) in workspace <https://builds.apache.org/job/beam_PerformanceTests_Compressed_TextIOIT/ws/>
 > git rev-parse --is-inside-work-tree # timeout=10
Fetching changes from the remote Git repository
 > git config remote.origin.url https://github.com/apache/beam.git # timeout=10
Fetching upstream changes from https://github.com/apache/beam.git
 > git --version # timeout=10
 > git fetch --tags --progress https://github.com/apache/beam.git +refs/heads/*:refs/remotes/origin/* +refs/pull/${ghprbPullId}/*:refs/remotes/origin/pr/${ghprbPullId}/*
 > git rev-parse origin/master^{commit} # timeout=10
Checking out Revision 520b3a24e49306c30940ceab09100d775a04d28e (origin/master)
 > git config core.sparsecheckout # timeout=10
 > git checkout -f 520b3a24e49306c30940ceab09100d775a04d28e
Commit message: "Merge pull request #6359 from RobbeSneyders/transforms"
 > git rev-list --no-walk 520b3a24e49306c30940ceab09100d775a04d28e # timeout=10
Cleaning workspace
 > git rev-parse --verify HEAD # timeout=10
Resetting working tree
 > git reset --hard # timeout=10
 > git clean -fdx # timeout=10
[EnvInject] - Executing scripts and injecting environment variables after the SCM step.
[EnvInject] - Injecting as environment variables the properties content 
SPARK_LOCAL_IP=127.0.0.1

[EnvInject] - Variables injected successfully.
[beam_PerformanceTests_Compressed_TextIOIT] $ /bin/bash -xe /tmp/jenkins7275855100094893986.sh
+ rm -rf <https://builds.apache.org/job/beam_PerformanceTests_Compressed_TextIOIT/ws/PerfKitBenchmarker>
[beam_PerformanceTests_Compressed_TextIOIT] $ /bin/bash -xe /tmp/jenkins570054099178316418.sh
+ rm -rf <https://builds.apache.org/job/beam_PerformanceTests_Compressed_TextIOIT/ws/env/.beam_env>
[beam_PerformanceTests_Compressed_TextIOIT] $ /bin/bash -xe /tmp/jenkins3390220782177305393.sh
+ rm -rf <https://builds.apache.org/job/beam_PerformanceTests_Compressed_TextIOIT/ws/env/.perfkit_env>
[beam_PerformanceTests_Compressed_TextIOIT] $ /bin/bash -xe /tmp/jenkins2727492633873019643.sh
+ virtualenv <https://builds.apache.org/job/beam_PerformanceTests_Compressed_TextIOIT/ws/env/.beam_env> --system-site-packages
New python executable in <https://builds.apache.org/job/beam_PerformanceTests_Compressed_TextIOIT/ws/env/.beam_env/bin/python2>
Also creating executable in <https://builds.apache.org/job/beam_PerformanceTests_Compressed_TextIOIT/ws/env/.beam_env/bin/python>
Installing setuptools, pkg_resources, pip, wheel...done.
Running virtualenv with interpreter /usr/bin/python2
[beam_PerformanceTests_Compressed_TextIOIT] $ /bin/bash -xe /tmp/jenkins363185619581089039.sh
+ virtualenv <https://builds.apache.org/job/beam_PerformanceTests_Compressed_TextIOIT/ws/env/.perfkit_env> --system-site-packages
New python executable in <https://builds.apache.org/job/beam_PerformanceTests_Compressed_TextIOIT/ws/env/.perfkit_env/bin/python2>
Also creating executable in <https://builds.apache.org/job/beam_PerformanceTests_Compressed_TextIOIT/ws/env/.perfkit_env/bin/python>
Installing setuptools, pkg_resources, pip, wheel...done.
Running virtualenv with interpreter /usr/bin/python2
[beam_PerformanceTests_Compressed_TextIOIT] $ /bin/bash -xe /tmp/jenkins2903758557453360816.sh
+ <https://builds.apache.org/job/beam_PerformanceTests_Compressed_TextIOIT/ws/env/.beam_env/bin/pip> install --upgrade setuptools pip grpcio-tools==1.3.5
Requirement already up-to-date: setuptools in ./env/.beam_env/lib/python2.7/site-packages (40.2.0)
Requirement already up-to-date: pip in ./env/.beam_env/lib/python2.7/site-packages (18.0)
Collecting grpcio-tools==1.3.5
  Using cached https://files.pythonhosted.org/packages/05/f6/0296e29b1bac6f85d2a8556d48adf825307f73109a3c2c17fb734292db0a/grpcio_tools-1.3.5-cp27-cp27mu-manylinux1_x86_64.whl
Requirement already satisfied, skipping upgrade: grpcio>=1.3.5 in /home/jenkins/.local/lib/python2.7/site-packages (from grpcio-tools==1.3.5) (1.13.0)
Requirement already satisfied, skipping upgrade: protobuf>=3.2.0 in /home/jenkins/.local/lib/python2.7/site-packages (from grpcio-tools==1.3.5) (3.6.0)
Requirement already satisfied, skipping upgrade: six>=1.5.2 in /usr/local/lib/python2.7/dist-packages (from grpcio>=1.3.5->grpcio-tools==1.3.5) (1.11.0)
Requirement already satisfied, skipping upgrade: enum34>=1.0.4 in /usr/local/lib/python2.7/dist-packages (from grpcio>=1.3.5->grpcio-tools==1.3.5) (1.1.6)
Requirement already satisfied, skipping upgrade: futures>=2.2.0 in /home/jenkins/.local/lib/python2.7/site-packages (from grpcio>=1.3.5->grpcio-tools==1.3.5) (3.2.0)
Installing collected packages: grpcio-tools
Successfully installed grpcio-tools-1.3.5
[beam_PerformanceTests_Compressed_TextIOIT] $ /bin/bash -xe /tmp/jenkins8747137483705347818.sh
+ <https://builds.apache.org/job/beam_PerformanceTests_Compressed_TextIOIT/ws/env/.perfkit_env/bin/pip> install --upgrade setuptools pip
Requirement already up-to-date: setuptools in ./env/.perfkit_env/lib/python2.7/site-packages (40.2.0)
Requirement already up-to-date: pip in ./env/.perfkit_env/lib/python2.7/site-packages (18.0)
[beam_PerformanceTests_Compressed_TextIOIT] $ /bin/bash -xe /tmp/jenkins4294701682979918402.sh
+ git clone https://github.com/GoogleCloudPlatform/PerfKitBenchmarker.git <https://builds.apache.org/job/beam_PerformanceTests_Compressed_TextIOIT/ws/PerfKitBenchmarker>
Cloning into '<https://builds.apache.org/job/beam_PerformanceTests_Compressed_TextIOIT/ws/PerfKitBenchmarker'...>
[beam_PerformanceTests_Compressed_TextIOIT] $ /bin/bash -xe /tmp/jenkins6339310074929500490.sh
+ <https://builds.apache.org/job/beam_PerformanceTests_Compressed_TextIOIT/ws/env/.beam_env/bin/pip> install -e '<https://builds.apache.org/job/beam_PerformanceTests_Compressed_TextIOIT/ws/src/sdks/python/[gcp,test]'>
Obtaining file://<https://builds.apache.org/job/beam_PerformanceTests_Compressed_TextIOIT/ws/src/sdks/python>
    Complete output from command python setup.py egg_info:
    <https://builds.apache.org/job/beam_PerformanceTests_Compressed_TextIOIT/ws/env/.beam_env/local/lib/python2.7/site-packages/setuptools/dist.py>:398: UserWarning: Normalizing '2.8.0.dev' to '2.8.0.dev0'
      normalized_version,
    running egg_info
    Requirement already satisfied: future==0.16.0 in /home/jenkins/.local/lib/python2.7/site-packages (0.16.0)
    gapic-google-cloud-pubsub-v1 0.15.4 has requirement oauth2client<4.0dev,>=2.0.0, but you'll have oauth2client 4.1.2 which is incompatible.
    proto-google-cloud-datastore-v1 0.90.4 has requirement oauth2client<4.0dev,>=2.0.0, but you'll have oauth2client 4.1.2 which is incompatible.
    proto-google-cloud-pubsub-v1 0.15.4 has requirement oauth2client<4.0dev,>=2.0.0, but you'll have oauth2client 4.1.2 which is incompatible.
    googledatastore 7.0.1 has requirement httplib2<0.10,>=0.9.1, but you'll have httplib2 0.11.3 which is incompatible.
    googledatastore 7.0.1 has requirement oauth2client<4.0.0,>=2.0.1, but you'll have oauth2client 4.1.2 which is incompatible.
    You are using pip version 10.0.1, however version 18.0 is available.
    You should consider upgrading via the 'pip install --upgrade pip' command.
    error: [Errno 2] No such file or directory
    
    ----------------------------------------
Command "python setup.py egg_info" failed with error code 1 in <https://builds.apache.org/job/beam_PerformanceTests_Compressed_TextIOIT/ws/src/sdks/python/>
Build step 'Execute shell' marked build as failure

Build failed in Jenkins: beam_PerformanceTests_Compressed_TextIOIT #964

Posted by Apache Jenkins Server <je...@builds.apache.org>.
See <https://builds.apache.org/job/beam_PerformanceTests_Compressed_TextIOIT/964/display/redirect?page=changes>

Changes:

[lcwik] [BEAM-5351] Fix missing pom.xml file in artifact jar.

[robbe.sneyders] remove sys.exc_clear()

------------------------------------------
Started by timer
[EnvInject] - Loading node environment variables.
Building remotely on beam6 (beam) in workspace <https://builds.apache.org/job/beam_PerformanceTests_Compressed_TextIOIT/ws/>
 > git rev-parse --is-inside-work-tree # timeout=10
Fetching changes from the remote Git repository
 > git config remote.origin.url https://github.com/apache/beam.git # timeout=10
Fetching upstream changes from https://github.com/apache/beam.git
 > git --version # timeout=10
 > git fetch --tags --progress https://github.com/apache/beam.git +refs/heads/*:refs/remotes/origin/* +refs/pull/${ghprbPullId}/*:refs/remotes/origin/pr/${ghprbPullId}/*
 > git rev-parse origin/master^{commit} # timeout=10
Checking out Revision 520b3a24e49306c30940ceab09100d775a04d28e (origin/master)
 > git config core.sparsecheckout # timeout=10
 > git checkout -f 520b3a24e49306c30940ceab09100d775a04d28e
Commit message: "Merge pull request #6359 from RobbeSneyders/transforms"
 > git rev-list --no-walk 883f01536440bdf9b582d785b6e609a4a90cfdff # timeout=10
Cleaning workspace
 > git rev-parse --verify HEAD # timeout=10
Resetting working tree
 > git reset --hard # timeout=10
 > git clean -fdx # timeout=10
[EnvInject] - Executing scripts and injecting environment variables after the SCM step.
[EnvInject] - Injecting as environment variables the properties content 
SPARK_LOCAL_IP=127.0.0.1

[EnvInject] - Variables injected successfully.
[beam_PerformanceTests_Compressed_TextIOIT] $ /bin/bash -xe /tmp/jenkins105477219952559872.sh
+ rm -rf <https://builds.apache.org/job/beam_PerformanceTests_Compressed_TextIOIT/ws/PerfKitBenchmarker>
[beam_PerformanceTests_Compressed_TextIOIT] $ /bin/bash -xe /tmp/jenkins8706302147854570634.sh
+ rm -rf <https://builds.apache.org/job/beam_PerformanceTests_Compressed_TextIOIT/ws/env/.beam_env>
[beam_PerformanceTests_Compressed_TextIOIT] $ /bin/bash -xe /tmp/jenkins4856417261153232658.sh
+ rm -rf <https://builds.apache.org/job/beam_PerformanceTests_Compressed_TextIOIT/ws/env/.perfkit_env>
[beam_PerformanceTests_Compressed_TextIOIT] $ /bin/bash -xe /tmp/jenkins4938838796565154586.sh
+ virtualenv <https://builds.apache.org/job/beam_PerformanceTests_Compressed_TextIOIT/ws/env/.beam_env> --system-site-packages
New python executable in <https://builds.apache.org/job/beam_PerformanceTests_Compressed_TextIOIT/ws/env/.beam_env/bin/python2>
Also creating executable in <https://builds.apache.org/job/beam_PerformanceTests_Compressed_TextIOIT/ws/env/.beam_env/bin/python>
Installing setuptools, pkg_resources, pip, wheel...done.
Running virtualenv with interpreter /usr/bin/python2
[beam_PerformanceTests_Compressed_TextIOIT] $ /bin/bash -xe /tmp/jenkins5204281149200774661.sh
+ virtualenv <https://builds.apache.org/job/beam_PerformanceTests_Compressed_TextIOIT/ws/env/.perfkit_env> --system-site-packages
New python executable in <https://builds.apache.org/job/beam_PerformanceTests_Compressed_TextIOIT/ws/env/.perfkit_env/bin/python2>
Also creating executable in <https://builds.apache.org/job/beam_PerformanceTests_Compressed_TextIOIT/ws/env/.perfkit_env/bin/python>
Installing setuptools, pkg_resources, pip, wheel...done.
Running virtualenv with interpreter /usr/bin/python2
[beam_PerformanceTests_Compressed_TextIOIT] $ /bin/bash -xe /tmp/jenkins8504627639796370150.sh
+ <https://builds.apache.org/job/beam_PerformanceTests_Compressed_TextIOIT/ws/env/.beam_env/bin/pip> install --upgrade setuptools pip grpcio-tools==1.3.5
Requirement already up-to-date: setuptools in ./env/.beam_env/lib/python2.7/site-packages (40.2.0)
Requirement already up-to-date: pip in ./env/.beam_env/lib/python2.7/site-packages (18.0)
Collecting grpcio-tools==1.3.5
  Using cached https://files.pythonhosted.org/packages/05/f6/0296e29b1bac6f85d2a8556d48adf825307f73109a3c2c17fb734292db0a/grpcio_tools-1.3.5-cp27-cp27mu-manylinux1_x86_64.whl
Requirement already satisfied, skipping upgrade: grpcio>=1.3.5 in /home/jenkins/.local/lib/python2.7/site-packages (from grpcio-tools==1.3.5) (1.13.0)
Requirement already satisfied, skipping upgrade: protobuf>=3.2.0 in /home/jenkins/.local/lib/python2.7/site-packages (from grpcio-tools==1.3.5) (3.6.0)
Requirement already satisfied, skipping upgrade: six>=1.5.2 in /usr/local/lib/python2.7/dist-packages (from grpcio>=1.3.5->grpcio-tools==1.3.5) (1.11.0)
Requirement already satisfied, skipping upgrade: enum34>=1.0.4 in /usr/local/lib/python2.7/dist-packages (from grpcio>=1.3.5->grpcio-tools==1.3.5) (1.1.6)
Requirement already satisfied, skipping upgrade: futures>=2.2.0 in /home/jenkins/.local/lib/python2.7/site-packages (from grpcio>=1.3.5->grpcio-tools==1.3.5) (3.2.0)
Installing collected packages: grpcio-tools
Successfully installed grpcio-tools-1.3.5
[beam_PerformanceTests_Compressed_TextIOIT] $ /bin/bash -xe /tmp/jenkins4021020252056202423.sh
+ <https://builds.apache.org/job/beam_PerformanceTests_Compressed_TextIOIT/ws/env/.perfkit_env/bin/pip> install --upgrade setuptools pip
Requirement already up-to-date: setuptools in ./env/.perfkit_env/lib/python2.7/site-packages (40.2.0)
Requirement already up-to-date: pip in ./env/.perfkit_env/lib/python2.7/site-packages (18.0)
[beam_PerformanceTests_Compressed_TextIOIT] $ /bin/bash -xe /tmp/jenkins5993274560160797688.sh
+ git clone https://github.com/GoogleCloudPlatform/PerfKitBenchmarker.git <https://builds.apache.org/job/beam_PerformanceTests_Compressed_TextIOIT/ws/PerfKitBenchmarker>
Cloning into '<https://builds.apache.org/job/beam_PerformanceTests_Compressed_TextIOIT/ws/PerfKitBenchmarker'...>
[beam_PerformanceTests_Compressed_TextIOIT] $ /bin/bash -xe /tmp/jenkins4965135317400303109.sh
+ <https://builds.apache.org/job/beam_PerformanceTests_Compressed_TextIOIT/ws/env/.beam_env/bin/pip> install -e '<https://builds.apache.org/job/beam_PerformanceTests_Compressed_TextIOIT/ws/src/sdks/python/[gcp,test]'>
Obtaining file://<https://builds.apache.org/job/beam_PerformanceTests_Compressed_TextIOIT/ws/src/sdks/python>
    Complete output from command python setup.py egg_info:
    <https://builds.apache.org/job/beam_PerformanceTests_Compressed_TextIOIT/ws/env/.beam_env/local/lib/python2.7/site-packages/setuptools/dist.py>:398: UserWarning: Normalizing '2.8.0.dev' to '2.8.0.dev0'
      normalized_version,
    running egg_info
    Requirement already satisfied: future==0.16.0 in /home/jenkins/.local/lib/python2.7/site-packages (0.16.0)
    gapic-google-cloud-pubsub-v1 0.15.4 has requirement oauth2client<4.0dev,>=2.0.0, but you'll have oauth2client 4.1.2 which is incompatible.
    proto-google-cloud-datastore-v1 0.90.4 has requirement oauth2client<4.0dev,>=2.0.0, but you'll have oauth2client 4.1.2 which is incompatible.
    proto-google-cloud-pubsub-v1 0.15.4 has requirement oauth2client<4.0dev,>=2.0.0, but you'll have oauth2client 4.1.2 which is incompatible.
    googledatastore 7.0.1 has requirement httplib2<0.10,>=0.9.1, but you'll have httplib2 0.11.3 which is incompatible.
    googledatastore 7.0.1 has requirement oauth2client<4.0.0,>=2.0.1, but you'll have oauth2client 4.1.2 which is incompatible.
    You are using pip version 10.0.1, however version 18.0 is available.
    You should consider upgrading via the 'pip install --upgrade pip' command.
    error: [Errno 2] No such file or directory
    
    ----------------------------------------
Command "python setup.py egg_info" failed with error code 1 in <https://builds.apache.org/job/beam_PerformanceTests_Compressed_TextIOIT/ws/src/sdks/python/>
Build step 'Execute shell' marked build as failure

Build failed in Jenkins: beam_PerformanceTests_Compressed_TextIOIT #963

Posted by Apache Jenkins Server <je...@builds.apache.org>.
See <https://builds.apache.org/job/beam_PerformanceTests_Compressed_TextIOIT/963/display/redirect?page=changes>

Changes:

[lcwik] [BEAM-5149] Add support for the Java SDK harness to merge windows.

[lcwik] Address PR comments.

------------------------------------------
Started by timer
[EnvInject] - Loading node environment variables.
Building remotely on beam6 (beam) in workspace <https://builds.apache.org/job/beam_PerformanceTests_Compressed_TextIOIT/ws/>
 > git rev-parse --is-inside-work-tree # timeout=10
Fetching changes from the remote Git repository
 > git config remote.origin.url https://github.com/apache/beam.git # timeout=10
Fetching upstream changes from https://github.com/apache/beam.git
 > git --version # timeout=10
 > git fetch --tags --progress https://github.com/apache/beam.git +refs/heads/*:refs/remotes/origin/* +refs/pull/${ghprbPullId}/*:refs/remotes/origin/pr/${ghprbPullId}/*
 > git rev-parse origin/master^{commit} # timeout=10
Checking out Revision 883f01536440bdf9b582d785b6e609a4a90cfdff (origin/master)
 > git config core.sparsecheckout # timeout=10
 > git checkout -f 883f01536440bdf9b582d785b6e609a4a90cfdff
Commit message: "[BEAM-5149] Add support for the Java SDK harness to merge windows."
 > git rev-list --no-walk 9b68f926628d727e917b6a33ccdafcfe693eef6a # timeout=10
Cleaning workspace
 > git rev-parse --verify HEAD # timeout=10
Resetting working tree
 > git reset --hard # timeout=10
 > git clean -fdx # timeout=10
[EnvInject] - Executing scripts and injecting environment variables after the SCM step.
[EnvInject] - Injecting as environment variables the properties content 
SPARK_LOCAL_IP=127.0.0.1

[EnvInject] - Variables injected successfully.
[beam_PerformanceTests_Compressed_TextIOIT] $ /bin/bash -xe /tmp/jenkins5207636380739612766.sh
+ rm -rf <https://builds.apache.org/job/beam_PerformanceTests_Compressed_TextIOIT/ws/PerfKitBenchmarker>
[beam_PerformanceTests_Compressed_TextIOIT] $ /bin/bash -xe /tmp/jenkins5301360736796407331.sh
+ rm -rf <https://builds.apache.org/job/beam_PerformanceTests_Compressed_TextIOIT/ws/env/.beam_env>
[beam_PerformanceTests_Compressed_TextIOIT] $ /bin/bash -xe /tmp/jenkins587747242574037030.sh
+ rm -rf <https://builds.apache.org/job/beam_PerformanceTests_Compressed_TextIOIT/ws/env/.perfkit_env>
[beam_PerformanceTests_Compressed_TextIOIT] $ /bin/bash -xe /tmp/jenkins3475176482329017334.sh
+ virtualenv <https://builds.apache.org/job/beam_PerformanceTests_Compressed_TextIOIT/ws/env/.beam_env> --system-site-packages
New python executable in <https://builds.apache.org/job/beam_PerformanceTests_Compressed_TextIOIT/ws/env/.beam_env/bin/python2>
Also creating executable in <https://builds.apache.org/job/beam_PerformanceTests_Compressed_TextIOIT/ws/env/.beam_env/bin/python>
Installing setuptools, pkg_resources, pip, wheel...done.
Running virtualenv with interpreter /usr/bin/python2
[beam_PerformanceTests_Compressed_TextIOIT] $ /bin/bash -xe /tmp/jenkins7008064949194565312.sh
+ virtualenv <https://builds.apache.org/job/beam_PerformanceTests_Compressed_TextIOIT/ws/env/.perfkit_env> --system-site-packages
New python executable in <https://builds.apache.org/job/beam_PerformanceTests_Compressed_TextIOIT/ws/env/.perfkit_env/bin/python2>
Also creating executable in <https://builds.apache.org/job/beam_PerformanceTests_Compressed_TextIOIT/ws/env/.perfkit_env/bin/python>
Installing setuptools, pkg_resources, pip, wheel...done.
Running virtualenv with interpreter /usr/bin/python2
[beam_PerformanceTests_Compressed_TextIOIT] $ /bin/bash -xe /tmp/jenkins4050109786932754237.sh
+ <https://builds.apache.org/job/beam_PerformanceTests_Compressed_TextIOIT/ws/env/.beam_env/bin/pip> install --upgrade setuptools pip grpcio-tools==1.3.5
Requirement already up-to-date: setuptools in ./env/.beam_env/lib/python2.7/site-packages (40.2.0)
Requirement already up-to-date: pip in ./env/.beam_env/lib/python2.7/site-packages (18.0)
Collecting grpcio-tools==1.3.5
  Using cached https://files.pythonhosted.org/packages/05/f6/0296e29b1bac6f85d2a8556d48adf825307f73109a3c2c17fb734292db0a/grpcio_tools-1.3.5-cp27-cp27mu-manylinux1_x86_64.whl
Requirement already satisfied, skipping upgrade: grpcio>=1.3.5 in /home/jenkins/.local/lib/python2.7/site-packages (from grpcio-tools==1.3.5) (1.13.0)
Requirement already satisfied, skipping upgrade: protobuf>=3.2.0 in /home/jenkins/.local/lib/python2.7/site-packages (from grpcio-tools==1.3.5) (3.6.0)
Requirement already satisfied, skipping upgrade: six>=1.5.2 in /usr/local/lib/python2.7/dist-packages (from grpcio>=1.3.5->grpcio-tools==1.3.5) (1.11.0)
Requirement already satisfied, skipping upgrade: enum34>=1.0.4 in /usr/local/lib/python2.7/dist-packages (from grpcio>=1.3.5->grpcio-tools==1.3.5) (1.1.6)
Requirement already satisfied, skipping upgrade: futures>=2.2.0 in /home/jenkins/.local/lib/python2.7/site-packages (from grpcio>=1.3.5->grpcio-tools==1.3.5) (3.2.0)
Installing collected packages: grpcio-tools
Successfully installed grpcio-tools-1.3.5
[beam_PerformanceTests_Compressed_TextIOIT] $ /bin/bash -xe /tmp/jenkins8617634479874864838.sh
+ <https://builds.apache.org/job/beam_PerformanceTests_Compressed_TextIOIT/ws/env/.perfkit_env/bin/pip> install --upgrade setuptools pip
Requirement already up-to-date: setuptools in ./env/.perfkit_env/lib/python2.7/site-packages (40.2.0)
Requirement already up-to-date: pip in ./env/.perfkit_env/lib/python2.7/site-packages (18.0)
[beam_PerformanceTests_Compressed_TextIOIT] $ /bin/bash -xe /tmp/jenkins4227006990476971141.sh
+ git clone https://github.com/GoogleCloudPlatform/PerfKitBenchmarker.git <https://builds.apache.org/job/beam_PerformanceTests_Compressed_TextIOIT/ws/PerfKitBenchmarker>
Cloning into '<https://builds.apache.org/job/beam_PerformanceTests_Compressed_TextIOIT/ws/PerfKitBenchmarker'...>
[beam_PerformanceTests_Compressed_TextIOIT] $ /bin/bash -xe /tmp/jenkins4426900639076590127.sh
+ <https://builds.apache.org/job/beam_PerformanceTests_Compressed_TextIOIT/ws/env/.beam_env/bin/pip> install -e '<https://builds.apache.org/job/beam_PerformanceTests_Compressed_TextIOIT/ws/src/sdks/python/[gcp,test]'>
Obtaining file://<https://builds.apache.org/job/beam_PerformanceTests_Compressed_TextIOIT/ws/src/sdks/python>
    Complete output from command python setup.py egg_info:
    <https://builds.apache.org/job/beam_PerformanceTests_Compressed_TextIOIT/ws/env/.beam_env/local/lib/python2.7/site-packages/setuptools/dist.py>:398: UserWarning: Normalizing '2.8.0.dev' to '2.8.0.dev0'
      normalized_version,
    running egg_info
    Requirement already satisfied: future==0.16.0 in /home/jenkins/.local/lib/python2.7/site-packages (0.16.0)
    gapic-google-cloud-pubsub-v1 0.15.4 has requirement oauth2client<4.0dev,>=2.0.0, but you'll have oauth2client 4.1.2 which is incompatible.
    proto-google-cloud-datastore-v1 0.90.4 has requirement oauth2client<4.0dev,>=2.0.0, but you'll have oauth2client 4.1.2 which is incompatible.
    proto-google-cloud-pubsub-v1 0.15.4 has requirement oauth2client<4.0dev,>=2.0.0, but you'll have oauth2client 4.1.2 which is incompatible.
    googledatastore 7.0.1 has requirement httplib2<0.10,>=0.9.1, but you'll have httplib2 0.11.3 which is incompatible.
    googledatastore 7.0.1 has requirement oauth2client<4.0.0,>=2.0.1, but you'll have oauth2client 4.1.2 which is incompatible.
    You are using pip version 10.0.1, however version 18.0 is available.
    You should consider upgrading via the 'pip install --upgrade pip' command.
    error: [Errno 2] No such file or directory
    
    ----------------------------------------
Command "python setup.py egg_info" failed with error code 1 in <https://builds.apache.org/job/beam_PerformanceTests_Compressed_TextIOIT/ws/src/sdks/python/>
Build step 'Execute shell' marked build as failure

Build failed in Jenkins: beam_PerformanceTests_Compressed_TextIOIT #962

Posted by Apache Jenkins Server <je...@builds.apache.org>.
See <https://builds.apache.org/job/beam_PerformanceTests_Compressed_TextIOIT/962/display/redirect?page=changes>

Changes:

[robertwb] Update container versions of NumPy and TensorFlow.

------------------------------------------
Started by timer
[EnvInject] - Loading node environment variables.
Building remotely on beam6 (beam) in workspace <https://builds.apache.org/job/beam_PerformanceTests_Compressed_TextIOIT/ws/>
 > git rev-parse --is-inside-work-tree # timeout=10
Fetching changes from the remote Git repository
 > git config remote.origin.url https://github.com/apache/beam.git # timeout=10
Fetching upstream changes from https://github.com/apache/beam.git
 > git --version # timeout=10
 > git fetch --tags --progress https://github.com/apache/beam.git +refs/heads/*:refs/remotes/origin/* +refs/pull/${ghprbPullId}/*:refs/remotes/origin/pr/${ghprbPullId}/*
 > git rev-parse origin/master^{commit} # timeout=10
Checking out Revision 9b68f926628d727e917b6a33ccdafcfe693eef6a (origin/master)
 > git config core.sparsecheckout # timeout=10
 > git checkout -f 9b68f926628d727e917b6a33ccdafcfe693eef6a
Commit message: "Merge pull request #6314 from robertwb/update-tf"
 > git rev-list --no-walk 6aa2cf55376481de83a801cd9d79fb775916ee88 # timeout=10
Cleaning workspace
 > git rev-parse --verify HEAD # timeout=10
Resetting working tree
 > git reset --hard # timeout=10
 > git clean -fdx # timeout=10
[EnvInject] - Executing scripts and injecting environment variables after the SCM step.
[EnvInject] - Injecting as environment variables the properties content 
SPARK_LOCAL_IP=127.0.0.1

[EnvInject] - Variables injected successfully.
[beam_PerformanceTests_Compressed_TextIOIT] $ /bin/bash -xe /tmp/jenkins7982806641426884261.sh
+ rm -rf <https://builds.apache.org/job/beam_PerformanceTests_Compressed_TextIOIT/ws/PerfKitBenchmarker>
[beam_PerformanceTests_Compressed_TextIOIT] $ /bin/bash -xe /tmp/jenkins8514814151448985361.sh
+ rm -rf <https://builds.apache.org/job/beam_PerformanceTests_Compressed_TextIOIT/ws/env/.beam_env>
[beam_PerformanceTests_Compressed_TextIOIT] $ /bin/bash -xe /tmp/jenkins6970490592933148753.sh
+ rm -rf <https://builds.apache.org/job/beam_PerformanceTests_Compressed_TextIOIT/ws/env/.perfkit_env>
[beam_PerformanceTests_Compressed_TextIOIT] $ /bin/bash -xe /tmp/jenkins8342111399644694265.sh
+ virtualenv <https://builds.apache.org/job/beam_PerformanceTests_Compressed_TextIOIT/ws/env/.beam_env> --system-site-packages
New python executable in <https://builds.apache.org/job/beam_PerformanceTests_Compressed_TextIOIT/ws/env/.beam_env/bin/python2>
Also creating executable in <https://builds.apache.org/job/beam_PerformanceTests_Compressed_TextIOIT/ws/env/.beam_env/bin/python>
Installing setuptools, pkg_resources, pip, wheel...done.
Running virtualenv with interpreter /usr/bin/python2
[beam_PerformanceTests_Compressed_TextIOIT] $ /bin/bash -xe /tmp/jenkins8441806917954305724.sh
+ virtualenv <https://builds.apache.org/job/beam_PerformanceTests_Compressed_TextIOIT/ws/env/.perfkit_env> --system-site-packages
New python executable in <https://builds.apache.org/job/beam_PerformanceTests_Compressed_TextIOIT/ws/env/.perfkit_env/bin/python2>
Also creating executable in <https://builds.apache.org/job/beam_PerformanceTests_Compressed_TextIOIT/ws/env/.perfkit_env/bin/python>
Installing setuptools, pkg_resources, pip, wheel...done.
Running virtualenv with interpreter /usr/bin/python2
[beam_PerformanceTests_Compressed_TextIOIT] $ /bin/bash -xe /tmp/jenkins1731260423871445655.sh
+ <https://builds.apache.org/job/beam_PerformanceTests_Compressed_TextIOIT/ws/env/.beam_env/bin/pip> install --upgrade setuptools pip grpcio-tools==1.3.5
Requirement already up-to-date: setuptools in ./env/.beam_env/lib/python2.7/site-packages (40.2.0)
Requirement already up-to-date: pip in ./env/.beam_env/lib/python2.7/site-packages (18.0)
Collecting grpcio-tools==1.3.5
  Using cached https://files.pythonhosted.org/packages/05/f6/0296e29b1bac6f85d2a8556d48adf825307f73109a3c2c17fb734292db0a/grpcio_tools-1.3.5-cp27-cp27mu-manylinux1_x86_64.whl
Requirement already satisfied, skipping upgrade: grpcio>=1.3.5 in /home/jenkins/.local/lib/python2.7/site-packages (from grpcio-tools==1.3.5) (1.13.0)
Requirement already satisfied, skipping upgrade: protobuf>=3.2.0 in /home/jenkins/.local/lib/python2.7/site-packages (from grpcio-tools==1.3.5) (3.6.0)
Requirement already satisfied, skipping upgrade: six>=1.5.2 in /usr/local/lib/python2.7/dist-packages (from grpcio>=1.3.5->grpcio-tools==1.3.5) (1.11.0)
Requirement already satisfied, skipping upgrade: enum34>=1.0.4 in /usr/local/lib/python2.7/dist-packages (from grpcio>=1.3.5->grpcio-tools==1.3.5) (1.1.6)
Requirement already satisfied, skipping upgrade: futures>=2.2.0 in /home/jenkins/.local/lib/python2.7/site-packages (from grpcio>=1.3.5->grpcio-tools==1.3.5) (3.2.0)
Installing collected packages: grpcio-tools
Successfully installed grpcio-tools-1.3.5
[beam_PerformanceTests_Compressed_TextIOIT] $ /bin/bash -xe /tmp/jenkins2197458293972337092.sh
+ <https://builds.apache.org/job/beam_PerformanceTests_Compressed_TextIOIT/ws/env/.perfkit_env/bin/pip> install --upgrade setuptools pip
Requirement already up-to-date: setuptools in ./env/.perfkit_env/lib/python2.7/site-packages (40.2.0)
Requirement already up-to-date: pip in ./env/.perfkit_env/lib/python2.7/site-packages (18.0)
[beam_PerformanceTests_Compressed_TextIOIT] $ /bin/bash -xe /tmp/jenkins8218885285821898666.sh
+ git clone https://github.com/GoogleCloudPlatform/PerfKitBenchmarker.git <https://builds.apache.org/job/beam_PerformanceTests_Compressed_TextIOIT/ws/PerfKitBenchmarker>
Cloning into '<https://builds.apache.org/job/beam_PerformanceTests_Compressed_TextIOIT/ws/PerfKitBenchmarker'...>
[beam_PerformanceTests_Compressed_TextIOIT] $ /bin/bash -xe /tmp/jenkins747371571102685107.sh
+ <https://builds.apache.org/job/beam_PerformanceTests_Compressed_TextIOIT/ws/env/.beam_env/bin/pip> install -e '<https://builds.apache.org/job/beam_PerformanceTests_Compressed_TextIOIT/ws/src/sdks/python/[gcp,test]'>
Obtaining file://<https://builds.apache.org/job/beam_PerformanceTests_Compressed_TextIOIT/ws/src/sdks/python>
    Complete output from command python setup.py egg_info:
    <https://builds.apache.org/job/beam_PerformanceTests_Compressed_TextIOIT/ws/env/.beam_env/local/lib/python2.7/site-packages/setuptools/dist.py>:398: UserWarning: Normalizing '2.8.0.dev' to '2.8.0.dev0'
      normalized_version,
    running egg_info
    Requirement already satisfied: future==0.16.0 in /home/jenkins/.local/lib/python2.7/site-packages (0.16.0)
    gapic-google-cloud-pubsub-v1 0.15.4 has requirement oauth2client<4.0dev,>=2.0.0, but you'll have oauth2client 4.1.2 which is incompatible.
    proto-google-cloud-datastore-v1 0.90.4 has requirement oauth2client<4.0dev,>=2.0.0, but you'll have oauth2client 4.1.2 which is incompatible.
    proto-google-cloud-pubsub-v1 0.15.4 has requirement oauth2client<4.0dev,>=2.0.0, but you'll have oauth2client 4.1.2 which is incompatible.
    googledatastore 7.0.1 has requirement httplib2<0.10,>=0.9.1, but you'll have httplib2 0.11.3 which is incompatible.
    googledatastore 7.0.1 has requirement oauth2client<4.0.0,>=2.0.1, but you'll have oauth2client 4.1.2 which is incompatible.
    You are using pip version 10.0.1, however version 18.0 is available.
    You should consider upgrading via the 'pip install --upgrade pip' command.
    error: [Errno 2] No such file or directory
    
    ----------------------------------------
Command "python setup.py egg_info" failed with error code 1 in <https://builds.apache.org/job/beam_PerformanceTests_Compressed_TextIOIT/ws/src/sdks/python/>
Build step 'Execute shell' marked build as failure

Build failed in Jenkins: beam_PerformanceTests_Compressed_TextIOIT #961

Posted by Apache Jenkins Server <je...@builds.apache.org>.
See <https://builds.apache.org/job/beam_PerformanceTests_Compressed_TextIOIT/961/display/redirect>

------------------------------------------
Started by timer
[EnvInject] - Loading node environment variables.
Building remotely on beam5 (beam) in workspace <https://builds.apache.org/job/beam_PerformanceTests_Compressed_TextIOIT/ws/>
 > git rev-parse --is-inside-work-tree # timeout=10
Fetching changes from the remote Git repository
 > git config remote.origin.url https://github.com/apache/beam.git # timeout=10
Fetching upstream changes from https://github.com/apache/beam.git
 > git --version # timeout=10
 > git fetch --tags --progress https://github.com/apache/beam.git +refs/heads/*:refs/remotes/origin/* +refs/pull/${ghprbPullId}/*:refs/remotes/origin/pr/${ghprbPullId}/*
 > git rev-parse origin/master^{commit} # timeout=10
Checking out Revision 6aa2cf55376481de83a801cd9d79fb775916ee88 (origin/master)
 > git config core.sparsecheckout # timeout=10
 > git checkout -f 6aa2cf55376481de83a801cd9d79fb775916ee88
Commit message: "Merge pull request #6337 from apilloud/metadata"
 > git rev-list --no-walk 6aa2cf55376481de83a801cd9d79fb775916ee88 # timeout=10
Cleaning workspace
 > git rev-parse --verify HEAD # timeout=10
Resetting working tree
 > git reset --hard # timeout=10
 > git clean -fdx # timeout=10
[EnvInject] - Executing scripts and injecting environment variables after the SCM step.
[EnvInject] - Injecting as environment variables the properties content 
SPARK_LOCAL_IP=127.0.0.1

[EnvInject] - Variables injected successfully.
[beam_PerformanceTests_Compressed_TextIOIT] $ /bin/bash -xe /tmp/jenkins4170598982826704990.sh
+ rm -rf <https://builds.apache.org/job/beam_PerformanceTests_Compressed_TextIOIT/ws/PerfKitBenchmarker>
[beam_PerformanceTests_Compressed_TextIOIT] $ /bin/bash -xe /tmp/jenkins5454132938445216779.sh
+ rm -rf <https://builds.apache.org/job/beam_PerformanceTests_Compressed_TextIOIT/ws/env/.beam_env>
[beam_PerformanceTests_Compressed_TextIOIT] $ /bin/bash -xe /tmp/jenkins1797332135895018251.sh
+ rm -rf <https://builds.apache.org/job/beam_PerformanceTests_Compressed_TextIOIT/ws/env/.perfkit_env>
[beam_PerformanceTests_Compressed_TextIOIT] $ /bin/bash -xe /tmp/jenkins3029708365571466594.sh
+ virtualenv <https://builds.apache.org/job/beam_PerformanceTests_Compressed_TextIOIT/ws/env/.beam_env> --system-site-packages
New python executable in <https://builds.apache.org/job/beam_PerformanceTests_Compressed_TextIOIT/ws/env/.beam_env/bin/python2>
Also creating executable in <https://builds.apache.org/job/beam_PerformanceTests_Compressed_TextIOIT/ws/env/.beam_env/bin/python>
Installing setuptools, pkg_resources, pip, wheel...done.
Running virtualenv with interpreter /usr/bin/python2
[beam_PerformanceTests_Compressed_TextIOIT] $ /bin/bash -xe /tmp/jenkins5803429898745692814.sh
+ virtualenv <https://builds.apache.org/job/beam_PerformanceTests_Compressed_TextIOIT/ws/env/.perfkit_env> --system-site-packages
New python executable in <https://builds.apache.org/job/beam_PerformanceTests_Compressed_TextIOIT/ws/env/.perfkit_env/bin/python2>
Also creating executable in <https://builds.apache.org/job/beam_PerformanceTests_Compressed_TextIOIT/ws/env/.perfkit_env/bin/python>
Installing setuptools, pkg_resources, pip, wheel...done.
Running virtualenv with interpreter /usr/bin/python2
[beam_PerformanceTests_Compressed_TextIOIT] $ /bin/bash -xe /tmp/jenkins1738171602795058998.sh
+ <https://builds.apache.org/job/beam_PerformanceTests_Compressed_TextIOIT/ws/env/.beam_env/bin/pip> install --upgrade setuptools pip grpcio-tools==1.3.5
Requirement already up-to-date: setuptools in ./env/.beam_env/lib/python2.7/site-packages (40.2.0)
Requirement already up-to-date: pip in ./env/.beam_env/lib/python2.7/site-packages (18.0)
Collecting grpcio-tools==1.3.5
  Using cached https://files.pythonhosted.org/packages/05/f6/0296e29b1bac6f85d2a8556d48adf825307f73109a3c2c17fb734292db0a/grpcio_tools-1.3.5-cp27-cp27mu-manylinux1_x86_64.whl
Collecting grpcio>=1.3.5 (from grpcio-tools==1.3.5)
  Using cached https://files.pythonhosted.org/packages/bd/a6/4bad0d1a49071363dc6547a5178656fe375c80535128c12bb65c59d1a329/grpcio-1.14.2-cp27-cp27mu-manylinux1_x86_64.whl
Collecting protobuf>=3.2.0 (from grpcio-tools==1.3.5)
  Using cached https://files.pythonhosted.org/packages/b8/c2/b7f587c0aaf8bf2201405e8162323037fe8d17aa21d3c7dda811b8d01469/protobuf-3.6.1-cp27-cp27mu-manylinux1_x86_64.whl
Requirement already satisfied, skipping upgrade: six>=1.5.2 in /usr/local/lib/python2.7/dist-packages (from grpcio>=1.3.5->grpcio-tools==1.3.5) (1.11.0)
Requirement already satisfied, skipping upgrade: enum34>=1.0.4 in /usr/local/lib/python2.7/dist-packages (from grpcio>=1.3.5->grpcio-tools==1.3.5) (1.1.6)
Collecting futures>=2.2.0 (from grpcio>=1.3.5->grpcio-tools==1.3.5)
  Using cached https://files.pythonhosted.org/packages/2d/99/b2c4e9d5a30f6471e410a146232b4118e697fa3ffc06d6a65efde84debd0/futures-3.2.0-py2-none-any.whl
Installing collected packages: futures, grpcio, protobuf, grpcio-tools
Successfully installed futures-3.2.0 grpcio-1.14.2 grpcio-tools-1.3.5 protobuf-3.6.1
[beam_PerformanceTests_Compressed_TextIOIT] $ /bin/bash -xe /tmp/jenkins5101770452395462978.sh
+ <https://builds.apache.org/job/beam_PerformanceTests_Compressed_TextIOIT/ws/env/.perfkit_env/bin/pip> install --upgrade setuptools pip
Requirement already up-to-date: setuptools in ./env/.perfkit_env/lib/python2.7/site-packages (40.2.0)
Requirement already up-to-date: pip in ./env/.perfkit_env/lib/python2.7/site-packages (18.0)
[beam_PerformanceTests_Compressed_TextIOIT] $ /bin/bash -xe /tmp/jenkins2989358205341242257.sh
+ git clone https://github.com/GoogleCloudPlatform/PerfKitBenchmarker.git <https://builds.apache.org/job/beam_PerformanceTests_Compressed_TextIOIT/ws/PerfKitBenchmarker>
Cloning into '<https://builds.apache.org/job/beam_PerformanceTests_Compressed_TextIOIT/ws/PerfKitBenchmarker'...>
[beam_PerformanceTests_Compressed_TextIOIT] $ /bin/bash -xe /tmp/jenkins7533067034099831529.sh
+ <https://builds.apache.org/job/beam_PerformanceTests_Compressed_TextIOIT/ws/env/.beam_env/bin/pip> install -e '<https://builds.apache.org/job/beam_PerformanceTests_Compressed_TextIOIT/ws/src/sdks/python/[gcp,test]'>
Obtaining file://<https://builds.apache.org/job/beam_PerformanceTests_Compressed_TextIOIT/ws/src/sdks/python>
    Complete output from command python setup.py egg_info:
    <https://builds.apache.org/job/beam_PerformanceTests_Compressed_TextIOIT/ws/env/.beam_env/local/lib/python2.7/site-packages/setuptools/dist.py>:398: UserWarning: Normalizing '2.8.0.dev' to '2.8.0.dev0'
      normalized_version,
    running egg_info
    Collecting future==0.16.0
    Installing collected packages: future
    Could not install packages due to an EnvironmentError: [Errno 13] Permission denied: '/usr/local/lib/python2.7/dist-packages/_markupbase'
    Consider using the `--user` option or check the permissions.
    
    Traceback (most recent call last):
      File "<string>", line 1, in <module>
      File "<https://builds.apache.org/job/beam_PerformanceTests_Compressed_TextIOIT/ws/src/sdks/python/setup.py",> line 230, in <module>
        'test': generate_protos_first(test),
      File "<https://builds.apache.org/job/beam_PerformanceTests_Compressed_TextIOIT/ws/env/.beam_env/local/lib/python2.7/site-packages/setuptools/__init__.py",> line 140, in setup
        return distutils.core.setup(**attrs)
      File "/usr/lib/python2.7/distutils/core.py", line 151, in setup
        dist.run_commands()
      File "/usr/lib/python2.7/distutils/dist.py", line 953, in run_commands
        self.run_command(cmd)
      File "/usr/lib/python2.7/distutils/dist.py", line 972, in run_command
        cmd_obj.run()
      File "<https://builds.apache.org/job/beam_PerformanceTests_Compressed_TextIOIT/ws/src/sdks/python/setup.py",> line 164, in run
        gen_protos.generate_proto_files()
      File "gen_protos.py", line 119, in generate_proto_files
        'Error installing future during proto generation')
    RuntimeError: Error installing future during proto generation
    
    ----------------------------------------
Command "python setup.py egg_info" failed with error code 1 in <https://builds.apache.org/job/beam_PerformanceTests_Compressed_TextIOIT/ws/src/sdks/python/>
Build step 'Execute shell' marked build as failure

Build failed in Jenkins: beam_PerformanceTests_Compressed_TextIOIT #960

Posted by Apache Jenkins Server <je...@builds.apache.org>.
See <https://builds.apache.org/job/beam_PerformanceTests_Compressed_TextIOIT/960/display/redirect>

------------------------------------------
Started by timer
[EnvInject] - Loading node environment variables.
Building remotely on beam5 (beam) in workspace <https://builds.apache.org/job/beam_PerformanceTests_Compressed_TextIOIT/ws/>
 > git rev-parse --is-inside-work-tree # timeout=10
Fetching changes from the remote Git repository
 > git config remote.origin.url https://github.com/apache/beam.git # timeout=10
Fetching upstream changes from https://github.com/apache/beam.git
 > git --version # timeout=10
 > git fetch --tags --progress https://github.com/apache/beam.git +refs/heads/*:refs/remotes/origin/* +refs/pull/${ghprbPullId}/*:refs/remotes/origin/pr/${ghprbPullId}/*
 > git rev-parse origin/master^{commit} # timeout=10
Checking out Revision 6aa2cf55376481de83a801cd9d79fb775916ee88 (origin/master)
 > git config core.sparsecheckout # timeout=10
 > git checkout -f 6aa2cf55376481de83a801cd9d79fb775916ee88
Commit message: "Merge pull request #6337 from apilloud/metadata"
 > git rev-list --no-walk 6aa2cf55376481de83a801cd9d79fb775916ee88 # timeout=10
Cleaning workspace
 > git rev-parse --verify HEAD # timeout=10
Resetting working tree
 > git reset --hard # timeout=10
 > git clean -fdx # timeout=10
[EnvInject] - Executing scripts and injecting environment variables after the SCM step.
[EnvInject] - Injecting as environment variables the properties content 
SPARK_LOCAL_IP=127.0.0.1

[EnvInject] - Variables injected successfully.
[beam_PerformanceTests_Compressed_TextIOIT] $ /bin/bash -xe /tmp/jenkins1319643050768471651.sh
+ rm -rf <https://builds.apache.org/job/beam_PerformanceTests_Compressed_TextIOIT/ws/PerfKitBenchmarker>
[beam_PerformanceTests_Compressed_TextIOIT] $ /bin/bash -xe /tmp/jenkins8126961503591344569.sh
+ rm -rf <https://builds.apache.org/job/beam_PerformanceTests_Compressed_TextIOIT/ws/env/.beam_env>
[beam_PerformanceTests_Compressed_TextIOIT] $ /bin/bash -xe /tmp/jenkins4976645108163430616.sh
+ rm -rf <https://builds.apache.org/job/beam_PerformanceTests_Compressed_TextIOIT/ws/env/.perfkit_env>
[beam_PerformanceTests_Compressed_TextIOIT] $ /bin/bash -xe /tmp/jenkins5608400598042345675.sh
+ virtualenv <https://builds.apache.org/job/beam_PerformanceTests_Compressed_TextIOIT/ws/env/.beam_env> --system-site-packages
New python executable in <https://builds.apache.org/job/beam_PerformanceTests_Compressed_TextIOIT/ws/env/.beam_env/bin/python2>
Also creating executable in <https://builds.apache.org/job/beam_PerformanceTests_Compressed_TextIOIT/ws/env/.beam_env/bin/python>
Installing setuptools, pkg_resources, pip, wheel...done.
Running virtualenv with interpreter /usr/bin/python2
[beam_PerformanceTests_Compressed_TextIOIT] $ /bin/bash -xe /tmp/jenkins9082688629850824618.sh
+ virtualenv <https://builds.apache.org/job/beam_PerformanceTests_Compressed_TextIOIT/ws/env/.perfkit_env> --system-site-packages
New python executable in <https://builds.apache.org/job/beam_PerformanceTests_Compressed_TextIOIT/ws/env/.perfkit_env/bin/python2>
Also creating executable in <https://builds.apache.org/job/beam_PerformanceTests_Compressed_TextIOIT/ws/env/.perfkit_env/bin/python>
Installing setuptools, pkg_resources, pip, wheel...done.
Running virtualenv with interpreter /usr/bin/python2
[beam_PerformanceTests_Compressed_TextIOIT] $ /bin/bash -xe /tmp/jenkins7844342415454458924.sh
+ <https://builds.apache.org/job/beam_PerformanceTests_Compressed_TextIOIT/ws/env/.beam_env/bin/pip> install --upgrade setuptools pip grpcio-tools==1.3.5
Requirement already up-to-date: setuptools in ./env/.beam_env/lib/python2.7/site-packages (40.2.0)
Requirement already up-to-date: pip in ./env/.beam_env/lib/python2.7/site-packages (18.0)
Collecting grpcio-tools==1.3.5
  Using cached https://files.pythonhosted.org/packages/05/f6/0296e29b1bac6f85d2a8556d48adf825307f73109a3c2c17fb734292db0a/grpcio_tools-1.3.5-cp27-cp27mu-manylinux1_x86_64.whl
Collecting grpcio>=1.3.5 (from grpcio-tools==1.3.5)
  Using cached https://files.pythonhosted.org/packages/bd/a6/4bad0d1a49071363dc6547a5178656fe375c80535128c12bb65c59d1a329/grpcio-1.14.2-cp27-cp27mu-manylinux1_x86_64.whl
Collecting protobuf>=3.2.0 (from grpcio-tools==1.3.5)
  Using cached https://files.pythonhosted.org/packages/b8/c2/b7f587c0aaf8bf2201405e8162323037fe8d17aa21d3c7dda811b8d01469/protobuf-3.6.1-cp27-cp27mu-manylinux1_x86_64.whl
Requirement already satisfied, skipping upgrade: six>=1.5.2 in /usr/local/lib/python2.7/dist-packages (from grpcio>=1.3.5->grpcio-tools==1.3.5) (1.11.0)
Requirement already satisfied, skipping upgrade: enum34>=1.0.4 in /usr/local/lib/python2.7/dist-packages (from grpcio>=1.3.5->grpcio-tools==1.3.5) (1.1.6)
Collecting futures>=2.2.0 (from grpcio>=1.3.5->grpcio-tools==1.3.5)
  Using cached https://files.pythonhosted.org/packages/2d/99/b2c4e9d5a30f6471e410a146232b4118e697fa3ffc06d6a65efde84debd0/futures-3.2.0-py2-none-any.whl
Installing collected packages: futures, grpcio, protobuf, grpcio-tools
Successfully installed futures-3.2.0 grpcio-1.14.2 grpcio-tools-1.3.5 protobuf-3.6.1
[beam_PerformanceTests_Compressed_TextIOIT] $ /bin/bash -xe /tmp/jenkins364407266314220393.sh
+ <https://builds.apache.org/job/beam_PerformanceTests_Compressed_TextIOIT/ws/env/.perfkit_env/bin/pip> install --upgrade setuptools pip
Requirement already up-to-date: setuptools in ./env/.perfkit_env/lib/python2.7/site-packages (40.2.0)
Requirement already up-to-date: pip in ./env/.perfkit_env/lib/python2.7/site-packages (18.0)
[beam_PerformanceTests_Compressed_TextIOIT] $ /bin/bash -xe /tmp/jenkins1201432490571989081.sh
+ git clone https://github.com/GoogleCloudPlatform/PerfKitBenchmarker.git <https://builds.apache.org/job/beam_PerformanceTests_Compressed_TextIOIT/ws/PerfKitBenchmarker>
Cloning into '<https://builds.apache.org/job/beam_PerformanceTests_Compressed_TextIOIT/ws/PerfKitBenchmarker'...>
[beam_PerformanceTests_Compressed_TextIOIT] $ /bin/bash -xe /tmp/jenkins3183933516593480734.sh
+ <https://builds.apache.org/job/beam_PerformanceTests_Compressed_TextIOIT/ws/env/.beam_env/bin/pip> install -e '<https://builds.apache.org/job/beam_PerformanceTests_Compressed_TextIOIT/ws/src/sdks/python/[gcp,test]'>
Obtaining file://<https://builds.apache.org/job/beam_PerformanceTests_Compressed_TextIOIT/ws/src/sdks/python>
    Complete output from command python setup.py egg_info:
    <https://builds.apache.org/job/beam_PerformanceTests_Compressed_TextIOIT/ws/env/.beam_env/local/lib/python2.7/site-packages/setuptools/dist.py>:398: UserWarning: Normalizing '2.8.0.dev' to '2.8.0.dev0'
      normalized_version,
    running egg_info
    Collecting future==0.16.0
    Installing collected packages: future
    Could not install packages due to an EnvironmentError: [Errno 13] Permission denied: '/usr/local/lib/python2.7/dist-packages/_markupbase'
    Consider using the `--user` option or check the permissions.
    
    Traceback (most recent call last):
      File "<string>", line 1, in <module>
      File "<https://builds.apache.org/job/beam_PerformanceTests_Compressed_TextIOIT/ws/src/sdks/python/setup.py",> line 230, in <module>
        'test': generate_protos_first(test),
      File "<https://builds.apache.org/job/beam_PerformanceTests_Compressed_TextIOIT/ws/env/.beam_env/local/lib/python2.7/site-packages/setuptools/__init__.py",> line 140, in setup
        return distutils.core.setup(**attrs)
      File "/usr/lib/python2.7/distutils/core.py", line 151, in setup
        dist.run_commands()
      File "/usr/lib/python2.7/distutils/dist.py", line 953, in run_commands
        self.run_command(cmd)
      File "/usr/lib/python2.7/distutils/dist.py", line 972, in run_command
        cmd_obj.run()
      File "<https://builds.apache.org/job/beam_PerformanceTests_Compressed_TextIOIT/ws/src/sdks/python/setup.py",> line 164, in run
        gen_protos.generate_proto_files()
      File "gen_protos.py", line 119, in generate_proto_files
        'Error installing future during proto generation')
    RuntimeError: Error installing future during proto generation
    
    ----------------------------------------
Command "python setup.py egg_info" failed with error code 1 in <https://builds.apache.org/job/beam_PerformanceTests_Compressed_TextIOIT/ws/src/sdks/python/>
Build step 'Execute shell' marked build as failure

Build failed in Jenkins: beam_PerformanceTests_Compressed_TextIOIT #959

Posted by Apache Jenkins Server <je...@builds.apache.org>.
See <https://builds.apache.org/job/beam_PerformanceTests_Compressed_TextIOIT/959/display/redirect>

------------------------------------------
Started by timer
[EnvInject] - Loading node environment variables.
Building remotely on beam6 (beam) in workspace <https://builds.apache.org/job/beam_PerformanceTests_Compressed_TextIOIT/ws/>
 > git rev-parse --is-inside-work-tree # timeout=10
Fetching changes from the remote Git repository
 > git config remote.origin.url https://github.com/apache/beam.git # timeout=10
Fetching upstream changes from https://github.com/apache/beam.git
 > git --version # timeout=10
 > git fetch --tags --progress https://github.com/apache/beam.git +refs/heads/*:refs/remotes/origin/* +refs/pull/${ghprbPullId}/*:refs/remotes/origin/pr/${ghprbPullId}/*
 > git rev-parse origin/master^{commit} # timeout=10
Checking out Revision 6aa2cf55376481de83a801cd9d79fb775916ee88 (origin/master)
 > git config core.sparsecheckout # timeout=10
 > git checkout -f 6aa2cf55376481de83a801cd9d79fb775916ee88
Commit message: "Merge pull request #6337 from apilloud/metadata"
 > git rev-list --no-walk 6aa2cf55376481de83a801cd9d79fb775916ee88 # timeout=10
Cleaning workspace
 > git rev-parse --verify HEAD # timeout=10
Resetting working tree
 > git reset --hard # timeout=10
 > git clean -fdx # timeout=10
[EnvInject] - Executing scripts and injecting environment variables after the SCM step.
[EnvInject] - Injecting as environment variables the properties content 
SPARK_LOCAL_IP=127.0.0.1

[EnvInject] - Variables injected successfully.
[beam_PerformanceTests_Compressed_TextIOIT] $ /bin/bash -xe /tmp/jenkins431742846724273655.sh
+ rm -rf <https://builds.apache.org/job/beam_PerformanceTests_Compressed_TextIOIT/ws/PerfKitBenchmarker>
[beam_PerformanceTests_Compressed_TextIOIT] $ /bin/bash -xe /tmp/jenkins6808398073979369000.sh
+ rm -rf <https://builds.apache.org/job/beam_PerformanceTests_Compressed_TextIOIT/ws/env/.beam_env>
[beam_PerformanceTests_Compressed_TextIOIT] $ /bin/bash -xe /tmp/jenkins159670733072406503.sh
+ rm -rf <https://builds.apache.org/job/beam_PerformanceTests_Compressed_TextIOIT/ws/env/.perfkit_env>
[beam_PerformanceTests_Compressed_TextIOIT] $ /bin/bash -xe /tmp/jenkins5313357871440848662.sh
+ virtualenv <https://builds.apache.org/job/beam_PerformanceTests_Compressed_TextIOIT/ws/env/.beam_env> --system-site-packages
New python executable in <https://builds.apache.org/job/beam_PerformanceTests_Compressed_TextIOIT/ws/env/.beam_env/bin/python2>
Also creating executable in <https://builds.apache.org/job/beam_PerformanceTests_Compressed_TextIOIT/ws/env/.beam_env/bin/python>
Installing setuptools, pkg_resources, pip, wheel...done.
Running virtualenv with interpreter /usr/bin/python2
[beam_PerformanceTests_Compressed_TextIOIT] $ /bin/bash -xe /tmp/jenkins2944741396652404725.sh
+ virtualenv <https://builds.apache.org/job/beam_PerformanceTests_Compressed_TextIOIT/ws/env/.perfkit_env> --system-site-packages
New python executable in <https://builds.apache.org/job/beam_PerformanceTests_Compressed_TextIOIT/ws/env/.perfkit_env/bin/python2>
Also creating executable in <https://builds.apache.org/job/beam_PerformanceTests_Compressed_TextIOIT/ws/env/.perfkit_env/bin/python>
Installing setuptools, pkg_resources, pip, wheel...done.
Running virtualenv with interpreter /usr/bin/python2
[beam_PerformanceTests_Compressed_TextIOIT] $ /bin/bash -xe /tmp/jenkins8507214194769995816.sh
+ <https://builds.apache.org/job/beam_PerformanceTests_Compressed_TextIOIT/ws/env/.beam_env/bin/pip> install --upgrade setuptools pip grpcio-tools==1.3.5
Requirement already up-to-date: setuptools in ./env/.beam_env/lib/python2.7/site-packages (40.2.0)
Requirement already up-to-date: pip in ./env/.beam_env/lib/python2.7/site-packages (18.0)
Collecting grpcio-tools==1.3.5
  Using cached https://files.pythonhosted.org/packages/05/f6/0296e29b1bac6f85d2a8556d48adf825307f73109a3c2c17fb734292db0a/grpcio_tools-1.3.5-cp27-cp27mu-manylinux1_x86_64.whl
Requirement already satisfied, skipping upgrade: grpcio>=1.3.5 in /home/jenkins/.local/lib/python2.7/site-packages (from grpcio-tools==1.3.5) (1.13.0)
Requirement already satisfied, skipping upgrade: protobuf>=3.2.0 in /home/jenkins/.local/lib/python2.7/site-packages (from grpcio-tools==1.3.5) (3.6.0)
Requirement already satisfied, skipping upgrade: six>=1.5.2 in /usr/local/lib/python2.7/dist-packages (from grpcio>=1.3.5->grpcio-tools==1.3.5) (1.11.0)
Requirement already satisfied, skipping upgrade: enum34>=1.0.4 in /usr/local/lib/python2.7/dist-packages (from grpcio>=1.3.5->grpcio-tools==1.3.5) (1.1.6)
Requirement already satisfied, skipping upgrade: futures>=2.2.0 in /home/jenkins/.local/lib/python2.7/site-packages (from grpcio>=1.3.5->grpcio-tools==1.3.5) (3.2.0)
Installing collected packages: grpcio-tools
Successfully installed grpcio-tools-1.3.5
[beam_PerformanceTests_Compressed_TextIOIT] $ /bin/bash -xe /tmp/jenkins1973489931965534732.sh
+ <https://builds.apache.org/job/beam_PerformanceTests_Compressed_TextIOIT/ws/env/.perfkit_env/bin/pip> install --upgrade setuptools pip
Requirement already up-to-date: setuptools in ./env/.perfkit_env/lib/python2.7/site-packages (40.2.0)
Requirement already up-to-date: pip in ./env/.perfkit_env/lib/python2.7/site-packages (18.0)
[beam_PerformanceTests_Compressed_TextIOIT] $ /bin/bash -xe /tmp/jenkins6094417897054718095.sh
+ git clone https://github.com/GoogleCloudPlatform/PerfKitBenchmarker.git <https://builds.apache.org/job/beam_PerformanceTests_Compressed_TextIOIT/ws/PerfKitBenchmarker>
Cloning into '<https://builds.apache.org/job/beam_PerformanceTests_Compressed_TextIOIT/ws/PerfKitBenchmarker'...>
[beam_PerformanceTests_Compressed_TextIOIT] $ /bin/bash -xe /tmp/jenkins8472531897391402786.sh
+ <https://builds.apache.org/job/beam_PerformanceTests_Compressed_TextIOIT/ws/env/.beam_env/bin/pip> install -e '<https://builds.apache.org/job/beam_PerformanceTests_Compressed_TextIOIT/ws/src/sdks/python/[gcp,test]'>
Obtaining file://<https://builds.apache.org/job/beam_PerformanceTests_Compressed_TextIOIT/ws/src/sdks/python>
    Complete output from command python setup.py egg_info:
    <https://builds.apache.org/job/beam_PerformanceTests_Compressed_TextIOIT/ws/env/.beam_env/local/lib/python2.7/site-packages/setuptools/dist.py>:398: UserWarning: Normalizing '2.8.0.dev' to '2.8.0.dev0'
      normalized_version,
    running egg_info
    Requirement already satisfied: future==0.16.0 in /home/jenkins/.local/lib/python2.7/site-packages (0.16.0)
    gapic-google-cloud-pubsub-v1 0.15.4 has requirement oauth2client<4.0dev,>=2.0.0, but you'll have oauth2client 4.1.2 which is incompatible.
    proto-google-cloud-datastore-v1 0.90.4 has requirement oauth2client<4.0dev,>=2.0.0, but you'll have oauth2client 4.1.2 which is incompatible.
    proto-google-cloud-pubsub-v1 0.15.4 has requirement oauth2client<4.0dev,>=2.0.0, but you'll have oauth2client 4.1.2 which is incompatible.
    googledatastore 7.0.1 has requirement httplib2<0.10,>=0.9.1, but you'll have httplib2 0.11.3 which is incompatible.
    googledatastore 7.0.1 has requirement oauth2client<4.0.0,>=2.0.1, but you'll have oauth2client 4.1.2 which is incompatible.
    You are using pip version 10.0.1, however version 18.0 is available.
    You should consider upgrading via the 'pip install --upgrade pip' command.
    error: [Errno 2] No such file or directory
    
    ----------------------------------------
Command "python setup.py egg_info" failed with error code 1 in <https://builds.apache.org/job/beam_PerformanceTests_Compressed_TextIOIT/ws/src/sdks/python/>
Build step 'Execute shell' marked build as failure

Build failed in Jenkins: beam_PerformanceTests_Compressed_TextIOIT #958

Posted by Apache Jenkins Server <je...@builds.apache.org>.
See <https://builds.apache.org/job/beam_PerformanceTests_Compressed_TextIOIT/958/display/redirect>

------------------------------------------
Started by timer
[EnvInject] - Loading node environment variables.
Building remotely on beam6 (beam) in workspace <https://builds.apache.org/job/beam_PerformanceTests_Compressed_TextIOIT/ws/>
 > git rev-parse --is-inside-work-tree # timeout=10
Fetching changes from the remote Git repository
 > git config remote.origin.url https://github.com/apache/beam.git # timeout=10
Fetching upstream changes from https://github.com/apache/beam.git
 > git --version # timeout=10
 > git fetch --tags --progress https://github.com/apache/beam.git +refs/heads/*:refs/remotes/origin/* +refs/pull/${ghprbPullId}/*:refs/remotes/origin/pr/${ghprbPullId}/*
 > git rev-parse origin/master^{commit} # timeout=10
Checking out Revision 6aa2cf55376481de83a801cd9d79fb775916ee88 (origin/master)
 > git config core.sparsecheckout # timeout=10
 > git checkout -f 6aa2cf55376481de83a801cd9d79fb775916ee88
Commit message: "Merge pull request #6337 from apilloud/metadata"
 > git rev-list --no-walk 6aa2cf55376481de83a801cd9d79fb775916ee88 # timeout=10
Cleaning workspace
 > git rev-parse --verify HEAD # timeout=10
Resetting working tree
 > git reset --hard # timeout=10
 > git clean -fdx # timeout=10
[EnvInject] - Executing scripts and injecting environment variables after the SCM step.
[EnvInject] - Injecting as environment variables the properties content 
SPARK_LOCAL_IP=127.0.0.1

[EnvInject] - Variables injected successfully.
[beam_PerformanceTests_Compressed_TextIOIT] $ /bin/bash -xe /tmp/jenkins6141944476011056595.sh
+ rm -rf <https://builds.apache.org/job/beam_PerformanceTests_Compressed_TextIOIT/ws/PerfKitBenchmarker>
[beam_PerformanceTests_Compressed_TextIOIT] $ /bin/bash -xe /tmp/jenkins3816688939383605092.sh
+ rm -rf <https://builds.apache.org/job/beam_PerformanceTests_Compressed_TextIOIT/ws/env/.beam_env>
[beam_PerformanceTests_Compressed_TextIOIT] $ /bin/bash -xe /tmp/jenkins1876479711364724740.sh
+ rm -rf <https://builds.apache.org/job/beam_PerformanceTests_Compressed_TextIOIT/ws/env/.perfkit_env>
[beam_PerformanceTests_Compressed_TextIOIT] $ /bin/bash -xe /tmp/jenkins7862721904551766160.sh
+ virtualenv <https://builds.apache.org/job/beam_PerformanceTests_Compressed_TextIOIT/ws/env/.beam_env> --system-site-packages
New python executable in <https://builds.apache.org/job/beam_PerformanceTests_Compressed_TextIOIT/ws/env/.beam_env/bin/python2>
Also creating executable in <https://builds.apache.org/job/beam_PerformanceTests_Compressed_TextIOIT/ws/env/.beam_env/bin/python>
Installing setuptools, pkg_resources, pip, wheel...done.
Running virtualenv with interpreter /usr/bin/python2
[beam_PerformanceTests_Compressed_TextIOIT] $ /bin/bash -xe /tmp/jenkins7854460652823358570.sh
+ virtualenv <https://builds.apache.org/job/beam_PerformanceTests_Compressed_TextIOIT/ws/env/.perfkit_env> --system-site-packages
New python executable in <https://builds.apache.org/job/beam_PerformanceTests_Compressed_TextIOIT/ws/env/.perfkit_env/bin/python2>
Also creating executable in <https://builds.apache.org/job/beam_PerformanceTests_Compressed_TextIOIT/ws/env/.perfkit_env/bin/python>
Installing setuptools, pkg_resources, pip, wheel...done.
Running virtualenv with interpreter /usr/bin/python2
[beam_PerformanceTests_Compressed_TextIOIT] $ /bin/bash -xe /tmp/jenkins4538817951680933398.sh
+ <https://builds.apache.org/job/beam_PerformanceTests_Compressed_TextIOIT/ws/env/.beam_env/bin/pip> install --upgrade setuptools pip grpcio-tools==1.3.5
Requirement already up-to-date: setuptools in ./env/.beam_env/lib/python2.7/site-packages (40.2.0)
Requirement already up-to-date: pip in ./env/.beam_env/lib/python2.7/site-packages (18.0)
Collecting grpcio-tools==1.3.5
  Using cached https://files.pythonhosted.org/packages/05/f6/0296e29b1bac6f85d2a8556d48adf825307f73109a3c2c17fb734292db0a/grpcio_tools-1.3.5-cp27-cp27mu-manylinux1_x86_64.whl
Requirement already satisfied, skipping upgrade: grpcio>=1.3.5 in /home/jenkins/.local/lib/python2.7/site-packages (from grpcio-tools==1.3.5) (1.13.0)
Requirement already satisfied, skipping upgrade: protobuf>=3.2.0 in /home/jenkins/.local/lib/python2.7/site-packages (from grpcio-tools==1.3.5) (3.6.0)
Requirement already satisfied, skipping upgrade: six>=1.5.2 in /usr/local/lib/python2.7/dist-packages (from grpcio>=1.3.5->grpcio-tools==1.3.5) (1.11.0)
Requirement already satisfied, skipping upgrade: enum34>=1.0.4 in /usr/local/lib/python2.7/dist-packages (from grpcio>=1.3.5->grpcio-tools==1.3.5) (1.1.6)
Requirement already satisfied, skipping upgrade: futures>=2.2.0 in /home/jenkins/.local/lib/python2.7/site-packages (from grpcio>=1.3.5->grpcio-tools==1.3.5) (3.2.0)
Installing collected packages: grpcio-tools
Successfully installed grpcio-tools-1.3.5
[beam_PerformanceTests_Compressed_TextIOIT] $ /bin/bash -xe /tmp/jenkins777545130917762686.sh
+ <https://builds.apache.org/job/beam_PerformanceTests_Compressed_TextIOIT/ws/env/.perfkit_env/bin/pip> install --upgrade setuptools pip
Requirement already up-to-date: setuptools in ./env/.perfkit_env/lib/python2.7/site-packages (40.2.0)
Requirement already up-to-date: pip in ./env/.perfkit_env/lib/python2.7/site-packages (18.0)
[beam_PerformanceTests_Compressed_TextIOIT] $ /bin/bash -xe /tmp/jenkins6028280985957463935.sh
+ git clone https://github.com/GoogleCloudPlatform/PerfKitBenchmarker.git <https://builds.apache.org/job/beam_PerformanceTests_Compressed_TextIOIT/ws/PerfKitBenchmarker>
Cloning into '<https://builds.apache.org/job/beam_PerformanceTests_Compressed_TextIOIT/ws/PerfKitBenchmarker'...>
[beam_PerformanceTests_Compressed_TextIOIT] $ /bin/bash -xe /tmp/jenkins7116026057527762358.sh
+ <https://builds.apache.org/job/beam_PerformanceTests_Compressed_TextIOIT/ws/env/.beam_env/bin/pip> install -e '<https://builds.apache.org/job/beam_PerformanceTests_Compressed_TextIOIT/ws/src/sdks/python/[gcp,test]'>
Obtaining file://<https://builds.apache.org/job/beam_PerformanceTests_Compressed_TextIOIT/ws/src/sdks/python>
    Complete output from command python setup.py egg_info:
    <https://builds.apache.org/job/beam_PerformanceTests_Compressed_TextIOIT/ws/env/.beam_env/local/lib/python2.7/site-packages/setuptools/dist.py>:398: UserWarning: Normalizing '2.8.0.dev' to '2.8.0.dev0'
      normalized_version,
    running egg_info
    Requirement already satisfied: future==0.16.0 in /home/jenkins/.local/lib/python2.7/site-packages (0.16.0)
    gapic-google-cloud-pubsub-v1 0.15.4 has requirement oauth2client<4.0dev,>=2.0.0, but you'll have oauth2client 4.1.2 which is incompatible.
    proto-google-cloud-datastore-v1 0.90.4 has requirement oauth2client<4.0dev,>=2.0.0, but you'll have oauth2client 4.1.2 which is incompatible.
    proto-google-cloud-pubsub-v1 0.15.4 has requirement oauth2client<4.0dev,>=2.0.0, but you'll have oauth2client 4.1.2 which is incompatible.
    googledatastore 7.0.1 has requirement httplib2<0.10,>=0.9.1, but you'll have httplib2 0.11.3 which is incompatible.
    googledatastore 7.0.1 has requirement oauth2client<4.0.0,>=2.0.1, but you'll have oauth2client 4.1.2 which is incompatible.
    You are using pip version 10.0.1, however version 18.0 is available.
    You should consider upgrading via the 'pip install --upgrade pip' command.
    error: [Errno 2] No such file or directory
    
    ----------------------------------------
Command "python setup.py egg_info" failed with error code 1 in <https://builds.apache.org/job/beam_PerformanceTests_Compressed_TextIOIT/ws/src/sdks/python/>
Build step 'Execute shell' marked build as failure

Build failed in Jenkins: beam_PerformanceTests_Compressed_TextIOIT #957

Posted by Apache Jenkins Server <je...@builds.apache.org>.
See <https://builds.apache.org/job/beam_PerformanceTests_Compressed_TextIOIT/957/display/redirect>

------------------------------------------
Started by timer
[EnvInject] - Loading node environment variables.
Building remotely on beam6 (beam) in workspace <https://builds.apache.org/job/beam_PerformanceTests_Compressed_TextIOIT/ws/>
 > git rev-parse --is-inside-work-tree # timeout=10
Fetching changes from the remote Git repository
 > git config remote.origin.url https://github.com/apache/beam.git # timeout=10
Fetching upstream changes from https://github.com/apache/beam.git
 > git --version # timeout=10
 > git fetch --tags --progress https://github.com/apache/beam.git +refs/heads/*:refs/remotes/origin/* +refs/pull/${ghprbPullId}/*:refs/remotes/origin/pr/${ghprbPullId}/*
 > git rev-parse origin/master^{commit} # timeout=10
Checking out Revision 6aa2cf55376481de83a801cd9d79fb775916ee88 (origin/master)
 > git config core.sparsecheckout # timeout=10
 > git checkout -f 6aa2cf55376481de83a801cd9d79fb775916ee88
Commit message: "Merge pull request #6337 from apilloud/metadata"
 > git rev-list --no-walk 6aa2cf55376481de83a801cd9d79fb775916ee88 # timeout=10
Cleaning workspace
 > git rev-parse --verify HEAD # timeout=10
Resetting working tree
 > git reset --hard # timeout=10
 > git clean -fdx # timeout=10
[EnvInject] - Executing scripts and injecting environment variables after the SCM step.
[EnvInject] - Injecting as environment variables the properties content 
SPARK_LOCAL_IP=127.0.0.1

[EnvInject] - Variables injected successfully.
[beam_PerformanceTests_Compressed_TextIOIT] $ /bin/bash -xe /tmp/jenkins8670208272995012416.sh
+ rm -rf <https://builds.apache.org/job/beam_PerformanceTests_Compressed_TextIOIT/ws/PerfKitBenchmarker>
[beam_PerformanceTests_Compressed_TextIOIT] $ /bin/bash -xe /tmp/jenkins7008619662634649310.sh
+ rm -rf <https://builds.apache.org/job/beam_PerformanceTests_Compressed_TextIOIT/ws/env/.beam_env>
[beam_PerformanceTests_Compressed_TextIOIT] $ /bin/bash -xe /tmp/jenkins9128816608708500396.sh
+ rm -rf <https://builds.apache.org/job/beam_PerformanceTests_Compressed_TextIOIT/ws/env/.perfkit_env>
[beam_PerformanceTests_Compressed_TextIOIT] $ /bin/bash -xe /tmp/jenkins513976943655832579.sh
+ virtualenv <https://builds.apache.org/job/beam_PerformanceTests_Compressed_TextIOIT/ws/env/.beam_env> --system-site-packages
New python executable in <https://builds.apache.org/job/beam_PerformanceTests_Compressed_TextIOIT/ws/env/.beam_env/bin/python2>
Also creating executable in <https://builds.apache.org/job/beam_PerformanceTests_Compressed_TextIOIT/ws/env/.beam_env/bin/python>
Installing setuptools, pkg_resources, pip, wheel...done.
Running virtualenv with interpreter /usr/bin/python2
[beam_PerformanceTests_Compressed_TextIOIT] $ /bin/bash -xe /tmp/jenkins6716338979872175102.sh
+ virtualenv <https://builds.apache.org/job/beam_PerformanceTests_Compressed_TextIOIT/ws/env/.perfkit_env> --system-site-packages
New python executable in <https://builds.apache.org/job/beam_PerformanceTests_Compressed_TextIOIT/ws/env/.perfkit_env/bin/python2>
Also creating executable in <https://builds.apache.org/job/beam_PerformanceTests_Compressed_TextIOIT/ws/env/.perfkit_env/bin/python>
Installing setuptools, pkg_resources, pip, wheel...done.
Running virtualenv with interpreter /usr/bin/python2
[beam_PerformanceTests_Compressed_TextIOIT] $ /bin/bash -xe /tmp/jenkins1843184861292471241.sh
+ <https://builds.apache.org/job/beam_PerformanceTests_Compressed_TextIOIT/ws/env/.beam_env/bin/pip> install --upgrade setuptools pip grpcio-tools==1.3.5
Requirement already up-to-date: setuptools in ./env/.beam_env/lib/python2.7/site-packages (40.2.0)
Requirement already up-to-date: pip in ./env/.beam_env/lib/python2.7/site-packages (18.0)
Collecting grpcio-tools==1.3.5
  Using cached https://files.pythonhosted.org/packages/05/f6/0296e29b1bac6f85d2a8556d48adf825307f73109a3c2c17fb734292db0a/grpcio_tools-1.3.5-cp27-cp27mu-manylinux1_x86_64.whl
Requirement already satisfied, skipping upgrade: grpcio>=1.3.5 in /home/jenkins/.local/lib/python2.7/site-packages (from grpcio-tools==1.3.5) (1.13.0)
Requirement already satisfied, skipping upgrade: protobuf>=3.2.0 in /home/jenkins/.local/lib/python2.7/site-packages (from grpcio-tools==1.3.5) (3.6.0)
Requirement already satisfied, skipping upgrade: six>=1.5.2 in /usr/local/lib/python2.7/dist-packages (from grpcio>=1.3.5->grpcio-tools==1.3.5) (1.11.0)
Requirement already satisfied, skipping upgrade: enum34>=1.0.4 in /usr/local/lib/python2.7/dist-packages (from grpcio>=1.3.5->grpcio-tools==1.3.5) (1.1.6)
Requirement already satisfied, skipping upgrade: futures>=2.2.0 in /home/jenkins/.local/lib/python2.7/site-packages (from grpcio>=1.3.5->grpcio-tools==1.3.5) (3.2.0)
Installing collected packages: grpcio-tools
Successfully installed grpcio-tools-1.3.5
[beam_PerformanceTests_Compressed_TextIOIT] $ /bin/bash -xe /tmp/jenkins7796271673354245464.sh
+ <https://builds.apache.org/job/beam_PerformanceTests_Compressed_TextIOIT/ws/env/.perfkit_env/bin/pip> install --upgrade setuptools pip
Requirement already up-to-date: setuptools in ./env/.perfkit_env/lib/python2.7/site-packages (40.2.0)
Requirement already up-to-date: pip in ./env/.perfkit_env/lib/python2.7/site-packages (18.0)
[beam_PerformanceTests_Compressed_TextIOIT] $ /bin/bash -xe /tmp/jenkins6213129242348876616.sh
+ git clone https://github.com/GoogleCloudPlatform/PerfKitBenchmarker.git <https://builds.apache.org/job/beam_PerformanceTests_Compressed_TextIOIT/ws/PerfKitBenchmarker>
Cloning into '<https://builds.apache.org/job/beam_PerformanceTests_Compressed_TextIOIT/ws/PerfKitBenchmarker'...>
[beam_PerformanceTests_Compressed_TextIOIT] $ /bin/bash -xe /tmp/jenkins9118346083974576592.sh
+ <https://builds.apache.org/job/beam_PerformanceTests_Compressed_TextIOIT/ws/env/.beam_env/bin/pip> install -e '<https://builds.apache.org/job/beam_PerformanceTests_Compressed_TextIOIT/ws/src/sdks/python/[gcp,test]'>
Obtaining file://<https://builds.apache.org/job/beam_PerformanceTests_Compressed_TextIOIT/ws/src/sdks/python>
    Complete output from command python setup.py egg_info:
    <https://builds.apache.org/job/beam_PerformanceTests_Compressed_TextIOIT/ws/env/.beam_env/local/lib/python2.7/site-packages/setuptools/dist.py>:398: UserWarning: Normalizing '2.8.0.dev' to '2.8.0.dev0'
      normalized_version,
    running egg_info
    Requirement already satisfied: future==0.16.0 in /home/jenkins/.local/lib/python2.7/site-packages (0.16.0)
    gapic-google-cloud-pubsub-v1 0.15.4 has requirement oauth2client<4.0dev,>=2.0.0, but you'll have oauth2client 4.1.2 which is incompatible.
    proto-google-cloud-datastore-v1 0.90.4 has requirement oauth2client<4.0dev,>=2.0.0, but you'll have oauth2client 4.1.2 which is incompatible.
    proto-google-cloud-pubsub-v1 0.15.4 has requirement oauth2client<4.0dev,>=2.0.0, but you'll have oauth2client 4.1.2 which is incompatible.
    googledatastore 7.0.1 has requirement httplib2<0.10,>=0.9.1, but you'll have httplib2 0.11.3 which is incompatible.
    googledatastore 7.0.1 has requirement oauth2client<4.0.0,>=2.0.1, but you'll have oauth2client 4.1.2 which is incompatible.
    You are using pip version 10.0.1, however version 18.0 is available.
    You should consider upgrading via the 'pip install --upgrade pip' command.
    error: [Errno 2] No such file or directory
    
    ----------------------------------------
Command "python setup.py egg_info" failed with error code 1 in <https://builds.apache.org/job/beam_PerformanceTests_Compressed_TextIOIT/ws/src/sdks/python/>
Build step 'Execute shell' marked build as failure

Build failed in Jenkins: beam_PerformanceTests_Compressed_TextIOIT #956

Posted by Apache Jenkins Server <je...@builds.apache.org>.
See <https://builds.apache.org/job/beam_PerformanceTests_Compressed_TextIOIT/956/display/redirect>

------------------------------------------
Started by timer
[EnvInject] - Loading node environment variables.
Building remotely on beam5 (beam) in workspace <https://builds.apache.org/job/beam_PerformanceTests_Compressed_TextIOIT/ws/>
 > git rev-parse --is-inside-work-tree # timeout=10
Fetching changes from the remote Git repository
 > git config remote.origin.url https://github.com/apache/beam.git # timeout=10
Fetching upstream changes from https://github.com/apache/beam.git
 > git --version # timeout=10
 > git fetch --tags --progress https://github.com/apache/beam.git +refs/heads/*:refs/remotes/origin/* +refs/pull/${ghprbPullId}/*:refs/remotes/origin/pr/${ghprbPullId}/*
 > git rev-parse origin/master^{commit} # timeout=10
Checking out Revision 6aa2cf55376481de83a801cd9d79fb775916ee88 (origin/master)
 > git config core.sparsecheckout # timeout=10
 > git checkout -f 6aa2cf55376481de83a801cd9d79fb775916ee88
Commit message: "Merge pull request #6337 from apilloud/metadata"
 > git rev-list --no-walk 6aa2cf55376481de83a801cd9d79fb775916ee88 # timeout=10
Cleaning workspace
 > git rev-parse --verify HEAD # timeout=10
Resetting working tree
 > git reset --hard # timeout=10
 > git clean -fdx # timeout=10
[EnvInject] - Executing scripts and injecting environment variables after the SCM step.
[EnvInject] - Injecting as environment variables the properties content 
SPARK_LOCAL_IP=127.0.0.1

[EnvInject] - Variables injected successfully.
[beam_PerformanceTests_Compressed_TextIOIT] $ /bin/bash -xe /tmp/jenkins5814196785788869277.sh
+ rm -rf <https://builds.apache.org/job/beam_PerformanceTests_Compressed_TextIOIT/ws/PerfKitBenchmarker>
[beam_PerformanceTests_Compressed_TextIOIT] $ /bin/bash -xe /tmp/jenkins131605700206424627.sh
+ rm -rf <https://builds.apache.org/job/beam_PerformanceTests_Compressed_TextIOIT/ws/env/.beam_env>
[beam_PerformanceTests_Compressed_TextIOIT] $ /bin/bash -xe /tmp/jenkins5505792508908102475.sh
+ rm -rf <https://builds.apache.org/job/beam_PerformanceTests_Compressed_TextIOIT/ws/env/.perfkit_env>
[beam_PerformanceTests_Compressed_TextIOIT] $ /bin/bash -xe /tmp/jenkins6774237357007741673.sh
+ virtualenv <https://builds.apache.org/job/beam_PerformanceTests_Compressed_TextIOIT/ws/env/.beam_env> --system-site-packages
New python executable in <https://builds.apache.org/job/beam_PerformanceTests_Compressed_TextIOIT/ws/env/.beam_env/bin/python2>
Also creating executable in <https://builds.apache.org/job/beam_PerformanceTests_Compressed_TextIOIT/ws/env/.beam_env/bin/python>
Installing setuptools, pkg_resources, pip, wheel...done.
Running virtualenv with interpreter /usr/bin/python2
[beam_PerformanceTests_Compressed_TextIOIT] $ /bin/bash -xe /tmp/jenkins8814959421326241025.sh
+ virtualenv <https://builds.apache.org/job/beam_PerformanceTests_Compressed_TextIOIT/ws/env/.perfkit_env> --system-site-packages
New python executable in <https://builds.apache.org/job/beam_PerformanceTests_Compressed_TextIOIT/ws/env/.perfkit_env/bin/python2>
Also creating executable in <https://builds.apache.org/job/beam_PerformanceTests_Compressed_TextIOIT/ws/env/.perfkit_env/bin/python>
Installing setuptools, pkg_resources, pip, wheel...done.
Running virtualenv with interpreter /usr/bin/python2
[beam_PerformanceTests_Compressed_TextIOIT] $ /bin/bash -xe /tmp/jenkins7420957110103810395.sh
+ <https://builds.apache.org/job/beam_PerformanceTests_Compressed_TextIOIT/ws/env/.beam_env/bin/pip> install --upgrade setuptools pip grpcio-tools==1.3.5
Requirement already up-to-date: setuptools in ./env/.beam_env/lib/python2.7/site-packages (40.2.0)
Requirement already up-to-date: pip in ./env/.beam_env/lib/python2.7/site-packages (18.0)
Collecting grpcio-tools==1.3.5
  Using cached https://files.pythonhosted.org/packages/05/f6/0296e29b1bac6f85d2a8556d48adf825307f73109a3c2c17fb734292db0a/grpcio_tools-1.3.5-cp27-cp27mu-manylinux1_x86_64.whl
Collecting grpcio>=1.3.5 (from grpcio-tools==1.3.5)
  Using cached https://files.pythonhosted.org/packages/bd/a6/4bad0d1a49071363dc6547a5178656fe375c80535128c12bb65c59d1a329/grpcio-1.14.2-cp27-cp27mu-manylinux1_x86_64.whl
Collecting protobuf>=3.2.0 (from grpcio-tools==1.3.5)
  Using cached https://files.pythonhosted.org/packages/b8/c2/b7f587c0aaf8bf2201405e8162323037fe8d17aa21d3c7dda811b8d01469/protobuf-3.6.1-cp27-cp27mu-manylinux1_x86_64.whl
Requirement already satisfied, skipping upgrade: six>=1.5.2 in /usr/local/lib/python2.7/dist-packages (from grpcio>=1.3.5->grpcio-tools==1.3.5) (1.11.0)
Requirement already satisfied, skipping upgrade: enum34>=1.0.4 in /usr/local/lib/python2.7/dist-packages (from grpcio>=1.3.5->grpcio-tools==1.3.5) (1.1.6)
Collecting futures>=2.2.0 (from grpcio>=1.3.5->grpcio-tools==1.3.5)
  Using cached https://files.pythonhosted.org/packages/2d/99/b2c4e9d5a30f6471e410a146232b4118e697fa3ffc06d6a65efde84debd0/futures-3.2.0-py2-none-any.whl
Installing collected packages: futures, grpcio, protobuf, grpcio-tools
Successfully installed futures-3.2.0 grpcio-1.14.2 grpcio-tools-1.3.5 protobuf-3.6.1
[beam_PerformanceTests_Compressed_TextIOIT] $ /bin/bash -xe /tmp/jenkins7958866480956944912.sh
+ <https://builds.apache.org/job/beam_PerformanceTests_Compressed_TextIOIT/ws/env/.perfkit_env/bin/pip> install --upgrade setuptools pip
Requirement already up-to-date: setuptools in ./env/.perfkit_env/lib/python2.7/site-packages (40.2.0)
Requirement already up-to-date: pip in ./env/.perfkit_env/lib/python2.7/site-packages (18.0)
[beam_PerformanceTests_Compressed_TextIOIT] $ /bin/bash -xe /tmp/jenkins6741202314012418502.sh
+ git clone https://github.com/GoogleCloudPlatform/PerfKitBenchmarker.git <https://builds.apache.org/job/beam_PerformanceTests_Compressed_TextIOIT/ws/PerfKitBenchmarker>
Cloning into '<https://builds.apache.org/job/beam_PerformanceTests_Compressed_TextIOIT/ws/PerfKitBenchmarker'...>
[beam_PerformanceTests_Compressed_TextIOIT] $ /bin/bash -xe /tmp/jenkins8852286071296828725.sh
+ <https://builds.apache.org/job/beam_PerformanceTests_Compressed_TextIOIT/ws/env/.beam_env/bin/pip> install -e '<https://builds.apache.org/job/beam_PerformanceTests_Compressed_TextIOIT/ws/src/sdks/python/[gcp,test]'>
Obtaining file://<https://builds.apache.org/job/beam_PerformanceTests_Compressed_TextIOIT/ws/src/sdks/python>
    Complete output from command python setup.py egg_info:
    <https://builds.apache.org/job/beam_PerformanceTests_Compressed_TextIOIT/ws/env/.beam_env/local/lib/python2.7/site-packages/setuptools/dist.py>:398: UserWarning: Normalizing '2.8.0.dev' to '2.8.0.dev0'
      normalized_version,
    running egg_info
    Collecting future==0.16.0
    Installing collected packages: future
    Could not install packages due to an EnvironmentError: [Errno 13] Permission denied: '/usr/local/lib/python2.7/dist-packages/_markupbase'
    Consider using the `--user` option or check the permissions.
    
    Traceback (most recent call last):
      File "<string>", line 1, in <module>
      File "<https://builds.apache.org/job/beam_PerformanceTests_Compressed_TextIOIT/ws/src/sdks/python/setup.py",> line 230, in <module>
        'test': generate_protos_first(test),
      File "<https://builds.apache.org/job/beam_PerformanceTests_Compressed_TextIOIT/ws/env/.beam_env/local/lib/python2.7/site-packages/setuptools/__init__.py",> line 140, in setup
        return distutils.core.setup(**attrs)
      File "/usr/lib/python2.7/distutils/core.py", line 151, in setup
        dist.run_commands()
      File "/usr/lib/python2.7/distutils/dist.py", line 953, in run_commands
        self.run_command(cmd)
      File "/usr/lib/python2.7/distutils/dist.py", line 972, in run_command
        cmd_obj.run()
      File "<https://builds.apache.org/job/beam_PerformanceTests_Compressed_TextIOIT/ws/src/sdks/python/setup.py",> line 164, in run
        gen_protos.generate_proto_files()
      File "gen_protos.py", line 119, in generate_proto_files
        'Error installing future during proto generation')
    RuntimeError: Error installing future during proto generation
    
    ----------------------------------------
Command "python setup.py egg_info" failed with error code 1 in <https://builds.apache.org/job/beam_PerformanceTests_Compressed_TextIOIT/ws/src/sdks/python/>
Build step 'Execute shell' marked build as failure