You are viewing a plain text version of this content. The canonical link for it is here.
Posted to builds@cassandra.apache.org by Apache Jenkins Server <je...@builds.apache.org> on 2022/04/27 17:05:11 UTC

Build complete: Cassandra-3.0 #265 [UNSTABLE] fb66800a00aeaa8046cb3e6b1401fdc4f81848d5

-------------------------------------------------------------------------------
Build Cassandra-3.0 #265 Still Unstable
URL: https://ci-cassandra.apache.org/job/Cassandra-3.0/265/
-------------------------------------------------------------------------------
Changes:
No changes

-------------------------------------------------------------------------------
Failed Tests:
8 tests failed.
FAILED:  dtest-upgrade.upgrade_tests.upgrade_through_versions_test.TestProtoV3Upgrade_AllVersions_RandomPartitioner_EndsAt_3_11_X_HEAD.test_rolling_upgrade
FAILED:  dtest-upgrade.upgrade_tests.upgrade_through_versions_test.TestUpgrade_current_2_1_x_To_indev_3_0_x.test_bootstrap_multidc
FAILED:  dtest-upgrade.upgrade_tests.upgrade_through_versions_test.TestUpgrade_current_2_1_x_To_indev_3_0_x.test_bootstrap_multidc
FAILED:  dtest-upgrade.upgrade_tests.upgrade_through_versions_test.TestUpgrade_current_2_1_x_To_indev_3_0_x.test_bootstrap_multidc
FAILED:  org.apache.cassandra.db.ScrubTest.testScrubCorruptedCounterRow
FAILED:  org.apache.cassandra.service.RemoveTest.testRemoveHostId-compression
FAILED:  dtest-upgrade.upgrade_internal_auth_test.TestAuthUpgrade.test_upgrade_legacy_table
FAILED:  dtest-upgrade.upgrade_internal_auth_test.TestAuthUpgrade.test_upgrade_to_30

-------------------------------------------------------------------------------
For complete test report and logs see https://nightlies.apache.org/cassandra/Cassandra-3.0/265/