You are viewing a plain text version of this content. The canonical link for it is here.
Posted to dev@poi.apache.org by Apache Jenkins Server <je...@builds.apache.org> on 2023/09/24 11:52:41 UTC
Build failed in Jenkins: POI » POI-XMLBeans-DSL-1.22 #3
See <https://ci-builds.apache.org/job/POI/job/POI-XMLBeans-DSL-1.22/3/display/redirect?page=changes>
Changes:
[PJ Fanning] update release guide
[PJ Fanning] update release guide
------------------------------------------
Started by an SCM change
Running as SYSTEM
ERROR: Not all environment variables could be successfully injected. Check for similarly-named environment variables.
[EnvInject] - Loading node environment variables.
[EnvInject] - Preparing an environment for the build.
[EnvInject] - Keeping Jenkins system variables.
[EnvInject] - Keeping Jenkins build variables.
[EnvInject] - Injecting as environment variables the properties content
FORREST_HOME=/home/jenkins/tools/forrest/latest
LANG=en_US.UTF-8
[EnvInject] - Variables injected successfully.
[EnvInject] - Injecting contributions.
Building remotely on builds29 (ubuntu) in workspace <https://ci-builds.apache.org/job/POI/job/POI-XMLBeans-DSL-1.22/ws/>
ERROR: Not all environment variables could be successfully injected. Check for similarly-named environment variables.
Updating https://svn.apache.org/repos/asf/xmlbeans/trunk at revision '2023-09-24T11:52:08.056 +0000'
U release-guide.txt
At revision 1912520
ERROR: Not all environment variables could be successfully injected. Check for similarly-named environment variables.
[POI-XMLBeans-DSL-1.22] $ /bin/sh -xe /tmp/jenkins17178655919383940662.sh
+ rm -rf examples excelant integrationtest main ooxml ooxml-schema scratchpad build.javacheck.xml
+ svn status
+ svn revert poi*/src/*/java9/module-info.*
svn: E155010: The node '<https://ci-builds.apache.org/job/POI/job/POI-XMLBeans-DSL-1.22/ws/poi*/src/*'> was not found.
+ true
+ svn revert src/resources/ooxml-lite-report.*
Skipped 'src/resources/ooxml-lite-report.*'
+ echo Java-Home: /home/jenkins/tools/java/latest22
Java-Home: /home/jenkins/tools/java/latest22
+ ls -al /home/jenkins/tools/java/latest22/
total 36
drwxr-xr-x 8 root root 4096 Jun 14 06:03 .
drwxr-xr-x 35 root root 4096 Jul 19 19:13 ..
drwxr-xr-x 2 root root 4096 Jun 14 06:03 bin
drwxr-xr-x 5 root root 4096 Jun 14 06:03 conf
drwxr-xr-x 3 root root 4096 Jun 14 06:03 include
drwxr-xr-x 2 root root 4096 Jun 14 06:03 jmods
drwxr-xr-x 71 root root 4096 Jun 14 06:03 legal
drwxr-xr-x 5 root root 4096 Jun 14 06:03 lib
-rw-r--r-- 1 root root 1216 Jun 8 22:33 release
+ ls -al /home/jenkins/tools/java/latest22/bin
total 472
drwxr-xr-x 2 root root 4096 Jun 14 06:03 .
drwxr-xr-x 8 root root 4096 Jun 14 06:03 ..
-rwxr-xr-x 1 root root 12384 Jun 8 22:33 jar
-rwxr-xr-x 1 root root 12392 Jun 8 22:33 jarsigner
-rwxr-xr-x 1 root root 12328 Jun 8 22:33 java
-rwxr-xr-x 1 root root 12416 Jun 8 22:33 javac
-rwxr-xr-x 1 root root 12424 Jun 8 22:33 javadoc
-rwxr-xr-x 1 root root 12384 Jun 8 22:33 javap
-rwxr-xr-x 1 root root 12384 Jun 8 22:33 jcmd
-rwxr-xr-x 1 root root 12456 Jun 8 22:33 jconsole
-rwxr-xr-x 1 root root 12384 Jun 8 22:33 jdb
-rwxr-xr-x 1 root root 12392 Jun 8 22:33 jdeprscan
-rwxr-xr-x 1 root root 12384 Jun 8 22:33 jdeps
-rwxr-xr-x 1 root root 12384 Jun 8 22:33 jfr
-rwxr-xr-x 1 root root 12384 Jun 8 22:33 jhsdb
-rwxr-xr-x 1 root root 12392 Jun 8 22:33 jimage
-rwxr-xr-x 1 root root 12416 Jun 8 22:33 jinfo
-rwxr-xr-x 1 root root 12416 Jun 8 22:33 jlink
-rwxr-xr-x 1 root root 12416 Jun 8 22:33 jmap
-rwxr-xr-x 1 root root 12384 Jun 8 22:33 jmod
-rwxr-xr-x 1 root root 12392 Jun 8 22:33 jpackage
-rwxr-xr-x 1 root root 12384 Jun 8 22:33 jps
-rwxr-xr-x 1 root root 12424 Jun 8 22:33 jrunscript
-rwxr-xr-x 1 root root 12392 Jun 8 22:33 jshell
-rwxr-xr-x 1 root root 12424 Jun 8 22:33 jstack
-rwxr-xr-x 1 root root 12384 Jun 8 22:33 jstat
-rwxr-xr-x 1 root root 12392 Jun 8 22:33 jstatd
-rwxr-xr-x 1 root root 12392 Jun 8 22:33 jwebserver
-rwxr-xr-x 1 root root 12392 Jun 8 22:33 keytool
-rwxr-xr-x 1 root root 12416 Jun 8 22:33 rmiregistry
-rwxr-xr-x 1 root root 12392 Jun 8 22:33 serialver
+ /home/jenkins/tools/java/latest22/bin/java -version
openjdk version "22-ea" 2024-03-19
OpenJDK Runtime Environment (build 22-ea+1-7)
OpenJDK 64-Bit Server VM (build 22-ea+1-7, mixed mode, sharing)
+ echo which java
which java
+ which java
/home/jenkins/tools/java/latest22/bin/java
+ java -version
openjdk version "22-ea" 2024-03-19
OpenJDK Runtime Environment (build 22-ea+1-7)
OpenJDK 64-Bit Server VM (build 22-ea+1-7, mixed mode, sharing)
+ echo which javac
which javac
+ which javac
/home/jenkins/tools/java/latest22/bin/javac
+ javac -version
javac 22-ea
+ echo Ant-Home:
Ant-Home:
+ ls -al
total 416
drwxr-xr-x 11 jenkins jenkins 4096 Sep 24 11:52 .
drwxr-xr-x 5 jenkins jenkins 4096 Sep 11 18:05 ..
-rw-r--r-- 1 jenkins jenkins 29182 Aug 20 11:52 build.gradle
-rw-r--r-- 1 jenkins jenkins 54100 Aug 13 11:52 build.xml
-rw-r--r-- 1 jenkins jenkins 11963 Aug 13 11:52 CHANGES.txt
drwxr-xr-x 3 jenkins jenkins 4096 Aug 13 11:52 .github
-rw-r--r-- 1 jenkins jenkins 14 Aug 13 11:52 .gitignore
drwxr-xr-x 3 jenkins jenkins 4096 Aug 13 11:52 gradle
drwxr-xr-x 6 jenkins jenkins 4096 Aug 20 11:52 .gradle
-rw-r--r-- 1 jenkins jenkins 1338 Aug 13 11:52 gradle.properties
-rwxr-xr-x 1 jenkins jenkins 9123 Aug 20 11:52 gradlew
-rw-r--r-- 1 jenkins jenkins 176157 Aug 13 11:52 KEYS
drwxr-xr-x 2 jenkins jenkins 4096 Aug 13 11:52 legal
-rwxr-xr-x 1 jenkins jenkins 12456 Aug 13 11:52 LICENSE-binary.txt
-rwxr-xr-x 1 jenkins jenkins 11884 Aug 13 11:52 LICENSE.txt
-rw-r--r-- 1 jenkins jenkins 2561 Aug 13 11:52 NOTICE-binary.txt
-rw-r--r-- 1 jenkins jenkins 1592 Aug 13 11:52 NOTICE.txt
-rw-r--r-- 1 jenkins jenkins 2227 Aug 13 11:52 README.txt
-rw-r--r-- 1 jenkins jenkins 10995 Sep 24 11:52 release-guide.txt
drwxr-xr-x 16 jenkins jenkins 4096 Aug 13 11:52 samples
-rw-r--r-- 1 jenkins jenkins 238 Aug 13 11:52 SECURITY.md
-rw-r--r-- 1 jenkins jenkins 661 Aug 13 11:52 settings.gradle
drwxr-xr-x 4 jenkins jenkins 4096 Aug 13 11:52 src
-rw-r--r-- 1 jenkins jenkins 369 Aug 13 11:52 STATUS
drwxr-xr-x 4 jenkins jenkins 4096 Sep 24 11:52 .svn
drwxr-xr-x 5 jenkins jenkins 4096 Aug 13 11:52 test
-rw-r--r-- 1 jenkins jenkins 3803 Aug 13 11:52 wrapper.gradle
-rw-r--r-- 1 jenkins jenkins 25 Aug 13 11:52 xbeanenv.cmd
-rwxr-xr-x 1 jenkins jenkins 27 Aug 13 11:52 xbeanenv.sh
drwxr-xr-x 2 jenkins jenkins 4096 Aug 13 11:52 xkit
+ echo which ant
which ant
+ which ant
/usr/bin/ant
+ ant -version
Apache Ant(TM) version 1.10.5 compiled on March 28 2019
+ echo <project default="test"><target name="test"><echo>Java ${ant.java.version}/${java.version}</echo><exec executable="javac"><arg value="-version"/></exec></target></project>
+ ant -f build.javacheck.xml -v
Apache Ant(TM) version 1.10.5 compiled on March 28 2019
Buildfile: <https://ci-builds.apache.org/job/POI/job/POI-XMLBeans-DSL-1.22/ws/build.javacheck.xml>
Detected Java version: 22 in: /usr/local/asfpackages/java/openjdk-22-ea+1
Detected OS: Linux
parsing buildfile <https://ci-builds.apache.org/job/POI/job/POI-XMLBeans-DSL-1.22/ws/build.javacheck.xml> with URI = <https://ci-builds.apache.org/job/POI/job/POI-XMLBeans-DSL-1.22/ws/build.javacheck.xml>
Project base dir set to: <https://ci-builds.apache.org/job/POI/job/POI-XMLBeans-DSL-1.22/ws/>
Build sequence for target(s) `test' is [test]
Complete build sequence is [test, ]
test:
parsing buildfile jar:file:/usr/share/ant/lib/ant.jar!/org/apache/tools/ant/antlib.xml with URI = jar:file:/usr/share/ant/lib/ant.jar!/org/apache/tools/ant/antlib.xml from a zip file
[echo] Java 22/22-ea
[exec] Current OS is Linux
[exec] Executing 'javac' with arguments:
[exec] '-version'
[exec]
[exec] The ' characters around the executable and arguments are
[exec] not part of the command.
[exec] javac 22-ea
BUILD SUCCESSFUL
Total time: 1 second
+ exit 0
[Gradle] - Launching build.
ERROR: Not all environment variables could be successfully injected. Check for similarly-named environment variables.
[POI-XMLBeans-DSL-1.22] $ <https://ci-builds.apache.org/job/POI/job/POI-XMLBeans-DSL-1.22/ws/gradlew> clean jenkins jacocoTestReport
To honour the JVM settings for this build a single-use Daemon process will be forked. For more on this, please refer to https://docs.gradle.org/8.3/userguide/gradle_daemon.html#sec:disabling_the_daemon in the Gradle documentation.
Daemon will be stopped at the end of the build
Configuration on demand is an incubating feature.
FAILURE: Build failed with an exception.
* Where:
Build file '<https://ci-builds.apache.org/job/POI/job/POI-XMLBeans-DSL-1.22/ws/build.gradle'> line: 37
* What went wrong:
An exception occurred applying plugin request [id: 'de.thetaphi.forbiddenapis', version: '3.4']
> Failed to apply plugin 'de.thetaphi.forbiddenapis'.
> Could not create plugin of type 'ForbiddenApisPlugin'.
> BUG! exception in phase 'semantic analysis' in source unit 'jar:file:/home/jenkins/.gradle/caches/modules-2/files-2.1/de.thetaphi/forbiddenapis/3.4/413c25496dd3128964ee80c8778b92138156de7c/forbiddenapis-3.4.jar!/de/thetaphi/forbiddenapis/gradle/plugin-init.groovy' Unsupported class file major version 66
* Try:
> Run with --stacktrace option to get the stack trace.
> Run with --info or --debug option to get more log output.
> Run with --scan to get full insights.
> Get more help at https://help.gradle.org.
BUILD FAILED in 14s
Build step 'Invoke Gradle script' changed build result to FAILURE
Build step 'Invoke Gradle script' marked build as failure
ERROR: Not all environment variables could be successfully injected. Check for similarly-named environment variables.
Archiving artifacts
ERROR: Not all environment variables could be successfully injected. Check for similarly-named environment variables.
Recording test results
ERROR: Not all environment variables could be successfully injected. Check for similarly-named environment variables.
ERROR: Step ?Publish JUnit test result report? failed: No test report files were found. Configuration error?
[SpotBugs] Skipping execution of recorder since overall result is 'FAILURE'
ERROR: Not all environment variables could be successfully injected. Check for similarly-named environment variables.
---------------------------------------------------------------------
To unsubscribe, e-mail: dev-unsubscribe@poi.apache.org
For additional commands, e-mail: dev-help@poi.apache.org
Build failed in Jenkins: POI » POI-XMLBeans-DSL-1.22 #21
Posted by Apache Jenkins Server <je...@builds.apache.org>.
See <https://ci-builds.apache.org/job/POI/job/POI-XMLBeans-DSL-1.22/21/display/redirect?page=changes>
Changes:
[PJ Fanning] gradle 8.7
------------------------------------------
Started by an SCM change
Running as SYSTEM
ERROR: Not all environment variables could be successfully injected. Check for similarly-named environment variables.
[EnvInject] - Loading node environment variables.
[EnvInject] - Preparing an environment for the build.
[EnvInject] - Keeping Jenkins system variables.
[EnvInject] - Keeping Jenkins build variables.
[EnvInject] - Injecting as environment variables the properties content
FORREST_HOME=/home/jenkins/tools/forrest/latest
LANG=en_US.UTF-8
[EnvInject] - Variables injected successfully.
[EnvInject] - Injecting contributions.
Building remotely on builds40 (ubuntu) in workspace <https://ci-builds.apache.org/job/POI/job/POI-XMLBeans-DSL-1.22/ws/>
ERROR: Not all environment variables could be successfully injected. Check for similarly-named environment variables.
Updating https://svn.apache.org/repos/asf/xmlbeans/trunk at revision '2024-04-21T11:52:08.610 +0000'
U build.gradle
U gradle/wrapper/gradle-wrapper.properties
At revision 1917236
ERROR: Not all environment variables could be successfully injected. Check for similarly-named environment variables.
[POI-XMLBeans-DSL-1.22] $ /bin/sh -xe /tmp/jenkins13351854141898633261.sh
+ rm -rf examples excelant integrationtest main ooxml ooxml-schema scratchpad build.javacheck.xml
+ svn status
+ svn revert poi*/src/*/java9/module-info.*
svn: E155010: The node '<https://ci-builds.apache.org/job/POI/job/POI-XMLBeans-DSL-1.22/ws/poi*/src/*'> was not found.
+ true
+ svn revert src/resources/ooxml-lite-report.*
Skipped 'src/resources/ooxml-lite-report.*'
+ echo Java-Home: /home/jenkins/tools/java/latest22
Java-Home: /home/jenkins/tools/java/latest22
+ ls -al /home/jenkins/tools/java/latest22/
total 36
drwxr-xr-x 8 root root 4096 Nov 13 21:50 .
drwxrwxr-x 39 root root 4096 Feb 8 19:07 ..
drwxr-xr-x 2 root root 4096 Nov 13 21:50 bin
drwxr-xr-x 5 root root 4096 Nov 13 21:50 conf
drwxr-xr-x 3 root root 4096 Nov 13 21:50 include
drwxr-xr-x 2 root root 4096 Nov 13 21:50 jmods
drwxr-xr-x 71 root root 4096 Nov 13 21:50 legal
drwxr-xr-x 5 root root 4096 Nov 13 21:50 lib
-rw-r--r-- 1 root root 1220 Oct 18 2023 release
+ ls -al /home/jenkins/tools/java/latest22/bin
total 472
drwxr-xr-x 2 root root 4096 Nov 13 21:50 .
drwxr-xr-x 8 root root 4096 Nov 13 21:50 ..
-rwxr-xr-x 1 root root 12384 Oct 18 2023 jar
-rwxr-xr-x 1 root root 12392 Oct 18 2023 jarsigner
-rwxr-xr-x 1 root root 12328 Oct 18 2023 java
-rwxr-xr-x 1 root root 12416 Oct 18 2023 javac
-rwxr-xr-x 1 root root 12424 Oct 18 2023 javadoc
-rwxr-xr-x 1 root root 12384 Oct 18 2023 javap
-rwxr-xr-x 1 root root 12384 Oct 18 2023 jcmd
-rwxr-xr-x 1 root root 12456 Oct 18 2023 jconsole
-rwxr-xr-x 1 root root 12384 Oct 18 2023 jdb
-rwxr-xr-x 1 root root 12392 Oct 18 2023 jdeprscan
-rwxr-xr-x 1 root root 12384 Oct 18 2023 jdeps
-rwxr-xr-x 1 root root 12384 Oct 18 2023 jfr
-rwxr-xr-x 1 root root 12384 Oct 18 2023 jhsdb
-rwxr-xr-x 1 root root 12392 Oct 18 2023 jimage
-rwxr-xr-x 1 root root 12416 Oct 18 2023 jinfo
-rwxr-xr-x 1 root root 12416 Oct 18 2023 jlink
-rwxr-xr-x 1 root root 12416 Oct 18 2023 jmap
-rwxr-xr-x 1 root root 12384 Oct 18 2023 jmod
-rwxr-xr-x 1 root root 12392 Oct 18 2023 jpackage
-rwxr-xr-x 1 root root 12384 Oct 18 2023 jps
-rwxr-xr-x 1 root root 12424 Oct 18 2023 jrunscript
-rwxr-xr-x 1 root root 12392 Oct 18 2023 jshell
-rwxr-xr-x 1 root root 12424 Oct 18 2023 jstack
-rwxr-xr-x 1 root root 12384 Oct 18 2023 jstat
-rwxr-xr-x 1 root root 12392 Oct 18 2023 jstatd
-rwxr-xr-x 1 root root 12392 Oct 18 2023 jwebserver
-rwxr-xr-x 1 root root 12392 Oct 18 2023 keytool
-rwxr-xr-x 1 root root 12416 Oct 18 2023 rmiregistry
-rwxr-xr-x 1 root root 12392 Oct 18 2023 serialver
+ /home/jenkins/tools/java/latest22/bin/java -version
openjdk version "22-ea" 2024-03-19
OpenJDK Runtime Environment (build 22-ea+20-1570)
OpenJDK 64-Bit Server VM (build 22-ea+20-1570, mixed mode, sharing)
+ echo which java
which java
+ which java
/home/jenkins/tools/java/latest22/bin/java
+ java -version
openjdk version "22-ea" 2024-03-19
OpenJDK Runtime Environment (build 22-ea+20-1570)
OpenJDK 64-Bit Server VM (build 22-ea+20-1570, mixed mode, sharing)
+ echo which javac
which javac
+ which javac
/home/jenkins/tools/java/latest22/bin/javac
+ javac -version
javac 22-ea
+ echo Ant-Home:
Ant-Home:
+ ls -al
total 416
drwxr-xr-x 11 jenkins jenkins 4096 Apr 21 11:52 .
drwxr-xr-x 6 jenkins jenkins 4096 Apr 19 12:59 ..
-rw-r--r-- 1 jenkins jenkins 29242 Apr 21 11:52 build.gradle
-rw-r--r-- 1 jenkins jenkins 54123 Mar 17 11:52 build.xml
-rw-r--r-- 1 jenkins jenkins 11963 Mar 17 11:52 CHANGES.txt
drwxr-xr-x 3 jenkins jenkins 4096 Mar 17 11:52 .github
-rw-r--r-- 1 jenkins jenkins 14 Mar 17 11:52 .gitignore
drwxr-xr-x 4 jenkins jenkins 4096 Mar 17 11:52 .gradle
drwxr-xr-x 3 jenkins jenkins 4096 Mar 17 11:52 gradle
-rw-r--r-- 1 jenkins jenkins 1338 Mar 17 11:52 gradle.properties
-rwxr-xr-x 1 jenkins jenkins 9177 Mar 17 11:52 gradlew
-rw-r--r-- 1 jenkins jenkins 176157 Mar 17 11:52 KEYS
drwxr-xr-x 2 jenkins jenkins 4096 Mar 17 11:52 legal
-rwxr-xr-x 1 jenkins jenkins 12458 Mar 17 11:52 LICENSE-binary.txt
-rwxr-xr-x 1 jenkins jenkins 11884 Mar 17 11:52 LICENSE.txt
-rw-r--r-- 1 jenkins jenkins 2561 Mar 17 11:52 NOTICE-binary.txt
-rw-r--r-- 1 jenkins jenkins 1592 Mar 17 11:52 NOTICE.txt
-rw-r--r-- 1 jenkins jenkins 2227 Mar 17 11:52 README.txt
-rw-r--r-- 1 jenkins jenkins 10995 Mar 17 11:52 release-guide.txt
drwxr-xr-x 16 jenkins jenkins 4096 Mar 17 11:52 samples
-rw-r--r-- 1 jenkins jenkins 238 Mar 17 11:52 SECURITY.md
-rw-r--r-- 1 jenkins jenkins 661 Mar 17 11:52 settings.gradle
drwxr-xr-x 4 jenkins jenkins 4096 Mar 17 11:52 src
-rw-r--r-- 1 jenkins jenkins 359 Mar 17 11:52 STATUS
drwxr-xr-x 4 jenkins jenkins 4096 Apr 21 11:52 .svn
drwxr-xr-x 4 jenkins jenkins 4096 Mar 17 11:52 test
-rw-r--r-- 1 jenkins jenkins 3803 Mar 17 11:52 wrapper.gradle
-rw-r--r-- 1 jenkins jenkins 25 Mar 17 11:52 xbeanenv.cmd
-rwxr-xr-x 1 jenkins jenkins 27 Mar 17 11:52 xbeanenv.sh
drwxr-xr-x 2 jenkins jenkins 4096 Mar 17 11:52 xkit
+ echo which ant
which ant
+ which ant
/usr/bin/ant
+ ant -version
Apache Ant(TM) version 1.10.12 compiled on January 17 1970
+ echo <project default="test"><target name="test"><echo>Java ${ant.java.version}/${java.version}</echo><exec executable="javac"><arg value="-version"/></exec></target></project>
+ ant -f build.javacheck.xml -v
Apache Ant(TM) version 1.10.12 compiled on January 17 1970
Buildfile: <https://ci-builds.apache.org/job/POI/job/POI-XMLBeans-DSL-1.22/ws/build.javacheck.xml>
Detected Java version: 22 in: /usr/local/asfpackages/java/openjdk-22-ea+20
Detected OS: Linux
parsing buildfile <https://ci-builds.apache.org/job/POI/job/POI-XMLBeans-DSL-1.22/ws/build.javacheck.xml> with URI = <https://ci-builds.apache.org/job/POI/job/POI-XMLBeans-DSL-1.22/ws/build.javacheck.xml>
Project base dir set to: <https://ci-builds.apache.org/job/POI/job/POI-XMLBeans-DSL-1.22/ws/>
Build sequence for target(s) `test' is [test]
Complete build sequence is [test, ]
test:
parsing buildfile jar:file:/usr/share/ant/lib/ant.jar!/org/apache/tools/ant/antlib.xml with URI = jar:file:/usr/share/ant/lib/ant.jar!/org/apache/tools/ant/antlib.xml from a zip file
[echo] Java 22/22-ea
[exec] Current OS is Linux
[exec] Executing 'javac' with arguments:
[exec] '-version'
[exec]
[exec] The ' characters around the executable and arguments are
[exec] not part of the command.
[exec] javac 22-ea
BUILD SUCCESSFUL
Total time: 0 seconds
+ exit 0
[Gradle] - Launching build.
ERROR: Not all environment variables could be successfully injected. Check for similarly-named environment variables.
[POI-XMLBeans-DSL-1.22] $ <https://ci-builds.apache.org/job/POI/job/POI-XMLBeans-DSL-1.22/ws/gradlew> clean jenkins jacocoTestReport
To honour the JVM settings for this build a single-use Daemon process will be forked. For more on this, please refer to https://docs.gradle.org/8.7/userguide/gradle_daemon.html#sec:disabling_the_daemon in the Gradle documentation.
Daemon will be stopped at the end of the build
Configuration on demand is an incubating feature.
FAILURE: Build failed with an exception.
* What went wrong:
BUG! exception in phase 'semantic analysis' in source unit '_BuildScript_' Unsupported class file major version 66
> Unsupported class file major version 66
* Try:
> Run with --stacktrace option to get the stack trace.
> Run with --info or --debug option to get more log output.
> Run with --scan to get full insights.
> Get more help at https://help.gradle.org.
BUILD FAILED in 9s
Build step 'Invoke Gradle script' changed build result to FAILURE
Build step 'Invoke Gradle script' marked build as failure
ERROR: Not all environment variables could be successfully injected. Check for similarly-named environment variables.
Archiving artifacts
ERROR: Not all environment variables could be successfully injected. Check for similarly-named environment variables.
Recording test results
ERROR: Not all environment variables could be successfully injected. Check for similarly-named environment variables.
ERROR: Step ‘Publish JUnit test result report’ failed: No test report files were found. Configuration error?
[SpotBugs] Skipping execution of recorder since overall result is 'FAILURE'
ERROR: Not all environment variables could be successfully injected. Check for similarly-named environment variables.
---------------------------------------------------------------------
To unsubscribe, e-mail: dev-unsubscribe@poi.apache.org
For additional commands, e-mail: dev-help@poi.apache.org
Build failed in Jenkins: POI » POI-XMLBeans-DSL-1.22 #20
Posted by Apache Jenkins Server <je...@builds.apache.org>.
See <https://ci-builds.apache.org/job/POI/job/POI-XMLBeans-DSL-1.22/20/display/redirect?page=changes>
Changes:
[PJ Fanning] commons-io 2.16.1
------------------------------------------
Started by an SCM change
Running as SYSTEM
ERROR: Not all environment variables could be successfully injected. Check for similarly-named environment variables.
[EnvInject] - Loading node environment variables.
[EnvInject] - Preparing an environment for the build.
[EnvInject] - Keeping Jenkins system variables.
[EnvInject] - Keeping Jenkins build variables.
[EnvInject] - Injecting as environment variables the properties content
FORREST_HOME=/home/jenkins/tools/forrest/latest
LANG=en_US.UTF-8
[EnvInject] - Variables injected successfully.
[EnvInject] - Injecting contributions.
Building remotely on builds40 (ubuntu) in workspace <https://ci-builds.apache.org/job/POI/job/POI-XMLBeans-DSL-1.22/ws/>
ERROR: Not all environment variables could be successfully injected. Check for similarly-named environment variables.
Updating https://svn.apache.org/repos/asf/xmlbeans/trunk at revision '2024-04-14T11:52:08.770 +0000'
U build.gradle
U src/main/java/org/apache/xmlbeans/impl/common/DefaultClassLoaderResourceLoader.java
U src/main/java/org/apache/xmlbeans/impl/schema/SchemaTypeLoaderImpl.java
U src/main/java/org/apache/xmlbeans/impl/schema/SchemaTypeSystemImpl.java
U src/main/java9/module-info.class
U src/test/java/xmlobject/detailed/TestsFromBugs.java
At revision 1916982
ERROR: Not all environment variables could be successfully injected. Check for similarly-named environment variables.
[POI-XMLBeans-DSL-1.22] $ /bin/sh -xe /tmp/jenkins4367824871911539433.sh
+ rm -rf examples excelant integrationtest main ooxml ooxml-schema scratchpad build.javacheck.xml
+ svn status
+ svn revert poi*/src/*/java9/module-info.*
svn: E155010: The node '<https://ci-builds.apache.org/job/POI/job/POI-XMLBeans-DSL-1.22/ws/poi*/src/*'> was not found.
+ true
+ svn revert src/resources/ooxml-lite-report.*
Skipped 'src/resources/ooxml-lite-report.*'
+ echo Java-Home: /home/jenkins/tools/java/latest22
Java-Home: /home/jenkins/tools/java/latest22
+ ls -al /home/jenkins/tools/java/latest22/
total 36
drwxr-xr-x 8 root root 4096 Nov 13 21:50 .
drwxrwxr-x 39 root root 4096 Feb 8 19:07 ..
drwxr-xr-x 2 root root 4096 Nov 13 21:50 bin
drwxr-xr-x 5 root root 4096 Nov 13 21:50 conf
drwxr-xr-x 3 root root 4096 Nov 13 21:50 include
drwxr-xr-x 2 root root 4096 Nov 13 21:50 jmods
drwxr-xr-x 71 root root 4096 Nov 13 21:50 legal
drwxr-xr-x 5 root root 4096 Nov 13 21:50 lib
-rw-r--r-- 1 root root 1220 Oct 18 14:34 release
+ ls -al /home/jenkins/tools/java/latest22/bin
total 472
drwxr-xr-x 2 root root 4096 Nov 13 21:50 .
drwxr-xr-x 8 root root 4096 Nov 13 21:50 ..
-rwxr-xr-x 1 root root 12384 Oct 18 14:34 jar
-rwxr-xr-x 1 root root 12392 Oct 18 14:34 jarsigner
-rwxr-xr-x 1 root root 12328 Oct 18 14:34 java
-rwxr-xr-x 1 root root 12416 Oct 18 14:34 javac
-rwxr-xr-x 1 root root 12424 Oct 18 14:34 javadoc
-rwxr-xr-x 1 root root 12384 Oct 18 14:34 javap
-rwxr-xr-x 1 root root 12384 Oct 18 14:34 jcmd
-rwxr-xr-x 1 root root 12456 Oct 18 14:34 jconsole
-rwxr-xr-x 1 root root 12384 Oct 18 14:34 jdb
-rwxr-xr-x 1 root root 12392 Oct 18 14:34 jdeprscan
-rwxr-xr-x 1 root root 12384 Oct 18 14:34 jdeps
-rwxr-xr-x 1 root root 12384 Oct 18 14:34 jfr
-rwxr-xr-x 1 root root 12384 Oct 18 14:34 jhsdb
-rwxr-xr-x 1 root root 12392 Oct 18 14:34 jimage
-rwxr-xr-x 1 root root 12416 Oct 18 14:34 jinfo
-rwxr-xr-x 1 root root 12416 Oct 18 14:34 jlink
-rwxr-xr-x 1 root root 12416 Oct 18 14:34 jmap
-rwxr-xr-x 1 root root 12384 Oct 18 14:34 jmod
-rwxr-xr-x 1 root root 12392 Oct 18 14:34 jpackage
-rwxr-xr-x 1 root root 12384 Oct 18 14:34 jps
-rwxr-xr-x 1 root root 12424 Oct 18 14:34 jrunscript
-rwxr-xr-x 1 root root 12392 Oct 18 14:34 jshell
-rwxr-xr-x 1 root root 12424 Oct 18 14:34 jstack
-rwxr-xr-x 1 root root 12384 Oct 18 14:34 jstat
-rwxr-xr-x 1 root root 12392 Oct 18 14:34 jstatd
-rwxr-xr-x 1 root root 12392 Oct 18 14:34 jwebserver
-rwxr-xr-x 1 root root 12392 Oct 18 14:34 keytool
-rwxr-xr-x 1 root root 12416 Oct 18 14:34 rmiregistry
-rwxr-xr-x 1 root root 12392 Oct 18 14:34 serialver
+ /home/jenkins/tools/java/latest22/bin/java -version
openjdk version "22-ea" 2024-03-19
OpenJDK Runtime Environment (build 22-ea+20-1570)
OpenJDK 64-Bit Server VM (build 22-ea+20-1570, mixed mode, sharing)
+ echo which java
which java
+ which java
/home/jenkins/tools/java/latest22/bin/java
+ java -version
openjdk version "22-ea" 2024-03-19
OpenJDK Runtime Environment (build 22-ea+20-1570)
OpenJDK 64-Bit Server VM (build 22-ea+20-1570, mixed mode, sharing)
+ echo which javac
which javac
+ which javac
/home/jenkins/tools/java/latest22/bin/javac
+ javac -version
javac 22-ea
+ echo Ant-Home:
Ant-Home:
+ ls -al
total 416
drwxr-xr-x 11 jenkins jenkins 4096 Apr 14 11:52 .
drwxr-xr-x 4 jenkins jenkins 4096 Mar 28 09:03 ..
-rw-r--r-- 1 jenkins jenkins 29242 Apr 14 11:52 build.gradle
-rw-r--r-- 1 jenkins jenkins 54123 Mar 17 11:52 build.xml
-rw-r--r-- 1 jenkins jenkins 11963 Mar 17 11:52 CHANGES.txt
drwxr-xr-x 3 jenkins jenkins 4096 Mar 17 11:52 .github
-rw-r--r-- 1 jenkins jenkins 14 Mar 17 11:52 .gitignore
drwxr-xr-x 4 jenkins jenkins 4096 Mar 17 11:52 .gradle
drwxr-xr-x 3 jenkins jenkins 4096 Mar 17 11:52 gradle
-rw-r--r-- 1 jenkins jenkins 1338 Mar 17 11:52 gradle.properties
-rwxr-xr-x 1 jenkins jenkins 9177 Mar 17 11:52 gradlew
-rw-r--r-- 1 jenkins jenkins 176157 Mar 17 11:52 KEYS
drwxr-xr-x 2 jenkins jenkins 4096 Mar 17 11:52 legal
-rwxr-xr-x 1 jenkins jenkins 12458 Mar 17 11:52 LICENSE-binary.txt
-rwxr-xr-x 1 jenkins jenkins 11884 Mar 17 11:52 LICENSE.txt
-rw-r--r-- 1 jenkins jenkins 2561 Mar 17 11:52 NOTICE-binary.txt
-rw-r--r-- 1 jenkins jenkins 1592 Mar 17 11:52 NOTICE.txt
-rw-r--r-- 1 jenkins jenkins 2227 Mar 17 11:52 README.txt
-rw-r--r-- 1 jenkins jenkins 10995 Mar 17 11:52 release-guide.txt
drwxr-xr-x 16 jenkins jenkins 4096 Mar 17 11:52 samples
-rw-r--r-- 1 jenkins jenkins 238 Mar 17 11:52 SECURITY.md
-rw-r--r-- 1 jenkins jenkins 661 Mar 17 11:52 settings.gradle
drwxr-xr-x 4 jenkins jenkins 4096 Mar 17 11:52 src
-rw-r--r-- 1 jenkins jenkins 359 Mar 17 11:52 STATUS
drwxr-xr-x 4 jenkins jenkins 4096 Apr 14 11:52 .svn
drwxr-xr-x 4 jenkins jenkins 4096 Mar 17 11:52 test
-rw-r--r-- 1 jenkins jenkins 3803 Mar 17 11:52 wrapper.gradle
-rw-r--r-- 1 jenkins jenkins 25 Mar 17 11:52 xbeanenv.cmd
-rwxr-xr-x 1 jenkins jenkins 27 Mar 17 11:52 xbeanenv.sh
drwxr-xr-x 2 jenkins jenkins 4096 Mar 17 11:52 xkit
+ echo which ant
which ant
+ which ant
/usr/bin/ant
+ ant -version
Apache Ant(TM) version 1.10.12 compiled on January 17 1970
+ echo <project default="test"><target name="test"><echo>Java ${ant.java.version}/${java.version}</echo><exec executable="javac"><arg value="-version"/></exec></target></project>
+ ant -f build.javacheck.xml -v
Apache Ant(TM) version 1.10.12 compiled on January 17 1970
Buildfile: <https://ci-builds.apache.org/job/POI/job/POI-XMLBeans-DSL-1.22/ws/build.javacheck.xml>
Detected Java version: 22 in: /usr/local/asfpackages/java/openjdk-22-ea+20
Detected OS: Linux
parsing buildfile <https://ci-builds.apache.org/job/POI/job/POI-XMLBeans-DSL-1.22/ws/build.javacheck.xml> with URI = <https://ci-builds.apache.org/job/POI/job/POI-XMLBeans-DSL-1.22/ws/build.javacheck.xml>
Project base dir set to: <https://ci-builds.apache.org/job/POI/job/POI-XMLBeans-DSL-1.22/ws/>
Build sequence for target(s) `test' is [test]
Complete build sequence is [test, ]
test:
parsing buildfile jar:file:/usr/share/ant/lib/ant.jar!/org/apache/tools/ant/antlib.xml with URI = jar:file:/usr/share/ant/lib/ant.jar!/org/apache/tools/ant/antlib.xml from a zip file
[echo] Java 22/22-ea
[exec] Current OS is Linux
[exec] Executing 'javac' with arguments:
[exec] '-version'
[exec]
[exec] The ' characters around the executable and arguments are
[exec] not part of the command.
[exec] javac 22-ea
BUILD SUCCESSFUL
Total time: 1 second
+ exit 0
[Gradle] - Launching build.
ERROR: Not all environment variables could be successfully injected. Check for similarly-named environment variables.
[POI-XMLBeans-DSL-1.22] $ <https://ci-builds.apache.org/job/POI/job/POI-XMLBeans-DSL-1.22/ws/gradlew> clean jenkins jacocoTestReport
To honour the JVM settings for this build a single-use Daemon process will be forked. For more on this, please refer to https://docs.gradle.org/8.6/userguide/gradle_daemon.html#sec:disabling_the_daemon in the Gradle documentation.
Daemon will be stopped at the end of the build
Configuration on demand is an incubating feature.
FAILURE: Build failed with an exception.
* What went wrong:
Could not open settings generic class cache for settings file '<https://ci-builds.apache.org/job/POI/job/POI-XMLBeans-DSL-1.22/ws/settings.gradle'> (/home/jenkins/.gradle/caches/8.6/scripts/f1vtb3f18o718s5f2prqhsmqz).
> BUG! exception in phase 'semantic analysis' in source unit '_BuildScript_' Unsupported class file major version 66
* Try:
> Run with --stacktrace option to get the stack trace.
> Run with --info or --debug option to get more log output.
> Run with --scan to get full insights.
> Get more help at https://help.gradle.org.
BUILD FAILED in 11s
Build step 'Invoke Gradle script' changed build result to FAILURE
Build step 'Invoke Gradle script' marked build as failure
ERROR: Not all environment variables could be successfully injected. Check for similarly-named environment variables.
Archiving artifacts
ERROR: Not all environment variables could be successfully injected. Check for similarly-named environment variables.
Recording test results
ERROR: Not all environment variables could be successfully injected. Check for similarly-named environment variables.
ERROR: Step ‘Publish JUnit test result report’ failed: No test report files were found. Configuration error?
[SpotBugs] Skipping execution of recorder since overall result is 'FAILURE'
ERROR: Not all environment variables could be successfully injected. Check for similarly-named environment variables.
---------------------------------------------------------------------
To unsubscribe, e-mail: dev-unsubscribe@poi.apache.org
For additional commands, e-mail: dev-help@poi.apache.org
Build failed in Jenkins: POI » POI-XMLBeans-DSL-1.22 #19
Posted by Apache Jenkins Server <je...@builds.apache.org>.
See <https://ci-builds.apache.org/job/POI/job/POI-XMLBeans-DSL-1.22/19/display/redirect?page=changes>
Changes:
[PJ Fanning] commons-io 2.16.0
------------------------------------------
[...truncated 7.49 MB...]
At edu.umd.cs.findbugs.classfile.engine.asm.ClassReaderAnalysisEngine.analyze(ClassReaderAnalysisEngine.java:48)
At edu.umd.cs.findbugs.classfile.engine.asm.ClassReaderAnalysisEngine.analyze(ClassReaderAnalysisEngine.java:34)
At edu.umd.cs.findbugs.classfile.impl.AnalysisCache.getClassAnalysis(AnalysisCache.java:261)
At edu.umd.cs.findbugs.classfile.engine.ClassInfoAnalysisEngine.analyze(ClassInfoAnalysisEngine.java:75)
At edu.umd.cs.findbugs.classfile.engine.ClassInfoAnalysisEngine.analyze(ClassInfoAnalysisEngine.java:38)
At edu.umd.cs.findbugs.classfile.impl.AnalysisCache.getClassAnalysis(AnalysisCache.java:261)
At edu.umd.cs.findbugs.ba.XFactory.getXClass(XFactory.java:693)
At edu.umd.cs.findbugs.ba.AnalysisContext.setAppClassList(AnalysisContext.java:975)
At edu.umd.cs.findbugs.FindBugs2.setAppClassList(FindBugs2.java:909)
At edu.umd.cs.findbugs.FindBugs2.execute(FindBugs2.java:252)
At edu.umd.cs.findbugs.FindBugs.runMain(FindBugs.java:395)
At edu.umd.cs.findbugs.FindBugs2.main(FindBugs2.java:1231)
Couldn't get class info for java/lang/LinkageError
java.lang.IllegalArgumentException: Unsupported class file major version 66
At org.objectweb.asm.ClassReader.<init>(ClassReader.java:199)
At org.objectweb.asm.ClassReader.<init>(ClassReader.java:180)
At org.objectweb.asm.ClassReader.<init>(ClassReader.java:166)
At edu.umd.cs.findbugs.asm.FBClassReader.<init>(FBClassReader.java:35)
At edu.umd.cs.findbugs.classfile.engine.asm.ClassReaderAnalysisEngine.analyze(ClassReaderAnalysisEngine.java:48)
At edu.umd.cs.findbugs.classfile.engine.asm.ClassReaderAnalysisEngine.analyze(ClassReaderAnalysisEngine.java:34)
At edu.umd.cs.findbugs.classfile.impl.AnalysisCache.getClassAnalysis(AnalysisCache.java:261)
At edu.umd.cs.findbugs.classfile.engine.ClassInfoAnalysisEngine.analyze(ClassInfoAnalysisEngine.java:75)
At edu.umd.cs.findbugs.classfile.engine.ClassInfoAnalysisEngine.analyze(ClassInfoAnalysisEngine.java:38)
At edu.umd.cs.findbugs.classfile.impl.AnalysisCache.getClassAnalysis(AnalysisCache.java:261)
At edu.umd.cs.findbugs.ba.XFactory.getXClass(XFactory.java:693)
At edu.umd.cs.findbugs.ba.AnalysisContext.setAppClassList(AnalysisContext.java:975)
At edu.umd.cs.findbugs.FindBugs2.setAppClassList(FindBugs2.java:909)
At edu.umd.cs.findbugs.FindBugs2.execute(FindBugs2.java:252)
At edu.umd.cs.findbugs.FindBugs.runMain(FindBugs.java:395)
At edu.umd.cs.findbugs.FindBugs2.main(FindBugs2.java:1231)
Couldn't get class info for java/io/File
java.lang.IllegalArgumentException: Unsupported class file major version 66
At org.objectweb.asm.ClassReader.<init>(ClassReader.java:199)
At org.objectweb.asm.ClassReader.<init>(ClassReader.java:180)
At org.objectweb.asm.ClassReader.<init>(ClassReader.java:166)
At edu.umd.cs.findbugs.asm.FBClassReader.<init>(FBClassReader.java:35)
At edu.umd.cs.findbugs.classfile.engine.asm.ClassReaderAnalysisEngine.analyze(ClassReaderAnalysisEngine.java:48)
At edu.umd.cs.findbugs.classfile.engine.asm.ClassReaderAnalysisEngine.analyze(ClassReaderAnalysisEngine.java:34)
At edu.umd.cs.findbugs.classfile.impl.AnalysisCache.getClassAnalysis(AnalysisCache.java:261)
At edu.umd.cs.findbugs.classfile.engine.ClassInfoAnalysisEngine.analyze(ClassInfoAnalysisEngine.java:75)
At edu.umd.cs.findbugs.classfile.engine.ClassInfoAnalysisEngine.analyze(ClassInfoAnalysisEngine.java:38)
At edu.umd.cs.findbugs.classfile.impl.AnalysisCache.getClassAnalysis(AnalysisCache.java:261)
At edu.umd.cs.findbugs.ba.XFactory.getXClass(XFactory.java:693)
At edu.umd.cs.findbugs.ba.AnalysisContext.setAppClassList(AnalysisContext.java:975)
At edu.umd.cs.findbugs.FindBugs2.setAppClassList(FindBugs2.java:909)
At edu.umd.cs.findbugs.FindBugs2.execute(FindBugs2.java:252)
At edu.umd.cs.findbugs.FindBugs.runMain(FindBugs.java:395)
At edu.umd.cs.findbugs.FindBugs2.main(FindBugs2.java:1231)
Couldn't get class info for java/nio/file/attribute/FileAttribute
java.lang.IllegalArgumentException: Unsupported class file major version 66
At org.objectweb.asm.ClassReader.<init>(ClassReader.java:199)
At org.objectweb.asm.ClassReader.<init>(ClassReader.java:180)
At org.objectweb.asm.ClassReader.<init>(ClassReader.java:166)
At edu.umd.cs.findbugs.asm.FBClassReader.<init>(FBClassReader.java:35)
At edu.umd.cs.findbugs.classfile.engine.asm.ClassReaderAnalysisEngine.analyze(ClassReaderAnalysisEngine.java:48)
At edu.umd.cs.findbugs.classfile.engine.asm.ClassReaderAnalysisEngine.analyze(ClassReaderAnalysisEngine.java:34)
At edu.umd.cs.findbugs.classfile.impl.AnalysisCache.getClassAnalysis(AnalysisCache.java:261)
At edu.umd.cs.findbugs.classfile.engine.ClassInfoAnalysisEngine.analyze(ClassInfoAnalysisEngine.java:75)
At edu.umd.cs.findbugs.classfile.engine.ClassInfoAnalysisEngine.analyze(ClassInfoAnalysisEngine.java:38)
At edu.umd.cs.findbugs.classfile.impl.AnalysisCache.getClassAnalysis(AnalysisCache.java:261)
At edu.umd.cs.findbugs.ba.XFactory.getXClass(XFactory.java:693)
At edu.umd.cs.findbugs.ba.AnalysisContext.setAppClassList(AnalysisContext.java:975)
At edu.umd.cs.findbugs.FindBugs2.setAppClassList(FindBugs2.java:909)
At edu.umd.cs.findbugs.FindBugs2.execute(FindBugs2.java:252)
At edu.umd.cs.findbugs.FindBugs.runMain(FindBugs.java:395)
At edu.umd.cs.findbugs.FindBugs2.main(FindBugs2.java:1231)
Couldn't get class info for java/util/Calendar
java.lang.IllegalArgumentException: Unsupported class file major version 66
At org.objectweb.asm.ClassReader.<init>(ClassReader.java:199)
At org.objectweb.asm.ClassReader.<init>(ClassReader.java:180)
At org.objectweb.asm.ClassReader.<init>(ClassReader.java:166)
At edu.umd.cs.findbugs.asm.FBClassReader.<init>(FBClassReader.java:35)
At edu.umd.cs.findbugs.classfile.engine.asm.ClassReaderAnalysisEngine.analyze(ClassReaderAnalysisEngine.java:48)
At edu.umd.cs.findbugs.classfile.engine.asm.ClassReaderAnalysisEngine.analyze(ClassReaderAnalysisEngine.java:34)
At edu.umd.cs.findbugs.classfile.impl.AnalysisCache.getClassAnalysis(AnalysisCache.java:261)
At edu.umd.cs.findbugs.classfile.engine.ClassInfoAnalysisEngine.analyze(ClassInfoAnalysisEngine.java:75)
At edu.umd.cs.findbugs.classfile.engine.ClassInfoAnalysisEngine.analyze(ClassInfoAnalysisEngine.java:38)
At edu.umd.cs.findbugs.classfile.impl.AnalysisCache.getClassAnalysis(AnalysisCache.java:261)
At edu.umd.cs.findbugs.ba.XFactory.getXClass(XFactory.java:693)
At edu.umd.cs.findbugs.ba.AnalysisContext.setAppClassList(AnalysisContext.java:975)
At edu.umd.cs.findbugs.FindBugs2.setAppClassList(FindBugs2.java:909)
At edu.umd.cs.findbugs.FindBugs2.execute(FindBugs2.java:252)
At edu.umd.cs.findbugs.FindBugs.runMain(FindBugs.java:395)
At edu.umd.cs.findbugs.FindBugs2.main(FindBugs2.java:1231)
Couldn't get class info for java/util/Random
java.lang.IllegalArgumentException: Unsupported class file major version 66
At org.objectweb.asm.ClassReader.<init>(ClassReader.java:199)
At org.objectweb.asm.ClassReader.<init>(ClassReader.java:180)
At org.objectweb.asm.ClassReader.<init>(ClassReader.java:166)
At edu.umd.cs.findbugs.asm.FBClassReader.<init>(FBClassReader.java:35)
At edu.umd.cs.findbugs.classfile.engine.asm.ClassReaderAnalysisEngine.analyze(ClassReaderAnalysisEngine.java:48)
At edu.umd.cs.findbugs.classfile.engine.asm.ClassReaderAnalysisEngine.analyze(ClassReaderAnalysisEngine.java:34)
At edu.umd.cs.findbugs.classfile.impl.AnalysisCache.getClassAnalysis(AnalysisCache.java:261)
At edu.umd.cs.findbugs.classfile.engine.ClassInfoAnalysisEngine.analyze(ClassInfoAnalysisEngine.java:75)
At edu.umd.cs.findbugs.classfile.engine.ClassInfoAnalysisEngine.analyze(ClassInfoAnalysisEngine.java:38)
At edu.umd.cs.findbugs.classfile.impl.AnalysisCache.getClassAnalysis(AnalysisCache.java:261)
At edu.umd.cs.findbugs.ba.XFactory.getXClass(XFactory.java:693)
At edu.umd.cs.findbugs.ba.AnalysisContext.setAppClassList(AnalysisContext.java:975)
At edu.umd.cs.findbugs.FindBugs2.setAppClassList(FindBugs2.java:909)
At edu.umd.cs.findbugs.FindBugs2.execute(FindBugs2.java:252)
At edu.umd.cs.findbugs.FindBugs.runMain(FindBugs.java:395)
At edu.umd.cs.findbugs.FindBugs2.main(FindBugs2.java:1231)
Couldn't get class info for java/util/Locale
java.lang.IllegalArgumentException: Unsupported class file major version 66
At org.objectweb.asm.ClassReader.<init>(ClassReader.java:199)
At org.objectweb.asm.ClassReader.<init>(ClassReader.java:180)
At org.objectweb.asm.ClassReader.<init>(ClassReader.java:166)
At edu.umd.cs.findbugs.asm.FBClassReader.<init>(FBClassReader.java:35)
At edu.umd.cs.findbugs.classfile.engine.asm.ClassReaderAnalysisEngine.analyze(ClassReaderAnalysisEngine.java:48)
At edu.umd.cs.findbugs.classfile.engine.asm.ClassReaderAnalysisEngine.analyze(ClassReaderAnalysisEngine.java:34)
At edu.umd.cs.findbugs.classfile.impl.AnalysisCache.getClassAnalysis(AnalysisCache.java:261)
At edu.umd.cs.findbugs.classfile.engine.ClassInfoAnalysisEngine.analyze(ClassInfoAnalysisEngine.java:75)
At edu.umd.cs.findbugs.classfile.engine.ClassInfoAnalysisEngine.analyze(ClassInfoAnalysisEngine.java:38)
At edu.umd.cs.findbugs.classfile.impl.AnalysisCache.getClassAnalysis(AnalysisCache.java:261)
At edu.umd.cs.findbugs.ba.XFactory.getXClass(XFactory.java:693)
At edu.umd.cs.findbugs.ba.AnalysisContext.setAppClassList(AnalysisContext.java:975)
At edu.umd.cs.findbugs.FindBugs2.setAppClassList(FindBugs2.java:909)
At edu.umd.cs.findbugs.FindBugs2.execute(FindBugs2.java:252)
At edu.umd.cs.findbugs.FindBugs.runMain(FindBugs.java:395)
At edu.umd.cs.findbugs.FindBugs2.main(FindBugs2.java:1231)
Couldn't get class info for java/lang/AssertionError
java.lang.IllegalArgumentException: Unsupported class file major version 66
At org.objectweb.asm.ClassReader.<init>(ClassReader.java:199)
At org.objectweb.asm.ClassReader.<init>(ClassReader.java:180)
At org.objectweb.asm.ClassReader.<init>(ClassReader.java:166)
At edu.umd.cs.findbugs.asm.FBClassReader.<init>(FBClassReader.java:35)
At edu.umd.cs.findbugs.classfile.engine.asm.ClassReaderAnalysisEngine.analyze(ClassReaderAnalysisEngine.java:48)
At edu.umd.cs.findbugs.classfile.engine.asm.ClassReaderAnalysisEngine.analyze(ClassReaderAnalysisEngine.java:34)
At edu.umd.cs.findbugs.classfile.impl.AnalysisCache.getClassAnalysis(AnalysisCache.java:261)
At edu.umd.cs.findbugs.classfile.engine.ClassInfoAnalysisEngine.analyze(ClassInfoAnalysisEngine.java:75)
At edu.umd.cs.findbugs.classfile.engine.ClassInfoAnalysisEngine.analyze(ClassInfoAnalysisEngine.java:38)
At edu.umd.cs.findbugs.classfile.impl.AnalysisCache.getClassAnalysis(AnalysisCache.java:261)
At edu.umd.cs.findbugs.ba.XFactory.getXClass(XFactory.java:693)
At edu.umd.cs.findbugs.ba.AnalysisContext.setAppClassList(AnalysisContext.java:975)
At edu.umd.cs.findbugs.FindBugs2.setAppClassList(FindBugs2.java:909)
At edu.umd.cs.findbugs.FindBugs2.execute(FindBugs2.java:252)
At edu.umd.cs.findbugs.FindBugs.runMain(FindBugs.java:395)
At edu.umd.cs.findbugs.FindBugs2.main(FindBugs2.java:1231)
Couldn't get class info for java/lang/NoSuchFieldException
java.lang.IllegalArgumentException: Unsupported class file major version 66
At org.objectweb.asm.ClassReader.<init>(ClassReader.java:199)
At org.objectweb.asm.ClassReader.<init>(ClassReader.java:180)
At org.objectweb.asm.ClassReader.<init>(ClassReader.java:166)
At edu.umd.cs.findbugs.asm.FBClassReader.<init>(FBClassReader.java:35)
At edu.umd.cs.findbugs.classfile.engine.asm.ClassReaderAnalysisEngine.analyze(ClassReaderAnalysisEngine.java:48)
At edu.umd.cs.findbugs.classfile.engine.asm.ClassReaderAnalysisEngine.analyze(ClassReaderAnalysisEngine.java:34)
At edu.umd.cs.findbugs.classfile.impl.AnalysisCache.getClassAnalysis(AnalysisCache.java:261)
At edu.umd.cs.findbugs.classfile.engine.ClassInfoAnalysisEngine.analyze(ClassInfoAnalysisEngine.java:75)
At edu.umd.cs.findbugs.classfile.engine.ClassInfoAnalysisEngine.analyze(ClassInfoAnalysisEngine.java:38)
At edu.umd.cs.findbugs.classfile.impl.AnalysisCache.getClassAnalysis(AnalysisCache.java:261)
At edu.umd.cs.findbugs.ba.XFactory.getXClass(XFactory.java:693)
At edu.umd.cs.findbugs.ba.AnalysisContext.setAppClassList(AnalysisContext.java:975)
At edu.umd.cs.findbugs.FindBugs2.setAppClassList(FindBugs2.java:909)
At edu.umd.cs.findbugs.FindBugs2.execute(FindBugs2.java:252)
At edu.umd.cs.findbugs.FindBugs.runMain(FindBugs.java:395)
At edu.umd.cs.findbugs.FindBugs2.main(FindBugs2.java:1231)
Couldn't get class info for java/util/Set
java.lang.IllegalArgumentException: Unsupported class file major version 66
At org.objectweb.asm.ClassReader.<init>(ClassReader.java:199)
At org.objectweb.asm.ClassReader.<init>(ClassReader.java:180)
At org.objectweb.asm.ClassReader.<init>(ClassReader.java:166)
At edu.umd.cs.findbugs.asm.FBClassReader.<init>(FBClassReader.java:35)
At edu.umd.cs.findbugs.classfile.engine.asm.ClassReaderAnalysisEngine.analyze(ClassReaderAnalysisEngine.java:48)
At edu.umd.cs.findbugs.classfile.engine.asm.ClassReaderAnalysisEngine.analyze(ClassReaderAnalysisEngine.java:34)
At edu.umd.cs.findbugs.classfile.impl.AnalysisCache.getClassAnalysis(AnalysisCache.java:261)
At edu.umd.cs.findbugs.classfile.engine.ClassInfoAnalysisEngine.analyze(ClassInfoAnalysisEngine.java:75)
At edu.umd.cs.findbugs.classfile.engine.ClassInfoAnalysisEngine.analyze(ClassInfoAnalysisEngine.java:38)
At edu.umd.cs.findbugs.classfile.impl.AnalysisCache.getClassAnalysis(AnalysisCache.java:261)
At edu.umd.cs.findbugs.ba.XFactory.getXClass(XFactory.java:693)
At edu.umd.cs.findbugs.ba.AnalysisContext.setAppClassList(AnalysisContext.java:975)
At edu.umd.cs.findbugs.FindBugs2.setAppClassList(FindBugs2.java:909)
At edu.umd.cs.findbugs.FindBugs2.execute(FindBugs2.java:252)
At edu.umd.cs.findbugs.FindBugs.runMain(FindBugs.java:395)
At edu.umd.cs.findbugs.FindBugs2.main(FindBugs2.java:1231)
Couldn't get class info for javax/xml/stream/util/StreamReaderDelegate
java.lang.IllegalArgumentException: Unsupported class file major version 66
At org.objectweb.asm.ClassReader.<init>(ClassReader.java:199)
At org.objectweb.asm.ClassReader.<init>(ClassReader.java:180)
At org.objectweb.asm.ClassReader.<init>(ClassReader.java:166)
At edu.umd.cs.findbugs.asm.FBClassReader.<init>(FBClassReader.java:35)
At edu.umd.cs.findbugs.classfile.engine.asm.ClassReaderAnalysisEngine.analyze(ClassReaderAnalysisEngine.java:48)
At edu.umd.cs.findbugs.classfile.engine.asm.ClassReaderAnalysisEngine.analyze(ClassReaderAnalysisEngine.java:34)
At edu.umd.cs.findbugs.classfile.impl.AnalysisCache.getClassAnalysis(AnalysisCache.java:261)
At edu.umd.cs.findbugs.classfile.engine.ClassInfoAnalysisEngine.analyze(ClassInfoAnalysisEngine.java:75)
At edu.umd.cs.findbugs.classfile.engine.ClassInfoAnalysisEngine.analyze(ClassInfoAnalysisEngine.java:38)
At edu.umd.cs.findbugs.classfile.impl.AnalysisCache.getClassAnalysis(AnalysisCache.java:261)
At edu.umd.cs.findbugs.FindBugs2.buildReferencedClassSet(FindBugs2.java:806)
At edu.umd.cs.findbugs.FindBugs2.execute(FindBugs2.java:249)
At edu.umd.cs.findbugs.FindBugs.runMain(FindBugs.java:395)
At edu.umd.cs.findbugs.FindBugs2.main(FindBugs2.java:1231)
java.lang.IllegalArgumentException: Unsupported class file major version 66
at org.objectweb.asm.ClassReader.<init>(ClassReader.java:199)
at org.objectweb.asm.ClassReader.<init>(ClassReader.java:180)
at org.objectweb.asm.ClassReader.<init>(ClassReader.java:166)
at edu.umd.cs.findbugs.asm.FBClassReader.<init>(FBClassReader.java:35)
at edu.umd.cs.findbugs.classfile.engine.asm.ClassReaderAnalysisEngine.analyze(ClassReaderAnalysisEngine.java:48)
at edu.umd.cs.findbugs.classfile.engine.asm.ClassReaderAnalysisEngine.analyze(ClassReaderAnalysisEngine.java:34)
at edu.umd.cs.findbugs.classfile.impl.AnalysisCache.getClassAnalysis(AnalysisCache.java:261)
at edu.umd.cs.findbugs.classfile.engine.ClassInfoAnalysisEngine.analyze(ClassInfoAnalysisEngine.java:75)
at edu.umd.cs.findbugs.classfile.engine.ClassInfoAnalysisEngine.analyze(ClassInfoAnalysisEngine.java:38)
at edu.umd.cs.findbugs.classfile.impl.AnalysisCache.getClassAnalysis(AnalysisCache.java:261)
at edu.umd.cs.findbugs.ba.XFactory.getXClass(XFactory.java:693)
at edu.umd.cs.findbugs.ba.AnalysisContext.setAppClassList(AnalysisContext.java:975)
at edu.umd.cs.findbugs.FindBugs2.setAppClassList(FindBugs2.java:909)
at edu.umd.cs.findbugs.FindBugs2.execute(FindBugs2.java:252)
at edu.umd.cs.findbugs.FindBugs.runMain(FindBugs.java:395)
at edu.umd.cs.findbugs.FindBugs2.main(FindBugs2.java:1231)
SpotBugs ended with exit code 4
> Task :test
ParserTest > testXmlInputFactoryPropertyDefaults() FAILED
org.opentest4j.AssertionFailedError at ParserTest.java:70
ParserTest > testXmlInputFactoryPropertyOverrides() FAILED
org.opentest4j.AssertionFailedError at ParserTest.java:81
2964 tests completed, 2 failed, 170 skipped
> Task :test FAILED
FAILURE: Build failed with an exception.
* What went wrong:
Execution failed for task ':test'.
> There were failing tests. See the report at: file://<https://ci-builds.apache.org/job/POI/job/POI-XMLBeans-DSL-1.22/ws/build/reports/tests/test/index.html>
* Try:
> Run with --scan to get full insights.
Deprecated Gradle features were used in this build, making it incompatible with Gradle 9.0.
You can use '--warning-mode all' to show the individual deprecation warnings and determine if they come from your own scripts or plugins.
For more on this, please refer to https://docs.gradle.org/8.6/userguide/command_line_interface.html#sec:command_line_warnings in the Gradle documentation.
BUILD FAILED in 6m 56s
45 actionable tasks: 37 executed, 5 from cache, 3 up-to-date
Build step 'Invoke Gradle script' changed build result to FAILURE
Build step 'Invoke Gradle script' marked build as failure
ERROR: Not all environment variables could be successfully injected. Check for similarly-named environment variables.
Archiving artifacts
ERROR: Not all environment variables could be successfully injected. Check for similarly-named environment variables.
Recording test results
ERROR: Not all environment variables could be successfully injected. Check for similarly-named environment variables.
[Checks API] No suitable checks publisher found.
[SpotBugs] Skipping execution of recorder since overall result is 'FAILURE'
ERROR: Not all environment variables could be successfully injected. Check for similarly-named environment variables.
---------------------------------------------------------------------
To unsubscribe, e-mail: dev-unsubscribe@poi.apache.org
For additional commands, e-mail: dev-help@poi.apache.org
Build failed in Jenkins: POI » POI-XMLBeans-DSL-1.22 #18
Posted by Apache Jenkins Server <je...@builds.apache.org>.
See <https://ci-builds.apache.org/job/POI/job/POI-XMLBeans-DSL-1.22/18/display/redirect?page=changes>
Changes:
[PJ Fanning] [XMLBEANS-648] issue with compiling XSDs when using modularized runtimes. Thanks to Rodrigo Merino. This closes #13
------------------------------------------
[...truncated 11.49 MB...]
At edu.umd.cs.findbugs.classfile.engine.asm.ClassReaderAnalysisEngine.analyze(ClassReaderAnalysisEngine.java:48)
At edu.umd.cs.findbugs.classfile.engine.asm.ClassReaderAnalysisEngine.analyze(ClassReaderAnalysisEngine.java:34)
At edu.umd.cs.findbugs.classfile.impl.AnalysisCache.getClassAnalysis(AnalysisCache.java:261)
At edu.umd.cs.findbugs.classfile.engine.ClassInfoAnalysisEngine.analyze(ClassInfoAnalysisEngine.java:75)
At edu.umd.cs.findbugs.classfile.engine.ClassInfoAnalysisEngine.analyze(ClassInfoAnalysisEngine.java:38)
At edu.umd.cs.findbugs.classfile.impl.AnalysisCache.getClassAnalysis(AnalysisCache.java:261)
At edu.umd.cs.findbugs.ba.XFactory.getXClass(XFactory.java:693)
At edu.umd.cs.findbugs.ba.AnalysisContext.setAppClassList(AnalysisContext.java:975)
At edu.umd.cs.findbugs.FindBugs2.setAppClassList(FindBugs2.java:909)
At edu.umd.cs.findbugs.FindBugs2.execute(FindBugs2.java:252)
At edu.umd.cs.findbugs.FindBugs.runMain(FindBugs.java:395)
At edu.umd.cs.findbugs.FindBugs2.main(FindBugs2.java:1231)
Couldn't get class info for java/lang/LinkageError
java.lang.IllegalArgumentException: Unsupported class file major version 66
At org.objectweb.asm.ClassReader.<init>(ClassReader.java:199)
At org.objectweb.asm.ClassReader.<init>(ClassReader.java:180)
At org.objectweb.asm.ClassReader.<init>(ClassReader.java:166)
At edu.umd.cs.findbugs.asm.FBClassReader.<init>(FBClassReader.java:35)
At edu.umd.cs.findbugs.classfile.engine.asm.ClassReaderAnalysisEngine.analyze(ClassReaderAnalysisEngine.java:48)
At edu.umd.cs.findbugs.classfile.engine.asm.ClassReaderAnalysisEngine.analyze(ClassReaderAnalysisEngine.java:34)
At edu.umd.cs.findbugs.classfile.impl.AnalysisCache.getClassAnalysis(AnalysisCache.java:261)
At edu.umd.cs.findbugs.classfile.engine.ClassInfoAnalysisEngine.analyze(ClassInfoAnalysisEngine.java:75)
At edu.umd.cs.findbugs.classfile.engine.ClassInfoAnalysisEngine.analyze(ClassInfoAnalysisEngine.java:38)
At edu.umd.cs.findbugs.classfile.impl.AnalysisCache.getClassAnalysis(AnalysisCache.java:261)
At edu.umd.cs.findbugs.ba.XFactory.getXClass(XFactory.java:693)
At edu.umd.cs.findbugs.ba.AnalysisContext.setAppClassList(AnalysisContext.java:975)
At edu.umd.cs.findbugs.FindBugs2.setAppClassList(FindBugs2.java:909)
At edu.umd.cs.findbugs.FindBugs2.execute(FindBugs2.java:252)
At edu.umd.cs.findbugs.FindBugs.runMain(FindBugs.java:395)
At edu.umd.cs.findbugs.FindBugs2.main(FindBugs2.java:1231)
Couldn't get class info for java/io/File
java.lang.IllegalArgumentException: Unsupported class file major version 66
At org.objectweb.asm.ClassReader.<init>(ClassReader.java:199)
At org.objectweb.asm.ClassReader.<init>(ClassReader.java:180)
At org.objectweb.asm.ClassReader.<init>(ClassReader.java:166)
At edu.umd.cs.findbugs.asm.FBClassReader.<init>(FBClassReader.java:35)
At edu.umd.cs.findbugs.classfile.engine.asm.ClassReaderAnalysisEngine.analyze(ClassReaderAnalysisEngine.java:48)
At edu.umd.cs.findbugs.classfile.engine.asm.ClassReaderAnalysisEngine.analyze(ClassReaderAnalysisEngine.java:34)
At edu.umd.cs.findbugs.classfile.impl.AnalysisCache.getClassAnalysis(AnalysisCache.java:261)
At edu.umd.cs.findbugs.classfile.engine.ClassInfoAnalysisEngine.analyze(ClassInfoAnalysisEngine.java:75)
At edu.umd.cs.findbugs.classfile.engine.ClassInfoAnalysisEngine.analyze(ClassInfoAnalysisEngine.java:38)
At edu.umd.cs.findbugs.classfile.impl.AnalysisCache.getClassAnalysis(AnalysisCache.java:261)
At edu.umd.cs.findbugs.ba.XFactory.getXClass(XFactory.java:693)
At edu.umd.cs.findbugs.ba.AnalysisContext.setAppClassList(AnalysisContext.java:975)
At edu.umd.cs.findbugs.FindBugs2.setAppClassList(FindBugs2.java:909)
At edu.umd.cs.findbugs.FindBugs2.execute(FindBugs2.java:252)
At edu.umd.cs.findbugs.FindBugs.runMain(FindBugs.java:395)
At edu.umd.cs.findbugs.FindBugs2.main(FindBugs2.java:1231)
Couldn't get class info for java/nio/file/attribute/FileAttribute
java.lang.IllegalArgumentException: Unsupported class file major version 66
At org.objectweb.asm.ClassReader.<init>(ClassReader.java:199)
At org.objectweb.asm.ClassReader.<init>(ClassReader.java:180)
At org.objectweb.asm.ClassReader.<init>(ClassReader.java:166)
At edu.umd.cs.findbugs.asm.FBClassReader.<init>(FBClassReader.java:35)
At edu.umd.cs.findbugs.classfile.engine.asm.ClassReaderAnalysisEngine.analyze(ClassReaderAnalysisEngine.java:48)
At edu.umd.cs.findbugs.classfile.engine.asm.ClassReaderAnalysisEngine.analyze(ClassReaderAnalysisEngine.java:34)
At edu.umd.cs.findbugs.classfile.impl.AnalysisCache.getClassAnalysis(AnalysisCache.java:261)
At edu.umd.cs.findbugs.classfile.engine.ClassInfoAnalysisEngine.analyze(ClassInfoAnalysisEngine.java:75)
At edu.umd.cs.findbugs.classfile.engine.ClassInfoAnalysisEngine.analyze(ClassInfoAnalysisEngine.java:38)
At edu.umd.cs.findbugs.classfile.impl.AnalysisCache.getClassAnalysis(AnalysisCache.java:261)
At edu.umd.cs.findbugs.ba.XFactory.getXClass(XFactory.java:693)
At edu.umd.cs.findbugs.ba.AnalysisContext.setAppClassList(AnalysisContext.java:975)
At edu.umd.cs.findbugs.FindBugs2.setAppClassList(FindBugs2.java:909)
At edu.umd.cs.findbugs.FindBugs2.execute(FindBugs2.java:252)
At edu.umd.cs.findbugs.FindBugs.runMain(FindBugs.java:395)
At edu.umd.cs.findbugs.FindBugs2.main(FindBugs2.java:1231)
Couldn't get class info for java/util/Calendar
java.lang.IllegalArgumentException: Unsupported class file major version 66
At org.objectweb.asm.ClassReader.<init>(ClassReader.java:199)
At org.objectweb.asm.ClassReader.<init>(ClassReader.java:180)
At org.objectweb.asm.ClassReader.<init>(ClassReader.java:166)
At edu.umd.cs.findbugs.asm.FBClassReader.<init>(FBClassReader.java:35)
At edu.umd.cs.findbugs.classfile.engine.asm.ClassReaderAnalysisEngine.analyze(ClassReaderAnalysisEngine.java:48)
At edu.umd.cs.findbugs.classfile.engine.asm.ClassReaderAnalysisEngine.analyze(ClassReaderAnalysisEngine.java:34)
At edu.umd.cs.findbugs.classfile.impl.AnalysisCache.getClassAnalysis(AnalysisCache.java:261)
At edu.umd.cs.findbugs.classfile.engine.ClassInfoAnalysisEngine.analyze(ClassInfoAnalysisEngine.java:75)
At edu.umd.cs.findbugs.classfile.engine.ClassInfoAnalysisEngine.analyze(ClassInfoAnalysisEngine.java:38)
At edu.umd.cs.findbugs.classfile.impl.AnalysisCache.getClassAnalysis(AnalysisCache.java:261)
At edu.umd.cs.findbugs.ba.XFactory.getXClass(XFactory.java:693)
At edu.umd.cs.findbugs.ba.AnalysisContext.setAppClassList(AnalysisContext.java:975)
At edu.umd.cs.findbugs.FindBugs2.setAppClassList(FindBugs2.java:909)
At edu.umd.cs.findbugs.FindBugs2.execute(FindBugs2.java:252)
At edu.umd.cs.findbugs.FindBugs.runMain(FindBugs.java:395)
At edu.umd.cs.findbugs.FindBugs2.main(FindBugs2.java:1231)
Couldn't get class info for java/util/Random
java.lang.IllegalArgumentException: Unsupported class file major version 66
At org.objectweb.asm.ClassReader.<init>(ClassReader.java:199)
At org.objectweb.asm.ClassReader.<init>(ClassReader.java:180)
At org.objectweb.asm.ClassReader.<init>(ClassReader.java:166)
At edu.umd.cs.findbugs.asm.FBClassReader.<init>(FBClassReader.java:35)
At edu.umd.cs.findbugs.classfile.engine.asm.ClassReaderAnalysisEngine.analyze(ClassReaderAnalysisEngine.java:48)
At edu.umd.cs.findbugs.classfile.engine.asm.ClassReaderAnalysisEngine.analyze(ClassReaderAnalysisEngine.java:34)
At edu.umd.cs.findbugs.classfile.impl.AnalysisCache.getClassAnalysis(AnalysisCache.java:261)
At edu.umd.cs.findbugs.classfile.engine.ClassInfoAnalysisEngine.analyze(ClassInfoAnalysisEngine.java:75)
At edu.umd.cs.findbugs.classfile.engine.ClassInfoAnalysisEngine.analyze(ClassInfoAnalysisEngine.java:38)
At edu.umd.cs.findbugs.classfile.impl.AnalysisCache.getClassAnalysis(AnalysisCache.java:261)
At edu.umd.cs.findbugs.ba.XFactory.getXClass(XFactory.java:693)
At edu.umd.cs.findbugs.ba.AnalysisContext.setAppClassList(AnalysisContext.java:975)
At edu.umd.cs.findbugs.FindBugs2.setAppClassList(FindBugs2.java:909)
At edu.umd.cs.findbugs.FindBugs2.execute(FindBugs2.java:252)
At edu.umd.cs.findbugs.FindBugs.runMain(FindBugs.java:395)
At edu.umd.cs.findbugs.FindBugs2.main(FindBugs2.java:1231)
Couldn't get class info for java/util/Locale
java.lang.IllegalArgumentException: Unsupported class file major version 66
At org.objectweb.asm.ClassReader.<init>(ClassReader.java:199)
At org.objectweb.asm.ClassReader.<init>(ClassReader.java:180)
At org.objectweb.asm.ClassReader.<init>(ClassReader.java:166)
At edu.umd.cs.findbugs.asm.FBClassReader.<init>(FBClassReader.java:35)
At edu.umd.cs.findbugs.classfile.engine.asm.ClassReaderAnalysisEngine.analyze(ClassReaderAnalysisEngine.java:48)
At edu.umd.cs.findbugs.classfile.engine.asm.ClassReaderAnalysisEngine.analyze(ClassReaderAnalysisEngine.java:34)
At edu.umd.cs.findbugs.classfile.impl.AnalysisCache.getClassAnalysis(AnalysisCache.java:261)
At edu.umd.cs.findbugs.classfile.engine.ClassInfoAnalysisEngine.analyze(ClassInfoAnalysisEngine.java:75)
At edu.umd.cs.findbugs.classfile.engine.ClassInfoAnalysisEngine.analyze(ClassInfoAnalysisEngine.java:38)
At edu.umd.cs.findbugs.classfile.impl.AnalysisCache.getClassAnalysis(AnalysisCache.java:261)
At edu.umd.cs.findbugs.ba.XFactory.getXClass(XFactory.java:693)
At edu.umd.cs.findbugs.ba.AnalysisContext.setAppClassList(AnalysisContext.java:975)
At edu.umd.cs.findbugs.FindBugs2.setAppClassList(FindBugs2.java:909)
At edu.umd.cs.findbugs.FindBugs2.execute(FindBugs2.java:252)
At edu.umd.cs.findbugs.FindBugs.runMain(FindBugs.java:395)
At edu.umd.cs.findbugs.FindBugs2.main(FindBugs2.java:1231)
Couldn't get class info for java/lang/AssertionError
java.lang.IllegalArgumentException: Unsupported class file major version 66
At org.objectweb.asm.ClassReader.<init>(ClassReader.java:199)
At org.objectweb.asm.ClassReader.<init>(ClassReader.java:180)
At org.objectweb.asm.ClassReader.<init>(ClassReader.java:166)
At edu.umd.cs.findbugs.asm.FBClassReader.<init>(FBClassReader.java:35)
At edu.umd.cs.findbugs.classfile.engine.asm.ClassReaderAnalysisEngine.analyze(ClassReaderAnalysisEngine.java:48)
At edu.umd.cs.findbugs.classfile.engine.asm.ClassReaderAnalysisEngine.analyze(ClassReaderAnalysisEngine.java:34)
At edu.umd.cs.findbugs.classfile.impl.AnalysisCache.getClassAnalysis(AnalysisCache.java:261)
At edu.umd.cs.findbugs.classfile.engine.ClassInfoAnalysisEngine.analyze(ClassInfoAnalysisEngine.java:75)
At edu.umd.cs.findbugs.classfile.engine.ClassInfoAnalysisEngine.analyze(ClassInfoAnalysisEngine.java:38)
At edu.umd.cs.findbugs.classfile.impl.AnalysisCache.getClassAnalysis(AnalysisCache.java:261)
At edu.umd.cs.findbugs.ba.XFactory.getXClass(XFactory.java:693)
At edu.umd.cs.findbugs.ba.AnalysisContext.setAppClassList(AnalysisContext.java:975)
At edu.umd.cs.findbugs.FindBugs2.setAppClassList(FindBugs2.java:909)
At edu.umd.cs.findbugs.FindBugs2.execute(FindBugs2.java:252)
At edu.umd.cs.findbugs.FindBugs.runMain(FindBugs.java:395)
At edu.umd.cs.findbugs.FindBugs2.main(FindBugs2.java:1231)
Couldn't get class info for java/lang/NoSuchFieldException
java.lang.IllegalArgumentException: Unsupported class file major version 66
At org.objectweb.asm.ClassReader.<init>(ClassReader.java:199)
At org.objectweb.asm.ClassReader.<init>(ClassReader.java:180)
At org.objectweb.asm.ClassReader.<init>(ClassReader.java:166)
At edu.umd.cs.findbugs.asm.FBClassReader.<init>(FBClassReader.java:35)
At edu.umd.cs.findbugs.classfile.engine.asm.ClassReaderAnalysisEngine.analyze(ClassReaderAnalysisEngine.java:48)
At edu.umd.cs.findbugs.classfile.engine.asm.ClassReaderAnalysisEngine.analyze(ClassReaderAnalysisEngine.java:34)
At edu.umd.cs.findbugs.classfile.impl.AnalysisCache.getClassAnalysis(AnalysisCache.java:261)
At edu.umd.cs.findbugs.classfile.engine.ClassInfoAnalysisEngine.analyze(ClassInfoAnalysisEngine.java:75)
At edu.umd.cs.findbugs.classfile.engine.ClassInfoAnalysisEngine.analyze(ClassInfoAnalysisEngine.java:38)
At edu.umd.cs.findbugs.classfile.impl.AnalysisCache.getClassAnalysis(AnalysisCache.java:261)
At edu.umd.cs.findbugs.ba.XFactory.getXClass(XFactory.java:693)
At edu.umd.cs.findbugs.ba.AnalysisContext.setAppClassList(AnalysisContext.java:975)
At edu.umd.cs.findbugs.FindBugs2.setAppClassList(FindBugs2.java:909)
At edu.umd.cs.findbugs.FindBugs2.execute(FindBugs2.java:252)
At edu.umd.cs.findbugs.FindBugs.runMain(FindBugs.java:395)
At edu.umd.cs.findbugs.FindBugs2.main(FindBugs2.java:1231)
Couldn't get class info for java/util/Set
java.lang.IllegalArgumentException: Unsupported class file major version 66
At org.objectweb.asm.ClassReader.<init>(ClassReader.java:199)
At org.objectweb.asm.ClassReader.<init>(ClassReader.java:180)
At org.objectweb.asm.ClassReader.<init>(ClassReader.java:166)
At edu.umd.cs.findbugs.asm.FBClassReader.<init>(FBClassReader.java:35)
At edu.umd.cs.findbugs.classfile.engine.asm.ClassReaderAnalysisEngine.analyze(ClassReaderAnalysisEngine.java:48)
At edu.umd.cs.findbugs.classfile.engine.asm.ClassReaderAnalysisEngine.analyze(ClassReaderAnalysisEngine.java:34)
At edu.umd.cs.findbugs.classfile.impl.AnalysisCache.getClassAnalysis(AnalysisCache.java:261)
At edu.umd.cs.findbugs.classfile.engine.ClassInfoAnalysisEngine.analyze(ClassInfoAnalysisEngine.java:75)
At edu.umd.cs.findbugs.classfile.engine.ClassInfoAnalysisEngine.analyze(ClassInfoAnalysisEngine.java:38)
At edu.umd.cs.findbugs.classfile.impl.AnalysisCache.getClassAnalysis(AnalysisCache.java:261)
At edu.umd.cs.findbugs.ba.XFactory.getXClass(XFactory.java:693)
At edu.umd.cs.findbugs.ba.AnalysisContext.setAppClassList(AnalysisContext.java:975)
At edu.umd.cs.findbugs.FindBugs2.setAppClassList(FindBugs2.java:909)
At edu.umd.cs.findbugs.FindBugs2.execute(FindBugs2.java:252)
At edu.umd.cs.findbugs.FindBugs.runMain(FindBugs.java:395)
At edu.umd.cs.findbugs.FindBugs2.main(FindBugs2.java:1231)
Couldn't get class info for javax/xml/stream/util/StreamReaderDelegate
java.lang.IllegalArgumentException: Unsupported class file major version 66
At org.objectweb.asm.ClassReader.<init>(ClassReader.java:199)
At org.objectweb.asm.ClassReader.<init>(ClassReader.java:180)
At org.objectweb.asm.ClassReader.<init>(ClassReader.java:166)
At edu.umd.cs.findbugs.asm.FBClassReader.<init>(FBClassReader.java:35)
At edu.umd.cs.findbugs.classfile.engine.asm.ClassReaderAnalysisEngine.analyze(ClassReaderAnalysisEngine.java:48)
At edu.umd.cs.findbugs.classfile.engine.asm.ClassReaderAnalysisEngine.analyze(ClassReaderAnalysisEngine.java:34)
At edu.umd.cs.findbugs.classfile.impl.AnalysisCache.getClassAnalysis(AnalysisCache.java:261)
At edu.umd.cs.findbugs.classfile.engine.ClassInfoAnalysisEngine.analyze(ClassInfoAnalysisEngine.java:75)
At edu.umd.cs.findbugs.classfile.engine.ClassInfoAnalysisEngine.analyze(ClassInfoAnalysisEngine.java:38)
At edu.umd.cs.findbugs.classfile.impl.AnalysisCache.getClassAnalysis(AnalysisCache.java:261)
At edu.umd.cs.findbugs.FindBugs2.buildReferencedClassSet(FindBugs2.java:806)
At edu.umd.cs.findbugs.FindBugs2.execute(FindBugs2.java:249)
At edu.umd.cs.findbugs.FindBugs.runMain(FindBugs.java:395)
At edu.umd.cs.findbugs.FindBugs2.main(FindBugs2.java:1231)
java.lang.IllegalArgumentException: Unsupported class file major version 66
at org.objectweb.asm.ClassReader.<init>(ClassReader.java:199)
at org.objectweb.asm.ClassReader.<init>(ClassReader.java:180)
at org.objectweb.asm.ClassReader.<init>(ClassReader.java:166)
at edu.umd.cs.findbugs.asm.FBClassReader.<init>(FBClassReader.java:35)
at edu.umd.cs.findbugs.classfile.engine.asm.ClassReaderAnalysisEngine.analyze(ClassReaderAnalysisEngine.java:48)
at edu.umd.cs.findbugs.classfile.engine.asm.ClassReaderAnalysisEngine.analyze(ClassReaderAnalysisEngine.java:34)
at edu.umd.cs.findbugs.classfile.impl.AnalysisCache.getClassAnalysis(AnalysisCache.java:261)
at edu.umd.cs.findbugs.classfile.engine.ClassInfoAnalysisEngine.analyze(ClassInfoAnalysisEngine.java:75)
at edu.umd.cs.findbugs.classfile.engine.ClassInfoAnalysisEngine.analyze(ClassInfoAnalysisEngine.java:38)
at edu.umd.cs.findbugs.classfile.impl.AnalysisCache.getClassAnalysis(AnalysisCache.java:261)
at edu.umd.cs.findbugs.ba.XFactory.getXClass(XFactory.java:693)
at edu.umd.cs.findbugs.ba.AnalysisContext.setAppClassList(AnalysisContext.java:975)
at edu.umd.cs.findbugs.FindBugs2.setAppClassList(FindBugs2.java:909)
at edu.umd.cs.findbugs.FindBugs2.execute(FindBugs2.java:252)
at edu.umd.cs.findbugs.FindBugs.runMain(FindBugs.java:395)
at edu.umd.cs.findbugs.FindBugs2.main(FindBugs2.java:1231)
SpotBugs ended with exit code 4
> Task :test
ParserTest > testXmlInputFactoryPropertyDefaults() FAILED
org.opentest4j.AssertionFailedError at ParserTest.java:70
ParserTest > testXmlInputFactoryPropertyOverrides() FAILED
org.opentest4j.AssertionFailedError at ParserTest.java:81
2964 tests completed, 2 failed, 170 skipped
> Task :test FAILED
FAILURE: Build failed with an exception.
* What went wrong:
Execution failed for task ':test'.
> There were failing tests. See the report at: file://<https://ci-builds.apache.org/job/POI/job/POI-XMLBeans-DSL-1.22/ws/build/reports/tests/test/index.html>
* Try:
> Run with --scan to get full insights.
Deprecated Gradle features were used in this build, making it incompatible with Gradle 9.0.
You can use '--warning-mode all' to show the individual deprecation warnings and determine if they come from your own scripts or plugins.
For more on this, please refer to https://docs.gradle.org/8.6/userguide/command_line_interface.html#sec:command_line_warnings in the Gradle documentation.
BUILD FAILED in 7m 21s
45 actionable tasks: 43 executed, 2 from cache
Build step 'Invoke Gradle script' changed build result to FAILURE
Build step 'Invoke Gradle script' marked build as failure
ERROR: Not all environment variables could be successfully injected. Check for similarly-named environment variables.
Archiving artifacts
ERROR: Not all environment variables could be successfully injected. Check for similarly-named environment variables.
Recording test results
ERROR: Not all environment variables could be successfully injected. Check for similarly-named environment variables.
[Checks API] No suitable checks publisher found.
[SpotBugs] Skipping execution of recorder since overall result is 'FAILURE'
ERROR: Not all environment variables could be successfully injected. Check for similarly-named environment variables.
---------------------------------------------------------------------
To unsubscribe, e-mail: dev-unsubscribe@poi.apache.org
For additional commands, e-mail: dev-help@poi.apache.org
Build failed in Jenkins: POI » POI-XMLBeans-DSL-1.22 #17
Posted by Apache Jenkins Server <je...@builds.apache.org>.
See <https://ci-builds.apache.org/job/POI/job/POI-XMLBeans-DSL-1.22/17/display/redirect?page=changes>
Changes:
[PJ Fanning] gradle upgrade
[PJ Fanning] log4j upgrade
[PJ Fanning] commons-io upgrade
------------------------------------------
[...truncated 169.08 KB...]
A test/perf/bin/run_jaxb2.bat
A test/perf/bin/run_all.bat
A test/perf/bin/run_all_nonmemory.bat
A test/perf/bin/jaxb2.bat
A test/perf/bin/xerces.sh
A test/perf/bin/castor.sh
A test/perf/bin/jaxb.bat
A test/perf/bin/run_xmlbeans_all.bat
A test/perf/bin/jaxb.sh
A test/perf/bin/xerces.bat
AU test/perf/bin/castor.bat
A test/perf/bin/run_xmlbeans_nonmemory.bat
A test/perf/bin/run_svn.bat
A test/perf/bin/run_svn_nonmemory.bat
A test/perf/bin/run_svn.sh
A test/perf/bin/run_v1_nonmemory.bat
A test/perf/bin/run_v2_nonmemory.bat
A test/perf/bin/run_xerces_nonmemory.bat
A test/perf/bin/run_all.sh
A test/perf/bin/run_v2.sh
A test/perf/bin/run_v1.bat
A test/perf/bin/run_v2.bat
A test/perf/bin/run_jaxb.sh
A test/perf/bin/run_xerces.bat
A test/perf/bin/run_v1.sh
A test/perf/bin/run_castor.bat
A test/perf/bin/run_xerces.sh
A test/perf/bin/run_castor.sh
A test/perf/bin/run_jaxb.bat
A test/perf/bin/v1.sh
A test/perf/bin/jibx.sh
A test/perf/bin/run_jibx.bat
AU test/perf/bin/v1.bat
AU test/perf/bin/jibx.bat
A test/perf/bin/castor.properties
A test/perf/bin/run_jibx.sh
A test/perf/download.properties
A test/perf/cases
AU test/perf/cases/parser_instances.zip
A test/perf/cases/xsd
A test/perf/cases/xsd/non-primitives.xsd
A test/perf/cases/xsd/purchase-order-1.xml
A test/perf/cases/xsd/purchase-order.xsd
A test/perf/cases/xsd/purchase-order-2.xml
A test/perf/cases/xsd/purchase-order-3.xml
A test/perf/cases/xsd/doc.xsd
A test/perf/cases/xsd/purchase-order-4.xml
A test/perf/cases/xsd/purchase-order-5.xml
A test/perf/cases/xsd/purchase-order-6.xml
A test/perf/cases/xsd/purchase-order-7.xml
A test/perf/cases/xsd/purchase-order-jibxbinding.xml
A test/perf/cases/xsd/perf-results.xsd
A test/perf/cases/xsd/primitives.xsd
A test/perf/results.xml
AU test/perf/env.sh
AU test/perf/env.bat
A test/docs
AU test/docs/BuildingAndRunningTests.txt
AU test/docs/TestOrganization.txt
AU test/readme.txt
AU STATUS
A release-guide.txt
AU LICENSE.txt
A .github
A .github/workflows
A .github/workflows/test-gradle.yml
A .github/workflows/codeql-analysis.yml
A wrapper.gradle
AU NOTICE.txt
AU NOTICE-binary.txt
A legal
A legal/HEADER
A KEYS
A settings.gradle
A SECURITY.md
A CHANGES.txt
A .gitignore
AU xbeanenv.sh
AU xbeanenv.cmd
U .
At revision 1916365
ERROR: Not all environment variables could be successfully injected. Check for similarly-named environment variables.
[POI-XMLBeans-DSL-1.22] $ /bin/sh -xe /tmp/jenkins9378919060198186764.sh
+ rm -rf examples excelant integrationtest main ooxml ooxml-schema scratchpad build.javacheck.xml
+ svn status
+ svn revert poi*/src/*/java9/module-info.*
svn: E155010: The node '<https://ci-builds.apache.org/job/POI/job/POI-XMLBeans-DSL-1.22/ws/poi*/src/*'> was not found.
+ true
+ svn revert src/resources/ooxml-lite-report.*
Skipped 'src/resources/ooxml-lite-report.*'
+ echo Java-Home: /home/jenkins/tools/java/latest22
Java-Home: /home/jenkins/tools/java/latest22
+ ls -al /home/jenkins/tools/java/latest22/
total 36
drwxr-xr-x 8 root root 4096 Nov 13 21:50 .
drwxrwxr-x 39 root root 4096 Feb 8 19:07 ..
drwxr-xr-x 2 root root 4096 Nov 13 21:50 bin
drwxr-xr-x 5 root root 4096 Nov 13 21:50 conf
drwxr-xr-x 3 root root 4096 Nov 13 21:50 include
drwxr-xr-x 2 root root 4096 Nov 13 21:50 jmods
drwxr-xr-x 71 root root 4096 Nov 13 21:50 legal
drwxr-xr-x 5 root root 4096 Nov 13 21:50 lib
-rw-r--r-- 1 root root 1220 Oct 18 14:34 release
+ ls -al /home/jenkins/tools/java/latest22/bin
total 472
drwxr-xr-x 2 root root 4096 Nov 13 21:50 .
drwxr-xr-x 8 root root 4096 Nov 13 21:50 ..
-rwxr-xr-x 1 root root 12384 Oct 18 14:34 jar
-rwxr-xr-x 1 root root 12392 Oct 18 14:34 jarsigner
-rwxr-xr-x 1 root root 12328 Oct 18 14:34 java
-rwxr-xr-x 1 root root 12416 Oct 18 14:34 javac
-rwxr-xr-x 1 root root 12424 Oct 18 14:34 javadoc
-rwxr-xr-x 1 root root 12384 Oct 18 14:34 javap
-rwxr-xr-x 1 root root 12384 Oct 18 14:34 jcmd
-rwxr-xr-x 1 root root 12456 Oct 18 14:34 jconsole
-rwxr-xr-x 1 root root 12384 Oct 18 14:34 jdb
-rwxr-xr-x 1 root root 12392 Oct 18 14:34 jdeprscan
-rwxr-xr-x 1 root root 12384 Oct 18 14:34 jdeps
-rwxr-xr-x 1 root root 12384 Oct 18 14:34 jfr
-rwxr-xr-x 1 root root 12384 Oct 18 14:34 jhsdb
-rwxr-xr-x 1 root root 12392 Oct 18 14:34 jimage
-rwxr-xr-x 1 root root 12416 Oct 18 14:34 jinfo
-rwxr-xr-x 1 root root 12416 Oct 18 14:34 jlink
-rwxr-xr-x 1 root root 12416 Oct 18 14:34 jmap
-rwxr-xr-x 1 root root 12384 Oct 18 14:34 jmod
-rwxr-xr-x 1 root root 12392 Oct 18 14:34 jpackage
-rwxr-xr-x 1 root root 12384 Oct 18 14:34 jps
-rwxr-xr-x 1 root root 12424 Oct 18 14:34 jrunscript
-rwxr-xr-x 1 root root 12392 Oct 18 14:34 jshell
-rwxr-xr-x 1 root root 12424 Oct 18 14:34 jstack
-rwxr-xr-x 1 root root 12384 Oct 18 14:34 jstat
-rwxr-xr-x 1 root root 12392 Oct 18 14:34 jstatd
-rwxr-xr-x 1 root root 12392 Oct 18 14:34 jwebserver
-rwxr-xr-x 1 root root 12392 Oct 18 14:34 keytool
-rwxr-xr-x 1 root root 12416 Oct 18 14:34 rmiregistry
-rwxr-xr-x 1 root root 12392 Oct 18 14:34 serialver
+ /home/jenkins/tools/java/latest22/bin/java -version
openjdk version "22-ea" 2024-03-19
OpenJDK Runtime Environment (build 22-ea+20-1570)
OpenJDK 64-Bit Server VM (build 22-ea+20-1570, mixed mode, sharing)
+ echo which java
which java
+ which java
/home/jenkins/tools/java/latest22/bin/java
+ java -version
openjdk version "22-ea" 2024-03-19
OpenJDK Runtime Environment (build 22-ea+20-1570)
OpenJDK 64-Bit Server VM (build 22-ea+20-1570, mixed mode, sharing)
+ echo which javac
which javac
+ which javac
/home/jenkins/tools/java/latest22/bin/javac
+ javac -version
javac 22-ea
+ echo Ant-Home:
Ant-Home:
+ ls -al
total 412
drwxr-xr-x 10 jenkins jenkins 4096 Mar 17 11:52 .
drwxr-xr-x 5 jenkins jenkins 4096 Mar 17 11:52 ..
-rw-r--r-- 1 jenkins jenkins 29242 Mar 17 11:52 build.gradle
-rw-r--r-- 1 jenkins jenkins 54123 Mar 17 11:52 build.xml
-rw-r--r-- 1 jenkins jenkins 11963 Mar 17 11:52 CHANGES.txt
drwxr-xr-x 3 jenkins jenkins 4096 Mar 17 11:52 .github
-rw-r--r-- 1 jenkins jenkins 14 Mar 17 11:52 .gitignore
drwxr-xr-x 3 jenkins jenkins 4096 Mar 17 11:52 gradle
-rw-r--r-- 1 jenkins jenkins 1338 Mar 17 11:52 gradle.properties
-rwxr-xr-x 1 jenkins jenkins 9177 Mar 17 11:52 gradlew
-rw-r--r-- 1 jenkins jenkins 176157 Mar 17 11:52 KEYS
drwxr-xr-x 2 jenkins jenkins 4096 Mar 17 11:52 legal
-rwxr-xr-x 1 jenkins jenkins 12458 Mar 17 11:52 LICENSE-binary.txt
-rwxr-xr-x 1 jenkins jenkins 11884 Mar 17 11:52 LICENSE.txt
-rw-r--r-- 1 jenkins jenkins 2561 Mar 17 11:52 NOTICE-binary.txt
-rw-r--r-- 1 jenkins jenkins 1592 Mar 17 11:52 NOTICE.txt
-rw-r--r-- 1 jenkins jenkins 2227 Mar 17 11:52 README.txt
-rw-r--r-- 1 jenkins jenkins 10995 Mar 17 11:52 release-guide.txt
drwxr-xr-x 16 jenkins jenkins 4096 Mar 17 11:52 samples
-rw-r--r-- 1 jenkins jenkins 238 Mar 17 11:52 SECURITY.md
-rw-r--r-- 1 jenkins jenkins 661 Mar 17 11:52 settings.gradle
drwxr-xr-x 4 jenkins jenkins 4096 Mar 17 11:52 src
-rw-r--r-- 1 jenkins jenkins 359 Mar 17 11:52 STATUS
drwxr-xr-x 4 jenkins jenkins 4096 Mar 17 11:52 .svn
drwxr-xr-x 4 jenkins jenkins 4096 Mar 17 11:52 test
-rw-r--r-- 1 jenkins jenkins 3803 Mar 17 11:52 wrapper.gradle
-rw-r--r-- 1 jenkins jenkins 25 Mar 17 11:52 xbeanenv.cmd
-rwxr-xr-x 1 jenkins jenkins 27 Mar 17 11:52 xbeanenv.sh
drwxr-xr-x 2 jenkins jenkins 4096 Mar 17 11:52 xkit
+ echo which ant
which ant
+ which ant
/usr/bin/ant
+ ant -version
Apache Ant(TM) version 1.10.12 compiled on January 17 1970
+ echo <project default="test"><target name="test"><echo>Java ${ant.java.version}/${java.version}</echo><exec executable="javac"><arg value="-version"/></exec></target></project>
+ ant -f build.javacheck.xml -v
Apache Ant(TM) version 1.10.12 compiled on January 17 1970
Buildfile: <https://ci-builds.apache.org/job/POI/job/POI-XMLBeans-DSL-1.22/ws/build.javacheck.xml>
Detected Java version: 22 in: /usr/local/asfpackages/java/openjdk-22-ea+20
Detected OS: Linux
parsing buildfile <https://ci-builds.apache.org/job/POI/job/POI-XMLBeans-DSL-1.22/ws/build.javacheck.xml> with URI = <https://ci-builds.apache.org/job/POI/job/POI-XMLBeans-DSL-1.22/ws/build.javacheck.xml>
Project base dir set to: <https://ci-builds.apache.org/job/POI/job/POI-XMLBeans-DSL-1.22/ws/>
Build sequence for target(s) `test' is [test]
Complete build sequence is [test, ]
test:
parsing buildfile jar:file:/usr/share/ant/lib/ant.jar!/org/apache/tools/ant/antlib.xml with URI = jar:file:/usr/share/ant/lib/ant.jar!/org/apache/tools/ant/antlib.xml from a zip file
[echo] Java 22/22-ea
[exec] Current OS is Linux
[exec] Executing 'javac' with arguments:
[exec] '-version'
[exec]
[exec] The ' characters around the executable and arguments are
[exec] not part of the command.
[exec] javac 22-ea
BUILD SUCCESSFUL
Total time: 0 seconds
+ exit 0
[Gradle] - Launching build.
ERROR: Not all environment variables could be successfully injected. Check for similarly-named environment variables.
[POI-XMLBeans-DSL-1.22] $ <https://ci-builds.apache.org/job/POI/job/POI-XMLBeans-DSL-1.22/ws/gradlew> clean jenkins jacocoTestReport
To honour the JVM settings for this build a single-use Daemon process will be forked. For more on this, please refer to https://docs.gradle.org/8.6/userguide/gradle_daemon.html#sec:disabling_the_daemon in the Gradle documentation.
Daemon will be stopped at the end of the build
Configuration on demand is an incubating feature.
FAILURE: Build failed with an exception.
* What went wrong:
Could not open settings generic class cache for settings file '<https://ci-builds.apache.org/job/POI/job/POI-XMLBeans-DSL-1.22/ws/settings.gradle'> (/home/jenkins/.gradle/caches/8.6/scripts/f1vtb3f18o718s5f2prqhsmqz).
> BUG! exception in phase 'semantic analysis' in source unit '_BuildScript_' Unsupported class file major version 66
* Try:
> Run with --stacktrace option to get the stack trace.
> Run with --info or --debug option to get more log output.
> Run with --scan to get full insights.
> Get more help at https://help.gradle.org.
BUILD FAILED in 7s
Build step 'Invoke Gradle script' changed build result to FAILURE
Build step 'Invoke Gradle script' marked build as failure
ERROR: Not all environment variables could be successfully injected. Check for similarly-named environment variables.
Archiving artifacts
ERROR: Not all environment variables could be successfully injected. Check for similarly-named environment variables.
Recording test results
ERROR: Not all environment variables could be successfully injected. Check for similarly-named environment variables.
ERROR: Step ‘Publish JUnit test result report’ failed: No test report files were found. Configuration error?
[SpotBugs] Skipping execution of recorder since overall result is 'FAILURE'
ERROR: Not all environment variables could be successfully injected. Check for similarly-named environment variables.
---------------------------------------------------------------------
To unsubscribe, e-mail: dev-unsubscribe@poi.apache.org
For additional commands, e-mail: dev-help@poi.apache.org
Build failed in Jenkins: POI » POI-XMLBeans-DSL-1.22 #16
Posted by Apache Jenkins Server <je...@builds.apache.org>.
See <https://ci-builds.apache.org/job/POI/job/POI-XMLBeans-DSL-1.22/16/display/redirect?page=changes>
Changes:
[PJ Fanning] add logic back to gradlew to download the wrapper jar
[PJ Fanning] gradle 8.6
------------------------------------------
[...truncated 11.49 MB...]
At edu.umd.cs.findbugs.classfile.engine.asm.ClassReaderAnalysisEngine.analyze(ClassReaderAnalysisEngine.java:48)
At edu.umd.cs.findbugs.classfile.engine.asm.ClassReaderAnalysisEngine.analyze(ClassReaderAnalysisEngine.java:34)
At edu.umd.cs.findbugs.classfile.impl.AnalysisCache.getClassAnalysis(AnalysisCache.java:261)
At edu.umd.cs.findbugs.classfile.engine.ClassInfoAnalysisEngine.analyze(ClassInfoAnalysisEngine.java:75)
At edu.umd.cs.findbugs.classfile.engine.ClassInfoAnalysisEngine.analyze(ClassInfoAnalysisEngine.java:38)
At edu.umd.cs.findbugs.classfile.impl.AnalysisCache.getClassAnalysis(AnalysisCache.java:261)
At edu.umd.cs.findbugs.ba.XFactory.getXClass(XFactory.java:693)
At edu.umd.cs.findbugs.ba.AnalysisContext.setAppClassList(AnalysisContext.java:975)
At edu.umd.cs.findbugs.FindBugs2.setAppClassList(FindBugs2.java:909)
At edu.umd.cs.findbugs.FindBugs2.execute(FindBugs2.java:252)
At edu.umd.cs.findbugs.FindBugs.runMain(FindBugs.java:395)
At edu.umd.cs.findbugs.FindBugs2.main(FindBugs2.java:1231)
Couldn't get class info for java/lang/LinkageError
java.lang.IllegalArgumentException: Unsupported class file major version 66
At org.objectweb.asm.ClassReader.<init>(ClassReader.java:199)
At org.objectweb.asm.ClassReader.<init>(ClassReader.java:180)
At org.objectweb.asm.ClassReader.<init>(ClassReader.java:166)
At edu.umd.cs.findbugs.asm.FBClassReader.<init>(FBClassReader.java:35)
At edu.umd.cs.findbugs.classfile.engine.asm.ClassReaderAnalysisEngine.analyze(ClassReaderAnalysisEngine.java:48)
At edu.umd.cs.findbugs.classfile.engine.asm.ClassReaderAnalysisEngine.analyze(ClassReaderAnalysisEngine.java:34)
At edu.umd.cs.findbugs.classfile.impl.AnalysisCache.getClassAnalysis(AnalysisCache.java:261)
At edu.umd.cs.findbugs.classfile.engine.ClassInfoAnalysisEngine.analyze(ClassInfoAnalysisEngine.java:75)
At edu.umd.cs.findbugs.classfile.engine.ClassInfoAnalysisEngine.analyze(ClassInfoAnalysisEngine.java:38)
At edu.umd.cs.findbugs.classfile.impl.AnalysisCache.getClassAnalysis(AnalysisCache.java:261)
At edu.umd.cs.findbugs.ba.XFactory.getXClass(XFactory.java:693)
At edu.umd.cs.findbugs.ba.AnalysisContext.setAppClassList(AnalysisContext.java:975)
At edu.umd.cs.findbugs.FindBugs2.setAppClassList(FindBugs2.java:909)
At edu.umd.cs.findbugs.FindBugs2.execute(FindBugs2.java:252)
At edu.umd.cs.findbugs.FindBugs.runMain(FindBugs.java:395)
At edu.umd.cs.findbugs.FindBugs2.main(FindBugs2.java:1231)
Couldn't get class info for java/io/File
java.lang.IllegalArgumentException: Unsupported class file major version 66
At org.objectweb.asm.ClassReader.<init>(ClassReader.java:199)
At org.objectweb.asm.ClassReader.<init>(ClassReader.java:180)
At org.objectweb.asm.ClassReader.<init>(ClassReader.java:166)
At edu.umd.cs.findbugs.asm.FBClassReader.<init>(FBClassReader.java:35)
At edu.umd.cs.findbugs.classfile.engine.asm.ClassReaderAnalysisEngine.analyze(ClassReaderAnalysisEngine.java:48)
At edu.umd.cs.findbugs.classfile.engine.asm.ClassReaderAnalysisEngine.analyze(ClassReaderAnalysisEngine.java:34)
At edu.umd.cs.findbugs.classfile.impl.AnalysisCache.getClassAnalysis(AnalysisCache.java:261)
At edu.umd.cs.findbugs.classfile.engine.ClassInfoAnalysisEngine.analyze(ClassInfoAnalysisEngine.java:75)
At edu.umd.cs.findbugs.classfile.engine.ClassInfoAnalysisEngine.analyze(ClassInfoAnalysisEngine.java:38)
At edu.umd.cs.findbugs.classfile.impl.AnalysisCache.getClassAnalysis(AnalysisCache.java:261)
At edu.umd.cs.findbugs.ba.XFactory.getXClass(XFactory.java:693)
At edu.umd.cs.findbugs.ba.AnalysisContext.setAppClassList(AnalysisContext.java:975)
At edu.umd.cs.findbugs.FindBugs2.setAppClassList(FindBugs2.java:909)
At edu.umd.cs.findbugs.FindBugs2.execute(FindBugs2.java:252)
At edu.umd.cs.findbugs.FindBugs.runMain(FindBugs.java:395)
At edu.umd.cs.findbugs.FindBugs2.main(FindBugs2.java:1231)
Couldn't get class info for java/nio/file/attribute/FileAttribute
java.lang.IllegalArgumentException: Unsupported class file major version 66
At org.objectweb.asm.ClassReader.<init>(ClassReader.java:199)
At org.objectweb.asm.ClassReader.<init>(ClassReader.java:180)
At org.objectweb.asm.ClassReader.<init>(ClassReader.java:166)
At edu.umd.cs.findbugs.asm.FBClassReader.<init>(FBClassReader.java:35)
At edu.umd.cs.findbugs.classfile.engine.asm.ClassReaderAnalysisEngine.analyze(ClassReaderAnalysisEngine.java:48)
At edu.umd.cs.findbugs.classfile.engine.asm.ClassReaderAnalysisEngine.analyze(ClassReaderAnalysisEngine.java:34)
At edu.umd.cs.findbugs.classfile.impl.AnalysisCache.getClassAnalysis(AnalysisCache.java:261)
At edu.umd.cs.findbugs.classfile.engine.ClassInfoAnalysisEngine.analyze(ClassInfoAnalysisEngine.java:75)
At edu.umd.cs.findbugs.classfile.engine.ClassInfoAnalysisEngine.analyze(ClassInfoAnalysisEngine.java:38)
At edu.umd.cs.findbugs.classfile.impl.AnalysisCache.getClassAnalysis(AnalysisCache.java:261)
At edu.umd.cs.findbugs.ba.XFactory.getXClass(XFactory.java:693)
At edu.umd.cs.findbugs.ba.AnalysisContext.setAppClassList(AnalysisContext.java:975)
At edu.umd.cs.findbugs.FindBugs2.setAppClassList(FindBugs2.java:909)
At edu.umd.cs.findbugs.FindBugs2.execute(FindBugs2.java:252)
At edu.umd.cs.findbugs.FindBugs.runMain(FindBugs.java:395)
At edu.umd.cs.findbugs.FindBugs2.main(FindBugs2.java:1231)
Couldn't get class info for java/util/Calendar
java.lang.IllegalArgumentException: Unsupported class file major version 66
At org.objectweb.asm.ClassReader.<init>(ClassReader.java:199)
At org.objectweb.asm.ClassReader.<init>(ClassReader.java:180)
At org.objectweb.asm.ClassReader.<init>(ClassReader.java:166)
At edu.umd.cs.findbugs.asm.FBClassReader.<init>(FBClassReader.java:35)
At edu.umd.cs.findbugs.classfile.engine.asm.ClassReaderAnalysisEngine.analyze(ClassReaderAnalysisEngine.java:48)
At edu.umd.cs.findbugs.classfile.engine.asm.ClassReaderAnalysisEngine.analyze(ClassReaderAnalysisEngine.java:34)
At edu.umd.cs.findbugs.classfile.impl.AnalysisCache.getClassAnalysis(AnalysisCache.java:261)
At edu.umd.cs.findbugs.classfile.engine.ClassInfoAnalysisEngine.analyze(ClassInfoAnalysisEngine.java:75)
At edu.umd.cs.findbugs.classfile.engine.ClassInfoAnalysisEngine.analyze(ClassInfoAnalysisEngine.java:38)
At edu.umd.cs.findbugs.classfile.impl.AnalysisCache.getClassAnalysis(AnalysisCache.java:261)
At edu.umd.cs.findbugs.ba.XFactory.getXClass(XFactory.java:693)
At edu.umd.cs.findbugs.ba.AnalysisContext.setAppClassList(AnalysisContext.java:975)
At edu.umd.cs.findbugs.FindBugs2.setAppClassList(FindBugs2.java:909)
At edu.umd.cs.findbugs.FindBugs2.execute(FindBugs2.java:252)
At edu.umd.cs.findbugs.FindBugs.runMain(FindBugs.java:395)
At edu.umd.cs.findbugs.FindBugs2.main(FindBugs2.java:1231)
Couldn't get class info for java/util/Random
java.lang.IllegalArgumentException: Unsupported class file major version 66
At org.objectweb.asm.ClassReader.<init>(ClassReader.java:199)
At org.objectweb.asm.ClassReader.<init>(ClassReader.java:180)
At org.objectweb.asm.ClassReader.<init>(ClassReader.java:166)
At edu.umd.cs.findbugs.asm.FBClassReader.<init>(FBClassReader.java:35)
At edu.umd.cs.findbugs.classfile.engine.asm.ClassReaderAnalysisEngine.analyze(ClassReaderAnalysisEngine.java:48)
At edu.umd.cs.findbugs.classfile.engine.asm.ClassReaderAnalysisEngine.analyze(ClassReaderAnalysisEngine.java:34)
At edu.umd.cs.findbugs.classfile.impl.AnalysisCache.getClassAnalysis(AnalysisCache.java:261)
At edu.umd.cs.findbugs.classfile.engine.ClassInfoAnalysisEngine.analyze(ClassInfoAnalysisEngine.java:75)
At edu.umd.cs.findbugs.classfile.engine.ClassInfoAnalysisEngine.analyze(ClassInfoAnalysisEngine.java:38)
At edu.umd.cs.findbugs.classfile.impl.AnalysisCache.getClassAnalysis(AnalysisCache.java:261)
At edu.umd.cs.findbugs.ba.XFactory.getXClass(XFactory.java:693)
At edu.umd.cs.findbugs.ba.AnalysisContext.setAppClassList(AnalysisContext.java:975)
At edu.umd.cs.findbugs.FindBugs2.setAppClassList(FindBugs2.java:909)
At edu.umd.cs.findbugs.FindBugs2.execute(FindBugs2.java:252)
At edu.umd.cs.findbugs.FindBugs.runMain(FindBugs.java:395)
At edu.umd.cs.findbugs.FindBugs2.main(FindBugs2.java:1231)
Couldn't get class info for java/util/Locale
java.lang.IllegalArgumentException: Unsupported class file major version 66
At org.objectweb.asm.ClassReader.<init>(ClassReader.java:199)
At org.objectweb.asm.ClassReader.<init>(ClassReader.java:180)
At org.objectweb.asm.ClassReader.<init>(ClassReader.java:166)
At edu.umd.cs.findbugs.asm.FBClassReader.<init>(FBClassReader.java:35)
At edu.umd.cs.findbugs.classfile.engine.asm.ClassReaderAnalysisEngine.analyze(ClassReaderAnalysisEngine.java:48)
At edu.umd.cs.findbugs.classfile.engine.asm.ClassReaderAnalysisEngine.analyze(ClassReaderAnalysisEngine.java:34)
At edu.umd.cs.findbugs.classfile.impl.AnalysisCache.getClassAnalysis(AnalysisCache.java:261)
At edu.umd.cs.findbugs.classfile.engine.ClassInfoAnalysisEngine.analyze(ClassInfoAnalysisEngine.java:75)
At edu.umd.cs.findbugs.classfile.engine.ClassInfoAnalysisEngine.analyze(ClassInfoAnalysisEngine.java:38)
At edu.umd.cs.findbugs.classfile.impl.AnalysisCache.getClassAnalysis(AnalysisCache.java:261)
At edu.umd.cs.findbugs.ba.XFactory.getXClass(XFactory.java:693)
At edu.umd.cs.findbugs.ba.AnalysisContext.setAppClassList(AnalysisContext.java:975)
At edu.umd.cs.findbugs.FindBugs2.setAppClassList(FindBugs2.java:909)
At edu.umd.cs.findbugs.FindBugs2.execute(FindBugs2.java:252)
At edu.umd.cs.findbugs.FindBugs.runMain(FindBugs.java:395)
At edu.umd.cs.findbugs.FindBugs2.main(FindBugs2.java:1231)
Couldn't get class info for java/lang/AssertionError
java.lang.IllegalArgumentException: Unsupported class file major version 66
At org.objectweb.asm.ClassReader.<init>(ClassReader.java:199)
At org.objectweb.asm.ClassReader.<init>(ClassReader.java:180)
At org.objectweb.asm.ClassReader.<init>(ClassReader.java:166)
At edu.umd.cs.findbugs.asm.FBClassReader.<init>(FBClassReader.java:35)
At edu.umd.cs.findbugs.classfile.engine.asm.ClassReaderAnalysisEngine.analyze(ClassReaderAnalysisEngine.java:48)
At edu.umd.cs.findbugs.classfile.engine.asm.ClassReaderAnalysisEngine.analyze(ClassReaderAnalysisEngine.java:34)
At edu.umd.cs.findbugs.classfile.impl.AnalysisCache.getClassAnalysis(AnalysisCache.java:261)
At edu.umd.cs.findbugs.classfile.engine.ClassInfoAnalysisEngine.analyze(ClassInfoAnalysisEngine.java:75)
At edu.umd.cs.findbugs.classfile.engine.ClassInfoAnalysisEngine.analyze(ClassInfoAnalysisEngine.java:38)
At edu.umd.cs.findbugs.classfile.impl.AnalysisCache.getClassAnalysis(AnalysisCache.java:261)
At edu.umd.cs.findbugs.ba.XFactory.getXClass(XFactory.java:693)
At edu.umd.cs.findbugs.ba.AnalysisContext.setAppClassList(AnalysisContext.java:975)
At edu.umd.cs.findbugs.FindBugs2.setAppClassList(FindBugs2.java:909)
At edu.umd.cs.findbugs.FindBugs2.execute(FindBugs2.java:252)
At edu.umd.cs.findbugs.FindBugs.runMain(FindBugs.java:395)
At edu.umd.cs.findbugs.FindBugs2.main(FindBugs2.java:1231)
Couldn't get class info for java/lang/NoSuchFieldException
java.lang.IllegalArgumentException: Unsupported class file major version 66
At org.objectweb.asm.ClassReader.<init>(ClassReader.java:199)
At org.objectweb.asm.ClassReader.<init>(ClassReader.java:180)
At org.objectweb.asm.ClassReader.<init>(ClassReader.java:166)
At edu.umd.cs.findbugs.asm.FBClassReader.<init>(FBClassReader.java:35)
At edu.umd.cs.findbugs.classfile.engine.asm.ClassReaderAnalysisEngine.analyze(ClassReaderAnalysisEngine.java:48)
At edu.umd.cs.findbugs.classfile.engine.asm.ClassReaderAnalysisEngine.analyze(ClassReaderAnalysisEngine.java:34)
At edu.umd.cs.findbugs.classfile.impl.AnalysisCache.getClassAnalysis(AnalysisCache.java:261)
At edu.umd.cs.findbugs.classfile.engine.ClassInfoAnalysisEngine.analyze(ClassInfoAnalysisEngine.java:75)
At edu.umd.cs.findbugs.classfile.engine.ClassInfoAnalysisEngine.analyze(ClassInfoAnalysisEngine.java:38)
At edu.umd.cs.findbugs.classfile.impl.AnalysisCache.getClassAnalysis(AnalysisCache.java:261)
At edu.umd.cs.findbugs.ba.XFactory.getXClass(XFactory.java:693)
At edu.umd.cs.findbugs.ba.AnalysisContext.setAppClassList(AnalysisContext.java:975)
At edu.umd.cs.findbugs.FindBugs2.setAppClassList(FindBugs2.java:909)
At edu.umd.cs.findbugs.FindBugs2.execute(FindBugs2.java:252)
At edu.umd.cs.findbugs.FindBugs.runMain(FindBugs.java:395)
At edu.umd.cs.findbugs.FindBugs2.main(FindBugs2.java:1231)
Couldn't get class info for java/util/Set
java.lang.IllegalArgumentException: Unsupported class file major version 66
At org.objectweb.asm.ClassReader.<init>(ClassReader.java:199)
At org.objectweb.asm.ClassReader.<init>(ClassReader.java:180)
At org.objectweb.asm.ClassReader.<init>(ClassReader.java:166)
At edu.umd.cs.findbugs.asm.FBClassReader.<init>(FBClassReader.java:35)
At edu.umd.cs.findbugs.classfile.engine.asm.ClassReaderAnalysisEngine.analyze(ClassReaderAnalysisEngine.java:48)
At edu.umd.cs.findbugs.classfile.engine.asm.ClassReaderAnalysisEngine.analyze(ClassReaderAnalysisEngine.java:34)
At edu.umd.cs.findbugs.classfile.impl.AnalysisCache.getClassAnalysis(AnalysisCache.java:261)
At edu.umd.cs.findbugs.classfile.engine.ClassInfoAnalysisEngine.analyze(ClassInfoAnalysisEngine.java:75)
At edu.umd.cs.findbugs.classfile.engine.ClassInfoAnalysisEngine.analyze(ClassInfoAnalysisEngine.java:38)
At edu.umd.cs.findbugs.classfile.impl.AnalysisCache.getClassAnalysis(AnalysisCache.java:261)
At edu.umd.cs.findbugs.ba.XFactory.getXClass(XFactory.java:693)
At edu.umd.cs.findbugs.ba.AnalysisContext.setAppClassList(AnalysisContext.java:975)
At edu.umd.cs.findbugs.FindBugs2.setAppClassList(FindBugs2.java:909)
At edu.umd.cs.findbugs.FindBugs2.execute(FindBugs2.java:252)
At edu.umd.cs.findbugs.FindBugs.runMain(FindBugs.java:395)
At edu.umd.cs.findbugs.FindBugs2.main(FindBugs2.java:1231)
Couldn't get class info for javax/xml/stream/util/StreamReaderDelegate
java.lang.IllegalArgumentException: Unsupported class file major version 66
At org.objectweb.asm.ClassReader.<init>(ClassReader.java:199)
At org.objectweb.asm.ClassReader.<init>(ClassReader.java:180)
At org.objectweb.asm.ClassReader.<init>(ClassReader.java:166)
At edu.umd.cs.findbugs.asm.FBClassReader.<init>(FBClassReader.java:35)
At edu.umd.cs.findbugs.classfile.engine.asm.ClassReaderAnalysisEngine.analyze(ClassReaderAnalysisEngine.java:48)
At edu.umd.cs.findbugs.classfile.engine.asm.ClassReaderAnalysisEngine.analyze(ClassReaderAnalysisEngine.java:34)
At edu.umd.cs.findbugs.classfile.impl.AnalysisCache.getClassAnalysis(AnalysisCache.java:261)
At edu.umd.cs.findbugs.classfile.engine.ClassInfoAnalysisEngine.analyze(ClassInfoAnalysisEngine.java:75)
At edu.umd.cs.findbugs.classfile.engine.ClassInfoAnalysisEngine.analyze(ClassInfoAnalysisEngine.java:38)
At edu.umd.cs.findbugs.classfile.impl.AnalysisCache.getClassAnalysis(AnalysisCache.java:261)
At edu.umd.cs.findbugs.FindBugs2.buildReferencedClassSet(FindBugs2.java:806)
At edu.umd.cs.findbugs.FindBugs2.execute(FindBugs2.java:249)
At edu.umd.cs.findbugs.FindBugs.runMain(FindBugs.java:395)
At edu.umd.cs.findbugs.FindBugs2.main(FindBugs2.java:1231)
java.lang.IllegalArgumentException: Unsupported class file major version 66
at org.objectweb.asm.ClassReader.<init>(ClassReader.java:199)
at org.objectweb.asm.ClassReader.<init>(ClassReader.java:180)
at org.objectweb.asm.ClassReader.<init>(ClassReader.java:166)
at edu.umd.cs.findbugs.asm.FBClassReader.<init>(FBClassReader.java:35)
at edu.umd.cs.findbugs.classfile.engine.asm.ClassReaderAnalysisEngine.analyze(ClassReaderAnalysisEngine.java:48)
at edu.umd.cs.findbugs.classfile.engine.asm.ClassReaderAnalysisEngine.analyze(ClassReaderAnalysisEngine.java:34)
at edu.umd.cs.findbugs.classfile.impl.AnalysisCache.getClassAnalysis(AnalysisCache.java:261)
at edu.umd.cs.findbugs.classfile.engine.ClassInfoAnalysisEngine.analyze(ClassInfoAnalysisEngine.java:75)
at edu.umd.cs.findbugs.classfile.engine.ClassInfoAnalysisEngine.analyze(ClassInfoAnalysisEngine.java:38)
at edu.umd.cs.findbugs.classfile.impl.AnalysisCache.getClassAnalysis(AnalysisCache.java:261)
at edu.umd.cs.findbugs.ba.XFactory.getXClass(XFactory.java:693)
at edu.umd.cs.findbugs.ba.AnalysisContext.setAppClassList(AnalysisContext.java:975)
at edu.umd.cs.findbugs.FindBugs2.setAppClassList(FindBugs2.java:909)
at edu.umd.cs.findbugs.FindBugs2.execute(FindBugs2.java:252)
at edu.umd.cs.findbugs.FindBugs.runMain(FindBugs.java:395)
at edu.umd.cs.findbugs.FindBugs2.main(FindBugs2.java:1231)
SpotBugs ended with exit code 4
> Task :test
ParserTest > testXmlInputFactoryPropertyDefaults() FAILED
org.opentest4j.AssertionFailedError at ParserTest.java:70
ParserTest > testXmlInputFactoryPropertyOverrides() FAILED
org.opentest4j.AssertionFailedError at ParserTest.java:81
2963 tests completed, 2 failed, 170 skipped
> Task :test FAILED
FAILURE: Build failed with an exception.
* What went wrong:
Execution failed for task ':test'.
> There were failing tests. See the report at: file://<https://ci-builds.apache.org/job/POI/job/POI-XMLBeans-DSL-1.22/ws/build/reports/tests/test/index.html>
* Try:
> Run with --scan to get full insights.
Deprecated Gradle features were used in this build, making it incompatible with Gradle 9.0.
You can use '--warning-mode all' to show the individual deprecation warnings and determine if they come from your own scripts or plugins.
For more on this, please refer to https://docs.gradle.org/8.6/userguide/command_line_interface.html#sec:command_line_warnings in the Gradle documentation.
BUILD FAILED in 7m 29s
45 actionable tasks: 43 executed, 2 from cache
Build step 'Invoke Gradle script' changed build result to FAILURE
Build step 'Invoke Gradle script' marked build as failure
ERROR: Not all environment variables could be successfully injected. Check for similarly-named environment variables.
Archiving artifacts
ERROR: Not all environment variables could be successfully injected. Check for similarly-named environment variables.
Recording test results
ERROR: Not all environment variables could be successfully injected. Check for similarly-named environment variables.
[Checks API] No suitable checks publisher found.
[SpotBugs] Skipping execution of recorder since overall result is 'FAILURE'
ERROR: Not all environment variables could be successfully injected. Check for similarly-named environment variables.
---------------------------------------------------------------------
To unsubscribe, e-mail: dev-unsubscribe@poi.apache.org
For additional commands, e-mail: dev-help@poi.apache.org
Build failed in Jenkins: POI » POI-XMLBeans-DSL-1.22 #15
Posted by Apache Jenkins Server <je...@builds.apache.org>.
See <https://ci-builds.apache.org/job/POI/job/POI-XMLBeans-DSL-1.22/15/display/redirect?page=changes>
Changes:
[PJ Fanning] update releases
------------------------------------------
[...truncated 169.06 KB...]
A test/perf/bin/run_jaxb2.bat
A test/perf/bin/run_all.bat
A test/perf/bin/run_all_nonmemory.bat
A test/perf/bin/jaxb2.bat
A test/perf/bin/xerces.sh
A test/perf/bin/castor.sh
A test/perf/bin/jaxb.bat
A test/perf/bin/run_xmlbeans_all.bat
A test/perf/bin/jaxb.sh
A test/perf/bin/xerces.bat
AU test/perf/bin/castor.bat
A test/perf/bin/run_xmlbeans_nonmemory.bat
A test/perf/bin/run_svn.bat
A test/perf/bin/run_svn_nonmemory.bat
A test/perf/bin/run_svn.sh
A test/perf/bin/run_v1_nonmemory.bat
A test/perf/bin/run_v2_nonmemory.bat
A test/perf/bin/run_xerces_nonmemory.bat
A test/perf/bin/run_all.sh
A test/perf/bin/run_v2.sh
A test/perf/bin/run_v1.bat
A test/perf/bin/run_v2.bat
A test/perf/bin/run_jaxb.sh
A test/perf/bin/run_xerces.bat
A test/perf/bin/run_v1.sh
A test/perf/bin/run_castor.bat
A test/perf/bin/run_xerces.sh
A test/perf/bin/run_castor.sh
A test/perf/bin/run_jaxb.bat
A test/perf/bin/v1.sh
A test/perf/bin/jibx.sh
A test/perf/bin/run_jibx.bat
AU test/perf/bin/v1.bat
AU test/perf/bin/jibx.bat
A test/perf/bin/castor.properties
A test/perf/bin/run_jibx.sh
A test/perf/download.properties
A test/perf/cases
AU test/perf/cases/parser_instances.zip
A test/perf/cases/xsd
A test/perf/cases/xsd/non-primitives.xsd
A test/perf/cases/xsd/purchase-order-1.xml
A test/perf/cases/xsd/purchase-order.xsd
A test/perf/cases/xsd/purchase-order-2.xml
A test/perf/cases/xsd/purchase-order-3.xml
A test/perf/cases/xsd/doc.xsd
A test/perf/cases/xsd/purchase-order-4.xml
A test/perf/cases/xsd/purchase-order-5.xml
A test/perf/cases/xsd/purchase-order-6.xml
A test/perf/cases/xsd/purchase-order-7.xml
A test/perf/cases/xsd/purchase-order-jibxbinding.xml
A test/perf/cases/xsd/perf-results.xsd
A test/perf/cases/xsd/primitives.xsd
A test/perf/results.xml
AU test/perf/env.sh
AU test/perf/env.bat
A test/docs
AU test/docs/BuildingAndRunningTests.txt
AU test/docs/TestOrganization.txt
AU test/readme.txt
AU STATUS
A release-guide.txt
AU LICENSE.txt
A .github
A .github/workflows
A .github/workflows/test-gradle.yml
A .github/workflows/codeql-analysis.yml
A wrapper.gradle
AU NOTICE.txt
AU NOTICE-binary.txt
A legal
A legal/HEADER
A KEYS
A settings.gradle
A SECURITY.md
A CHANGES.txt
A .gitignore
AU xbeanenv.sh
AU xbeanenv.cmd
U .
At revision 1915858
ERROR: Not all environment variables could be successfully injected. Check for similarly-named environment variables.
[POI-XMLBeans-DSL-1.22] $ /bin/sh -xe /tmp/jenkins12747600844438374065.sh
+ rm -rf examples excelant integrationtest main ooxml ooxml-schema scratchpad build.javacheck.xml
+ svn status
+ svn revert poi*/src/*/java9/module-info.*
svn: E155010: The node '<https://ci-builds.apache.org/job/POI/job/POI-XMLBeans-DSL-1.22/ws/poi*/src/*'> was not found.
+ true
+ svn revert src/resources/ooxml-lite-report.*
Skipped 'src/resources/ooxml-lite-report.*'
+ echo Java-Home: /home/jenkins/tools/java/latest22
Java-Home: /home/jenkins/tools/java/latest22
+ ls -al /home/jenkins/tools/java/latest22/
total 36
drwxr-xr-x 8 root root 4096 Nov 9 19:44 .
drwxrwxr-x 39 root root 4096 Feb 8 19:08 ..
drwxr-xr-x 2 root root 4096 Nov 9 19:44 bin
drwxr-xr-x 5 root root 4096 Nov 9 19:44 conf
drwxr-xr-x 3 root root 4096 Nov 9 19:44 include
drwxr-xr-x 2 root root 4096 Nov 9 19:44 jmods
drwxr-xr-x 71 root root 4096 Nov 9 19:44 legal
drwxr-xr-x 5 root root 4096 Nov 9 19:44 lib
-rw-r--r-- 1 root root 1220 Oct 18 14:34 release
+ ls -al /home/jenkins/tools/java/latest22/bin
total 472
drwxr-xr-x 2 root root 4096 Nov 9 19:44 .
drwxr-xr-x 8 root root 4096 Nov 9 19:44 ..
-rwxr-xr-x 1 root root 12384 Oct 18 14:34 jar
-rwxr-xr-x 1 root root 12392 Oct 18 14:34 jarsigner
-rwxr-xr-x 1 root root 12328 Oct 18 14:34 java
-rwxr-xr-x 1 root root 12416 Oct 18 14:34 javac
-rwxr-xr-x 1 root root 12424 Oct 18 14:34 javadoc
-rwxr-xr-x 1 root root 12384 Oct 18 14:34 javap
-rwxr-xr-x 1 root root 12384 Oct 18 14:34 jcmd
-rwxr-xr-x 1 root root 12456 Oct 18 14:34 jconsole
-rwxr-xr-x 1 root root 12384 Oct 18 14:34 jdb
-rwxr-xr-x 1 root root 12392 Oct 18 14:34 jdeprscan
-rwxr-xr-x 1 root root 12384 Oct 18 14:34 jdeps
-rwxr-xr-x 1 root root 12384 Oct 18 14:34 jfr
-rwxr-xr-x 1 root root 12384 Oct 18 14:34 jhsdb
-rwxr-xr-x 1 root root 12392 Oct 18 14:34 jimage
-rwxr-xr-x 1 root root 12416 Oct 18 14:34 jinfo
-rwxr-xr-x 1 root root 12416 Oct 18 14:34 jlink
-rwxr-xr-x 1 root root 12416 Oct 18 14:34 jmap
-rwxr-xr-x 1 root root 12384 Oct 18 14:34 jmod
-rwxr-xr-x 1 root root 12392 Oct 18 14:34 jpackage
-rwxr-xr-x 1 root root 12384 Oct 18 14:34 jps
-rwxr-xr-x 1 root root 12424 Oct 18 14:34 jrunscript
-rwxr-xr-x 1 root root 12392 Oct 18 14:34 jshell
-rwxr-xr-x 1 root root 12424 Oct 18 14:34 jstack
-rwxr-xr-x 1 root root 12384 Oct 18 14:34 jstat
-rwxr-xr-x 1 root root 12392 Oct 18 14:34 jstatd
-rwxr-xr-x 1 root root 12392 Oct 18 14:34 jwebserver
-rwxr-xr-x 1 root root 12392 Oct 18 14:34 keytool
-rwxr-xr-x 1 root root 12416 Oct 18 14:34 rmiregistry
-rwxr-xr-x 1 root root 12392 Oct 18 14:34 serialver
+ /home/jenkins/tools/java/latest22/bin/java -version
openjdk version "22-ea" 2024-03-19
OpenJDK Runtime Environment (build 22-ea+20-1570)
OpenJDK 64-Bit Server VM (build 22-ea+20-1570, mixed mode, sharing)
+ echo which java
which java
+ which java
/home/jenkins/tools/java/latest22/bin/java
+ java -version
openjdk version "22-ea" 2024-03-19
OpenJDK Runtime Environment (build 22-ea+20-1570)
OpenJDK 64-Bit Server VM (build 22-ea+20-1570, mixed mode, sharing)
+ echo which javac
which javac
+ which javac
/home/jenkins/tools/java/latest22/bin/javac
+ javac -version
javac 22-ea
+ echo Ant-Home:
Ant-Home:
+ ls -al
total 412
drwxr-xr-x 10 jenkins jenkins 4096 Feb 18 11:54 .
drwxr-xr-x 3 jenkins jenkins 4096 Feb 18 11:52 ..
-rw-r--r-- 1 jenkins jenkins 29242 Feb 18 11:54 build.gradle
-rw-r--r-- 1 jenkins jenkins 54123 Feb 18 11:54 build.xml
-rw-r--r-- 1 jenkins jenkins 11963 Feb 18 11:54 CHANGES.txt
drwxr-xr-x 3 jenkins jenkins 4096 Feb 18 11:54 .github
-rw-r--r-- 1 jenkins jenkins 14 Feb 18 11:54 .gitignore
drwxr-xr-x 3 jenkins jenkins 4096 Feb 18 11:54 gradle
-rw-r--r-- 1 jenkins jenkins 1338 Feb 18 11:54 gradle.properties
-rwxr-xr-x 1 jenkins jenkins 9125 Feb 18 11:54 gradlew
-rw-r--r-- 1 jenkins jenkins 176157 Feb 18 11:54 KEYS
drwxr-xr-x 2 jenkins jenkins 4096 Feb 18 11:54 legal
-rwxr-xr-x 1 jenkins jenkins 12458 Feb 18 11:54 LICENSE-binary.txt
-rwxr-xr-x 1 jenkins jenkins 11884 Feb 18 11:54 LICENSE.txt
-rw-r--r-- 1 jenkins jenkins 2561 Feb 18 11:54 NOTICE-binary.txt
-rw-r--r-- 1 jenkins jenkins 1592 Feb 18 11:54 NOTICE.txt
-rw-r--r-- 1 jenkins jenkins 2227 Feb 18 11:54 README.txt
-rw-r--r-- 1 jenkins jenkins 10995 Feb 18 11:54 release-guide.txt
drwxr-xr-x 16 jenkins jenkins 4096 Feb 18 11:54 samples
-rw-r--r-- 1 jenkins jenkins 238 Feb 18 11:54 SECURITY.md
-rw-r--r-- 1 jenkins jenkins 661 Feb 18 11:54 settings.gradle
drwxr-xr-x 4 jenkins jenkins 4096 Feb 18 11:54 src
-rw-r--r-- 1 jenkins jenkins 359 Feb 18 11:54 STATUS
drwxr-xr-x 4 jenkins jenkins 4096 Feb 18 11:55 .svn
drwxr-xr-x 4 jenkins jenkins 4096 Feb 18 11:54 test
-rw-r--r-- 1 jenkins jenkins 3803 Feb 18 11:54 wrapper.gradle
-rw-r--r-- 1 jenkins jenkins 25 Feb 18 11:54 xbeanenv.cmd
-rwxr-xr-x 1 jenkins jenkins 27 Feb 18 11:54 xbeanenv.sh
drwxr-xr-x 2 jenkins jenkins 4096 Feb 18 11:54 xkit
+ echo which ant
which ant
+ which ant
/usr/bin/ant
+ ant -version
Apache Ant(TM) version 1.10.12 compiled on January 17 1970
+ echo <project default="test"><target name="test"><echo>Java ${ant.java.version}/${java.version}</echo><exec executable="javac"><arg value="-version"/></exec></target></project>
+ ant -f build.javacheck.xml -v
Apache Ant(TM) version 1.10.12 compiled on January 17 1970
Buildfile: <https://ci-builds.apache.org/job/POI/job/POI-XMLBeans-DSL-1.22/ws/build.javacheck.xml>
Detected Java version: 22 in: /usr/local/asfpackages/java/openjdk-22-ea+20
Detected OS: Linux
parsing buildfile <https://ci-builds.apache.org/job/POI/job/POI-XMLBeans-DSL-1.22/ws/build.javacheck.xml> with URI = <https://ci-builds.apache.org/job/POI/job/POI-XMLBeans-DSL-1.22/ws/build.javacheck.xml>
Project base dir set to: <https://ci-builds.apache.org/job/POI/job/POI-XMLBeans-DSL-1.22/ws/>
Build sequence for target(s) `test' is [test]
Complete build sequence is [test, ]
test:
parsing buildfile jar:file:/usr/share/ant/lib/ant.jar!/org/apache/tools/ant/antlib.xml with URI = jar:file:/usr/share/ant/lib/ant.jar!/org/apache/tools/ant/antlib.xml from a zip file
[echo] Java 22/22-ea
[exec] Current OS is Linux
[exec] Executing 'javac' with arguments:
[exec] '-version'
[exec]
[exec] The ' characters around the executable and arguments are
[exec] not part of the command.
[exec] javac 22-ea
BUILD SUCCESSFUL
Total time: 1 second
+ exit 0
[Gradle] - Launching build.
ERROR: Not all environment variables could be successfully injected. Check for similarly-named environment variables.
[POI-XMLBeans-DSL-1.22] $ <https://ci-builds.apache.org/job/POI/job/POI-XMLBeans-DSL-1.22/ws/gradlew> clean jenkins jacocoTestReport
To honour the JVM settings for this build a single-use Daemon process will be forked. For more on this, please refer to https://docs.gradle.org/8.4/userguide/gradle_daemon.html#sec:disabling_the_daemon in the Gradle documentation.
Daemon will be stopped at the end of the build
Configuration on demand is an incubating feature.
FAILURE: Build failed with an exception.
* What went wrong:
Could not open init generic class cache for initialization script '/home/jenkins/.gradle/init.d/init-build-scan.gradle' (/home/jenkins/.gradle/caches/8.4/scripts/3xywm55v3mpaag86pcycaoc0n).
> BUG! exception in phase 'semantic analysis' in source unit '_BuildScript_' Unsupported class file major version 66
* Try:
> Run with --stacktrace option to get the stack trace.
> Run with --info or --debug option to get more log output.
> Run with --scan to get full insights.
> Get more help at https://help.gradle.org.
BUILD FAILED in 14s
Build step 'Invoke Gradle script' changed build result to FAILURE
Build step 'Invoke Gradle script' marked build as failure
ERROR: Not all environment variables could be successfully injected. Check for similarly-named environment variables.
Archiving artifacts
ERROR: Not all environment variables could be successfully injected. Check for similarly-named environment variables.
Recording test results
ERROR: Not all environment variables could be successfully injected. Check for similarly-named environment variables.
ERROR: Step ‘Publish JUnit test result report’ failed: No test report files were found. Configuration error?
[SpotBugs] Skipping execution of recorder since overall result is 'FAILURE'
ERROR: Not all environment variables could be successfully injected. Check for similarly-named environment variables.
---------------------------------------------------------------------
To unsubscribe, e-mail: dev-unsubscribe@poi.apache.org
For additional commands, e-mail: dev-help@poi.apache.org
Build failed in Jenkins: POI » POI-XMLBeans-DSL-1.22 #14
Posted by Apache Jenkins Server <je...@builds.apache.org>.
See <https://ci-builds.apache.org/job/POI/job/POI-XMLBeans-DSL-1.22/14/display/redirect?page=changes>
Changes:
[Dominik Stadler] Update forbidden-apis, XmlBeans, JaCoCo
[Dominik Stadler] Remove some strange characters from comments which cause warnings in SonarQube runs
------------------------------------------
[...truncated 11.49 MB...]
At edu.umd.cs.findbugs.classfile.engine.asm.ClassReaderAnalysisEngine.analyze(ClassReaderAnalysisEngine.java:48)
At edu.umd.cs.findbugs.classfile.engine.asm.ClassReaderAnalysisEngine.analyze(ClassReaderAnalysisEngine.java:34)
At edu.umd.cs.findbugs.classfile.impl.AnalysisCache.getClassAnalysis(AnalysisCache.java:261)
At edu.umd.cs.findbugs.classfile.engine.ClassInfoAnalysisEngine.analyze(ClassInfoAnalysisEngine.java:75)
At edu.umd.cs.findbugs.classfile.engine.ClassInfoAnalysisEngine.analyze(ClassInfoAnalysisEngine.java:38)
At edu.umd.cs.findbugs.classfile.impl.AnalysisCache.getClassAnalysis(AnalysisCache.java:261)
At edu.umd.cs.findbugs.ba.XFactory.getXClass(XFactory.java:693)
At edu.umd.cs.findbugs.ba.AnalysisContext.setAppClassList(AnalysisContext.java:975)
At edu.umd.cs.findbugs.FindBugs2.setAppClassList(FindBugs2.java:909)
At edu.umd.cs.findbugs.FindBugs2.execute(FindBugs2.java:252)
At edu.umd.cs.findbugs.FindBugs.runMain(FindBugs.java:395)
At edu.umd.cs.findbugs.FindBugs2.main(FindBugs2.java:1231)
Couldn't get class info for java/lang/LinkageError
java.lang.IllegalArgumentException: Unsupported class file major version 66
At org.objectweb.asm.ClassReader.<init>(ClassReader.java:199)
At org.objectweb.asm.ClassReader.<init>(ClassReader.java:180)
At org.objectweb.asm.ClassReader.<init>(ClassReader.java:166)
At edu.umd.cs.findbugs.asm.FBClassReader.<init>(FBClassReader.java:35)
At edu.umd.cs.findbugs.classfile.engine.asm.ClassReaderAnalysisEngine.analyze(ClassReaderAnalysisEngine.java:48)
At edu.umd.cs.findbugs.classfile.engine.asm.ClassReaderAnalysisEngine.analyze(ClassReaderAnalysisEngine.java:34)
At edu.umd.cs.findbugs.classfile.impl.AnalysisCache.getClassAnalysis(AnalysisCache.java:261)
At edu.umd.cs.findbugs.classfile.engine.ClassInfoAnalysisEngine.analyze(ClassInfoAnalysisEngine.java:75)
At edu.umd.cs.findbugs.classfile.engine.ClassInfoAnalysisEngine.analyze(ClassInfoAnalysisEngine.java:38)
At edu.umd.cs.findbugs.classfile.impl.AnalysisCache.getClassAnalysis(AnalysisCache.java:261)
At edu.umd.cs.findbugs.ba.XFactory.getXClass(XFactory.java:693)
At edu.umd.cs.findbugs.ba.AnalysisContext.setAppClassList(AnalysisContext.java:975)
At edu.umd.cs.findbugs.FindBugs2.setAppClassList(FindBugs2.java:909)
At edu.umd.cs.findbugs.FindBugs2.execute(FindBugs2.java:252)
At edu.umd.cs.findbugs.FindBugs.runMain(FindBugs.java:395)
At edu.umd.cs.findbugs.FindBugs2.main(FindBugs2.java:1231)
Couldn't get class info for java/io/File
java.lang.IllegalArgumentException: Unsupported class file major version 66
At org.objectweb.asm.ClassReader.<init>(ClassReader.java:199)
At org.objectweb.asm.ClassReader.<init>(ClassReader.java:180)
At org.objectweb.asm.ClassReader.<init>(ClassReader.java:166)
At edu.umd.cs.findbugs.asm.FBClassReader.<init>(FBClassReader.java:35)
At edu.umd.cs.findbugs.classfile.engine.asm.ClassReaderAnalysisEngine.analyze(ClassReaderAnalysisEngine.java:48)
At edu.umd.cs.findbugs.classfile.engine.asm.ClassReaderAnalysisEngine.analyze(ClassReaderAnalysisEngine.java:34)
At edu.umd.cs.findbugs.classfile.impl.AnalysisCache.getClassAnalysis(AnalysisCache.java:261)
At edu.umd.cs.findbugs.classfile.engine.ClassInfoAnalysisEngine.analyze(ClassInfoAnalysisEngine.java:75)
At edu.umd.cs.findbugs.classfile.engine.ClassInfoAnalysisEngine.analyze(ClassInfoAnalysisEngine.java:38)
At edu.umd.cs.findbugs.classfile.impl.AnalysisCache.getClassAnalysis(AnalysisCache.java:261)
At edu.umd.cs.findbugs.ba.XFactory.getXClass(XFactory.java:693)
At edu.umd.cs.findbugs.ba.AnalysisContext.setAppClassList(AnalysisContext.java:975)
At edu.umd.cs.findbugs.FindBugs2.setAppClassList(FindBugs2.java:909)
At edu.umd.cs.findbugs.FindBugs2.execute(FindBugs2.java:252)
At edu.umd.cs.findbugs.FindBugs.runMain(FindBugs.java:395)
At edu.umd.cs.findbugs.FindBugs2.main(FindBugs2.java:1231)
Couldn't get class info for java/nio/file/attribute/FileAttribute
java.lang.IllegalArgumentException: Unsupported class file major version 66
At org.objectweb.asm.ClassReader.<init>(ClassReader.java:199)
At org.objectweb.asm.ClassReader.<init>(ClassReader.java:180)
At org.objectweb.asm.ClassReader.<init>(ClassReader.java:166)
At edu.umd.cs.findbugs.asm.FBClassReader.<init>(FBClassReader.java:35)
At edu.umd.cs.findbugs.classfile.engine.asm.ClassReaderAnalysisEngine.analyze(ClassReaderAnalysisEngine.java:48)
At edu.umd.cs.findbugs.classfile.engine.asm.ClassReaderAnalysisEngine.analyze(ClassReaderAnalysisEngine.java:34)
At edu.umd.cs.findbugs.classfile.impl.AnalysisCache.getClassAnalysis(AnalysisCache.java:261)
At edu.umd.cs.findbugs.classfile.engine.ClassInfoAnalysisEngine.analyze(ClassInfoAnalysisEngine.java:75)
At edu.umd.cs.findbugs.classfile.engine.ClassInfoAnalysisEngine.analyze(ClassInfoAnalysisEngine.java:38)
At edu.umd.cs.findbugs.classfile.impl.AnalysisCache.getClassAnalysis(AnalysisCache.java:261)
At edu.umd.cs.findbugs.ba.XFactory.getXClass(XFactory.java:693)
At edu.umd.cs.findbugs.ba.AnalysisContext.setAppClassList(AnalysisContext.java:975)
At edu.umd.cs.findbugs.FindBugs2.setAppClassList(FindBugs2.java:909)
At edu.umd.cs.findbugs.FindBugs2.execute(FindBugs2.java:252)
At edu.umd.cs.findbugs.FindBugs.runMain(FindBugs.java:395)
At edu.umd.cs.findbugs.FindBugs2.main(FindBugs2.java:1231)
Couldn't get class info for java/util/Calendar
java.lang.IllegalArgumentException: Unsupported class file major version 66
At org.objectweb.asm.ClassReader.<init>(ClassReader.java:199)
At org.objectweb.asm.ClassReader.<init>(ClassReader.java:180)
At org.objectweb.asm.ClassReader.<init>(ClassReader.java:166)
At edu.umd.cs.findbugs.asm.FBClassReader.<init>(FBClassReader.java:35)
At edu.umd.cs.findbugs.classfile.engine.asm.ClassReaderAnalysisEngine.analyze(ClassReaderAnalysisEngine.java:48)
At edu.umd.cs.findbugs.classfile.engine.asm.ClassReaderAnalysisEngine.analyze(ClassReaderAnalysisEngine.java:34)
At edu.umd.cs.findbugs.classfile.impl.AnalysisCache.getClassAnalysis(AnalysisCache.java:261)
At edu.umd.cs.findbugs.classfile.engine.ClassInfoAnalysisEngine.analyze(ClassInfoAnalysisEngine.java:75)
At edu.umd.cs.findbugs.classfile.engine.ClassInfoAnalysisEngine.analyze(ClassInfoAnalysisEngine.java:38)
At edu.umd.cs.findbugs.classfile.impl.AnalysisCache.getClassAnalysis(AnalysisCache.java:261)
At edu.umd.cs.findbugs.ba.XFactory.getXClass(XFactory.java:693)
At edu.umd.cs.findbugs.ba.AnalysisContext.setAppClassList(AnalysisContext.java:975)
At edu.umd.cs.findbugs.FindBugs2.setAppClassList(FindBugs2.java:909)
At edu.umd.cs.findbugs.FindBugs2.execute(FindBugs2.java:252)
At edu.umd.cs.findbugs.FindBugs.runMain(FindBugs.java:395)
At edu.umd.cs.findbugs.FindBugs2.main(FindBugs2.java:1231)
Couldn't get class info for java/util/Random
java.lang.IllegalArgumentException: Unsupported class file major version 66
At org.objectweb.asm.ClassReader.<init>(ClassReader.java:199)
At org.objectweb.asm.ClassReader.<init>(ClassReader.java:180)
At org.objectweb.asm.ClassReader.<init>(ClassReader.java:166)
At edu.umd.cs.findbugs.asm.FBClassReader.<init>(FBClassReader.java:35)
At edu.umd.cs.findbugs.classfile.engine.asm.ClassReaderAnalysisEngine.analyze(ClassReaderAnalysisEngine.java:48)
At edu.umd.cs.findbugs.classfile.engine.asm.ClassReaderAnalysisEngine.analyze(ClassReaderAnalysisEngine.java:34)
At edu.umd.cs.findbugs.classfile.impl.AnalysisCache.getClassAnalysis(AnalysisCache.java:261)
At edu.umd.cs.findbugs.classfile.engine.ClassInfoAnalysisEngine.analyze(ClassInfoAnalysisEngine.java:75)
At edu.umd.cs.findbugs.classfile.engine.ClassInfoAnalysisEngine.analyze(ClassInfoAnalysisEngine.java:38)
At edu.umd.cs.findbugs.classfile.impl.AnalysisCache.getClassAnalysis(AnalysisCache.java:261)
At edu.umd.cs.findbugs.ba.XFactory.getXClass(XFactory.java:693)
At edu.umd.cs.findbugs.ba.AnalysisContext.setAppClassList(AnalysisContext.java:975)
At edu.umd.cs.findbugs.FindBugs2.setAppClassList(FindBugs2.java:909)
At edu.umd.cs.findbugs.FindBugs2.execute(FindBugs2.java:252)
At edu.umd.cs.findbugs.FindBugs.runMain(FindBugs.java:395)
At edu.umd.cs.findbugs.FindBugs2.main(FindBugs2.java:1231)
Couldn't get class info for java/util/Locale
java.lang.IllegalArgumentException: Unsupported class file major version 66
At org.objectweb.asm.ClassReader.<init>(ClassReader.java:199)
At org.objectweb.asm.ClassReader.<init>(ClassReader.java:180)
At org.objectweb.asm.ClassReader.<init>(ClassReader.java:166)
At edu.umd.cs.findbugs.asm.FBClassReader.<init>(FBClassReader.java:35)
At edu.umd.cs.findbugs.classfile.engine.asm.ClassReaderAnalysisEngine.analyze(ClassReaderAnalysisEngine.java:48)
At edu.umd.cs.findbugs.classfile.engine.asm.ClassReaderAnalysisEngine.analyze(ClassReaderAnalysisEngine.java:34)
At edu.umd.cs.findbugs.classfile.impl.AnalysisCache.getClassAnalysis(AnalysisCache.java:261)
At edu.umd.cs.findbugs.classfile.engine.ClassInfoAnalysisEngine.analyze(ClassInfoAnalysisEngine.java:75)
At edu.umd.cs.findbugs.classfile.engine.ClassInfoAnalysisEngine.analyze(ClassInfoAnalysisEngine.java:38)
At edu.umd.cs.findbugs.classfile.impl.AnalysisCache.getClassAnalysis(AnalysisCache.java:261)
At edu.umd.cs.findbugs.ba.XFactory.getXClass(XFactory.java:693)
At edu.umd.cs.findbugs.ba.AnalysisContext.setAppClassList(AnalysisContext.java:975)
At edu.umd.cs.findbugs.FindBugs2.setAppClassList(FindBugs2.java:909)
At edu.umd.cs.findbugs.FindBugs2.execute(FindBugs2.java:252)
At edu.umd.cs.findbugs.FindBugs.runMain(FindBugs.java:395)
At edu.umd.cs.findbugs.FindBugs2.main(FindBugs2.java:1231)
Couldn't get class info for java/lang/AssertionError
java.lang.IllegalArgumentException: Unsupported class file major version 66
At org.objectweb.asm.ClassReader.<init>(ClassReader.java:199)
At org.objectweb.asm.ClassReader.<init>(ClassReader.java:180)
At org.objectweb.asm.ClassReader.<init>(ClassReader.java:166)
At edu.umd.cs.findbugs.asm.FBClassReader.<init>(FBClassReader.java:35)
At edu.umd.cs.findbugs.classfile.engine.asm.ClassReaderAnalysisEngine.analyze(ClassReaderAnalysisEngine.java:48)
At edu.umd.cs.findbugs.classfile.engine.asm.ClassReaderAnalysisEngine.analyze(ClassReaderAnalysisEngine.java:34)
At edu.umd.cs.findbugs.classfile.impl.AnalysisCache.getClassAnalysis(AnalysisCache.java:261)
At edu.umd.cs.findbugs.classfile.engine.ClassInfoAnalysisEngine.analyze(ClassInfoAnalysisEngine.java:75)
At edu.umd.cs.findbugs.classfile.engine.ClassInfoAnalysisEngine.analyze(ClassInfoAnalysisEngine.java:38)
At edu.umd.cs.findbugs.classfile.impl.AnalysisCache.getClassAnalysis(AnalysisCache.java:261)
At edu.umd.cs.findbugs.ba.XFactory.getXClass(XFactory.java:693)
At edu.umd.cs.findbugs.ba.AnalysisContext.setAppClassList(AnalysisContext.java:975)
At edu.umd.cs.findbugs.FindBugs2.setAppClassList(FindBugs2.java:909)
At edu.umd.cs.findbugs.FindBugs2.execute(FindBugs2.java:252)
At edu.umd.cs.findbugs.FindBugs.runMain(FindBugs.java:395)
At edu.umd.cs.findbugs.FindBugs2.main(FindBugs2.java:1231)
Couldn't get class info for java/lang/NoSuchFieldException
java.lang.IllegalArgumentException: Unsupported class file major version 66
At org.objectweb.asm.ClassReader.<init>(ClassReader.java:199)
At org.objectweb.asm.ClassReader.<init>(ClassReader.java:180)
At org.objectweb.asm.ClassReader.<init>(ClassReader.java:166)
At edu.umd.cs.findbugs.asm.FBClassReader.<init>(FBClassReader.java:35)
At edu.umd.cs.findbugs.classfile.engine.asm.ClassReaderAnalysisEngine.analyze(ClassReaderAnalysisEngine.java:48)
At edu.umd.cs.findbugs.classfile.engine.asm.ClassReaderAnalysisEngine.analyze(ClassReaderAnalysisEngine.java:34)
At edu.umd.cs.findbugs.classfile.impl.AnalysisCache.getClassAnalysis(AnalysisCache.java:261)
At edu.umd.cs.findbugs.classfile.engine.ClassInfoAnalysisEngine.analyze(ClassInfoAnalysisEngine.java:75)
At edu.umd.cs.findbugs.classfile.engine.ClassInfoAnalysisEngine.analyze(ClassInfoAnalysisEngine.java:38)
At edu.umd.cs.findbugs.classfile.impl.AnalysisCache.getClassAnalysis(AnalysisCache.java:261)
At edu.umd.cs.findbugs.ba.XFactory.getXClass(XFactory.java:693)
At edu.umd.cs.findbugs.ba.AnalysisContext.setAppClassList(AnalysisContext.java:975)
At edu.umd.cs.findbugs.FindBugs2.setAppClassList(FindBugs2.java:909)
At edu.umd.cs.findbugs.FindBugs2.execute(FindBugs2.java:252)
At edu.umd.cs.findbugs.FindBugs.runMain(FindBugs.java:395)
At edu.umd.cs.findbugs.FindBugs2.main(FindBugs2.java:1231)
Couldn't get class info for java/util/Set
java.lang.IllegalArgumentException: Unsupported class file major version 66
At org.objectweb.asm.ClassReader.<init>(ClassReader.java:199)
At org.objectweb.asm.ClassReader.<init>(ClassReader.java:180)
At org.objectweb.asm.ClassReader.<init>(ClassReader.java:166)
At edu.umd.cs.findbugs.asm.FBClassReader.<init>(FBClassReader.java:35)
At edu.umd.cs.findbugs.classfile.engine.asm.ClassReaderAnalysisEngine.analyze(ClassReaderAnalysisEngine.java:48)
At edu.umd.cs.findbugs.classfile.engine.asm.ClassReaderAnalysisEngine.analyze(ClassReaderAnalysisEngine.java:34)
At edu.umd.cs.findbugs.classfile.impl.AnalysisCache.getClassAnalysis(AnalysisCache.java:261)
At edu.umd.cs.findbugs.classfile.engine.ClassInfoAnalysisEngine.analyze(ClassInfoAnalysisEngine.java:75)
At edu.umd.cs.findbugs.classfile.engine.ClassInfoAnalysisEngine.analyze(ClassInfoAnalysisEngine.java:38)
At edu.umd.cs.findbugs.classfile.impl.AnalysisCache.getClassAnalysis(AnalysisCache.java:261)
At edu.umd.cs.findbugs.ba.XFactory.getXClass(XFactory.java:693)
At edu.umd.cs.findbugs.ba.AnalysisContext.setAppClassList(AnalysisContext.java:975)
At edu.umd.cs.findbugs.FindBugs2.setAppClassList(FindBugs2.java:909)
At edu.umd.cs.findbugs.FindBugs2.execute(FindBugs2.java:252)
At edu.umd.cs.findbugs.FindBugs.runMain(FindBugs.java:395)
At edu.umd.cs.findbugs.FindBugs2.main(FindBugs2.java:1231)
Couldn't get class info for javax/xml/stream/util/StreamReaderDelegate
java.lang.IllegalArgumentException: Unsupported class file major version 66
At org.objectweb.asm.ClassReader.<init>(ClassReader.java:199)
At org.objectweb.asm.ClassReader.<init>(ClassReader.java:180)
At org.objectweb.asm.ClassReader.<init>(ClassReader.java:166)
At edu.umd.cs.findbugs.asm.FBClassReader.<init>(FBClassReader.java:35)
At edu.umd.cs.findbugs.classfile.engine.asm.ClassReaderAnalysisEngine.analyze(ClassReaderAnalysisEngine.java:48)
At edu.umd.cs.findbugs.classfile.engine.asm.ClassReaderAnalysisEngine.analyze(ClassReaderAnalysisEngine.java:34)
At edu.umd.cs.findbugs.classfile.impl.AnalysisCache.getClassAnalysis(AnalysisCache.java:261)
At edu.umd.cs.findbugs.classfile.engine.ClassInfoAnalysisEngine.analyze(ClassInfoAnalysisEngine.java:75)
At edu.umd.cs.findbugs.classfile.engine.ClassInfoAnalysisEngine.analyze(ClassInfoAnalysisEngine.java:38)
At edu.umd.cs.findbugs.classfile.impl.AnalysisCache.getClassAnalysis(AnalysisCache.java:261)
At edu.umd.cs.findbugs.FindBugs2.buildReferencedClassSet(FindBugs2.java:806)
At edu.umd.cs.findbugs.FindBugs2.execute(FindBugs2.java:249)
At edu.umd.cs.findbugs.FindBugs.runMain(FindBugs.java:395)
At edu.umd.cs.findbugs.FindBugs2.main(FindBugs2.java:1231)
java.lang.IllegalArgumentException: Unsupported class file major version 66
at org.objectweb.asm.ClassReader.<init>(ClassReader.java:199)
at org.objectweb.asm.ClassReader.<init>(ClassReader.java:180)
at org.objectweb.asm.ClassReader.<init>(ClassReader.java:166)
at edu.umd.cs.findbugs.asm.FBClassReader.<init>(FBClassReader.java:35)
at edu.umd.cs.findbugs.classfile.engine.asm.ClassReaderAnalysisEngine.analyze(ClassReaderAnalysisEngine.java:48)
at edu.umd.cs.findbugs.classfile.engine.asm.ClassReaderAnalysisEngine.analyze(ClassReaderAnalysisEngine.java:34)
at edu.umd.cs.findbugs.classfile.impl.AnalysisCache.getClassAnalysis(AnalysisCache.java:261)
at edu.umd.cs.findbugs.classfile.engine.ClassInfoAnalysisEngine.analyze(ClassInfoAnalysisEngine.java:75)
at edu.umd.cs.findbugs.classfile.engine.ClassInfoAnalysisEngine.analyze(ClassInfoAnalysisEngine.java:38)
at edu.umd.cs.findbugs.classfile.impl.AnalysisCache.getClassAnalysis(AnalysisCache.java:261)
at edu.umd.cs.findbugs.ba.XFactory.getXClass(XFactory.java:693)
at edu.umd.cs.findbugs.ba.AnalysisContext.setAppClassList(AnalysisContext.java:975)
at edu.umd.cs.findbugs.FindBugs2.setAppClassList(FindBugs2.java:909)
at edu.umd.cs.findbugs.FindBugs2.execute(FindBugs2.java:252)
at edu.umd.cs.findbugs.FindBugs.runMain(FindBugs.java:395)
at edu.umd.cs.findbugs.FindBugs2.main(FindBugs2.java:1231)
SpotBugs ended with exit code 4
> Task :test
ParserTest > testXmlInputFactoryPropertyDefaults() FAILED
org.opentest4j.AssertionFailedError at ParserTest.java:70
ParserTest > testXmlInputFactoryPropertyOverrides() FAILED
org.opentest4j.AssertionFailedError at ParserTest.java:81
2963 tests completed, 2 failed, 170 skipped
> Task :test FAILED
FAILURE: Build failed with an exception.
* What went wrong:
Execution failed for task ':test'.
> There were failing tests. See the report at: file://<https://ci-builds.apache.org/job/POI/job/POI-XMLBeans-DSL-1.22/ws/build/reports/tests/test/index.html>
* Try:
> Run with --scan to get full insights.
Deprecated Gradle features were used in this build, making it incompatible with Gradle 9.0.
You can use '--warning-mode all' to show the individual deprecation warnings and determine if they come from your own scripts or plugins.
For more on this, please refer to https://docs.gradle.org/8.4/userguide/command_line_interface.html#sec:command_line_warnings in the Gradle documentation.
BUILD FAILED in 7m 18s
45 actionable tasks: 43 executed, 2 from cache
Build step 'Invoke Gradle script' changed build result to FAILURE
Build step 'Invoke Gradle script' marked build as failure
ERROR: Not all environment variables could be successfully injected. Check for similarly-named environment variables.
Archiving artifacts
ERROR: Not all environment variables could be successfully injected. Check for similarly-named environment variables.
Recording test results
ERROR: Not all environment variables could be successfully injected. Check for similarly-named environment variables.
[Checks API] No suitable checks publisher found.
[SpotBugs] Skipping execution of recorder since overall result is 'FAILURE'
ERROR: Not all environment variables could be successfully injected. Check for similarly-named environment variables.
---------------------------------------------------------------------
To unsubscribe, e-mail: dev-unsubscribe@poi.apache.org
For additional commands, e-mail: dev-help@poi.apache.org
Build failed in Jenkins: POI » POI-XMLBeans-DSL-1.22 #13
Posted by Apache Jenkins Server <je...@builds.apache.org>.
See <https://ci-builds.apache.org/job/POI/job/POI-XMLBeans-DSL-1.22/13/display/redirect?page=changes>
Changes:
[PJ Fanning] [XMLBEANS-617] add recurseSourceSubdirs support to maven plugin
[PJ Fanning] [XMLBEANS-647] update maven plugin dependencies
[PJ Fanning] 5.2.1-SNAPSHOT
[PJ Fanning] javadoc
[PJ Fanning] 2024
------------------------------------------
Started by an SCM change
Running as SYSTEM
ERROR: Not all environment variables could be successfully injected. Check for similarly-named environment variables.
[EnvInject] - Loading node environment variables.
[EnvInject] - Preparing an environment for the build.
[EnvInject] - Keeping Jenkins system variables.
[EnvInject] - Keeping Jenkins build variables.
[EnvInject] - Injecting as environment variables the properties content
FORREST_HOME=/home/jenkins/tools/forrest/latest
LANG=en_US.UTF-8
[EnvInject] - Variables injected successfully.
[EnvInject] - Injecting contributions.
Building remotely on builds29 (ubuntu) in workspace <https://ci-builds.apache.org/job/POI/job/POI-XMLBeans-DSL-1.22/ws/>
ERROR: Not all environment variables could be successfully injected. Check for similarly-named environment variables.
Updating https://svn.apache.org/repos/asf/xmlbeans/trunk at revision '2024-01-07T11:52:08.645 +0000'
A src/main/java/org/apache/xmlbeans/impl/tool/FileUtil.java
U src/main/java/org/apache/xmlbeans/impl/tool/MavenPlugin.java
U src/main/java/org/apache/xmlbeans/impl/util/HexBin.java
U src/main/java9/module-info.class
U src/main/maven/plugin.xml
U src/main/maven/org.apache.xmlbeans/xmlbeans/pom.xml
A src/test/java/org/apache/xmlbeans/impl/tool/FileUtilTest.java
U build.gradle
U build.xml
U gradle.properties
U README.txt
U LICENSE-binary.txt
At revision 1915110
ERROR: Not all environment variables could be successfully injected. Check for similarly-named environment variables.
[POI-XMLBeans-DSL-1.22] $ /bin/sh -xe /tmp/jenkins15705889402829715019.sh
+ rm -rf examples excelant integrationtest main ooxml ooxml-schema scratchpad build.javacheck.xml
+ svn status
+ svn revert poi*/src/*/java9/module-info.*
svn: E155010: The node '<https://ci-builds.apache.org/job/POI/job/POI-XMLBeans-DSL-1.22/ws/poi*/src/*'> was not found.
+ true
+ svn revert src/resources/ooxml-lite-report.*
Skipped 'src/resources/ooxml-lite-report.*'
+ echo Java-Home: /home/jenkins/tools/java/latest22
Java-Home: /home/jenkins/tools/java/latest22
+ ls -al /home/jenkins/tools/java/latest22/
total 36
drwxr-xr-x 8 root root 4096 Nov 14 23:42 .
drwxrwxr-x 38 root root 4096 Dec 14 18:02 ..
drwxr-xr-x 2 root root 4096 Nov 14 23:42 bin
drwxr-xr-x 5 root root 4096 Nov 14 23:42 conf
drwxr-xr-x 3 root root 4096 Nov 14 23:42 include
drwxr-xr-x 2 root root 4096 Nov 14 23:42 jmods
drwxr-xr-x 71 root root 4096 Nov 14 23:42 legal
drwxr-xr-x 5 root root 4096 Nov 14 23:42 lib
-rw-r--r-- 1 root root 1220 Oct 18 14:34 release
+ ls -al /home/jenkins/tools/java/latest22/bin
total 472
drwxr-xr-x 2 root root 4096 Nov 14 23:42 .
drwxr-xr-x 8 root root 4096 Nov 14 23:42 ..
-rwxr-xr-x 1 root root 12384 Oct 18 14:34 jar
-rwxr-xr-x 1 root root 12392 Oct 18 14:34 jarsigner
-rwxr-xr-x 1 root root 12328 Oct 18 14:34 java
-rwxr-xr-x 1 root root 12416 Oct 18 14:34 javac
-rwxr-xr-x 1 root root 12424 Oct 18 14:34 javadoc
-rwxr-xr-x 1 root root 12384 Oct 18 14:34 javap
-rwxr-xr-x 1 root root 12384 Oct 18 14:34 jcmd
-rwxr-xr-x 1 root root 12456 Oct 18 14:34 jconsole
-rwxr-xr-x 1 root root 12384 Oct 18 14:34 jdb
-rwxr-xr-x 1 root root 12392 Oct 18 14:34 jdeprscan
-rwxr-xr-x 1 root root 12384 Oct 18 14:34 jdeps
-rwxr-xr-x 1 root root 12384 Oct 18 14:34 jfr
-rwxr-xr-x 1 root root 12384 Oct 18 14:34 jhsdb
-rwxr-xr-x 1 root root 12392 Oct 18 14:34 jimage
-rwxr-xr-x 1 root root 12416 Oct 18 14:34 jinfo
-rwxr-xr-x 1 root root 12416 Oct 18 14:34 jlink
-rwxr-xr-x 1 root root 12416 Oct 18 14:34 jmap
-rwxr-xr-x 1 root root 12384 Oct 18 14:34 jmod
-rwxr-xr-x 1 root root 12392 Oct 18 14:34 jpackage
-rwxr-xr-x 1 root root 12384 Oct 18 14:34 jps
-rwxr-xr-x 1 root root 12424 Oct 18 14:34 jrunscript
-rwxr-xr-x 1 root root 12392 Oct 18 14:34 jshell
-rwxr-xr-x 1 root root 12424 Oct 18 14:34 jstack
-rwxr-xr-x 1 root root 12384 Oct 18 14:34 jstat
-rwxr-xr-x 1 root root 12392 Oct 18 14:34 jstatd
-rwxr-xr-x 1 root root 12392 Oct 18 14:34 jwebserver
-rwxr-xr-x 1 root root 12392 Oct 18 14:34 keytool
-rwxr-xr-x 1 root root 12416 Oct 18 14:34 rmiregistry
-rwxr-xr-x 1 root root 12392 Oct 18 14:34 serialver
+ /home/jenkins/tools/java/latest22/bin/java -version
openjdk version "22-ea" 2024-03-19
OpenJDK Runtime Environment (build 22-ea+20-1570)
OpenJDK 64-Bit Server VM (build 22-ea+20-1570, mixed mode, sharing)
+ echo which java
which java
+ which java
/home/jenkins/tools/java/latest22/bin/java
+ java -version
openjdk version "22-ea" 2024-03-19
OpenJDK Runtime Environment (build 22-ea+20-1570)
OpenJDK 64-Bit Server VM (build 22-ea+20-1570, mixed mode, sharing)
+ echo which javac
which javac
+ which javac
/home/jenkins/tools/java/latest22/bin/javac
+ javac -version
javac 22-ea
+ echo Ant-Home:
Ant-Home:
+ ls -al
total 416
drwxr-xr-x 11 jenkins jenkins 4096 Jan 7 11:52 .
drwxr-xr-x 6 jenkins jenkins 4096 Jan 6 00:33 ..
-rw-r--r-- 1 jenkins jenkins 29241 Jan 7 11:52 build.gradle
-rw-r--r-- 1 jenkins jenkins 54101 Jan 7 11:52 build.xml
-rw-r--r-- 1 jenkins jenkins 11963 Dec 17 11:52 CHANGES.txt
drwxr-xr-x 3 jenkins jenkins 4096 Dec 17 11:52 .github
-rw-r--r-- 1 jenkins jenkins 14 Dec 17 11:52 .gitignore
drwxr-xr-x 5 jenkins jenkins 4096 Dec 17 11:52 .gradle
drwxr-xr-x 3 jenkins jenkins 4096 Dec 17 11:52 gradle
-rw-r--r-- 1 jenkins jenkins 1338 Jan 7 11:52 gradle.properties
-rwxr-xr-x 1 jenkins jenkins 9125 Dec 17 11:52 gradlew
-rw-r--r-- 1 jenkins jenkins 176157 Dec 17 11:52 KEYS
drwxr-xr-x 2 jenkins jenkins 4096 Dec 17 11:52 legal
-rwxr-xr-x 1 jenkins jenkins 12458 Jan 7 11:52 LICENSE-binary.txt
-rwxr-xr-x 1 jenkins jenkins 11884 Dec 17 11:52 LICENSE.txt
-rw-r--r-- 1 jenkins jenkins 2561 Dec 17 11:52 NOTICE-binary.txt
-rw-r--r-- 1 jenkins jenkins 1592 Dec 17 11:52 NOTICE.txt
-rw-r--r-- 1 jenkins jenkins 2227 Jan 7 11:52 README.txt
-rw-r--r-- 1 jenkins jenkins 10995 Dec 17 11:52 release-guide.txt
drwxr-xr-x 16 jenkins jenkins 4096 Dec 17 11:52 samples
-rw-r--r-- 1 jenkins jenkins 238 Dec 17 11:52 SECURITY.md
-rw-r--r-- 1 jenkins jenkins 661 Dec 17 11:52 settings.gradle
drwxr-xr-x 4 jenkins jenkins 4096 Dec 17 11:52 src
-rw-r--r-- 1 jenkins jenkins 359 Dec 17 11:52 STATUS
drwxr-xr-x 4 jenkins jenkins 4096 Jan 7 11:52 .svn
drwxr-xr-x 4 jenkins jenkins 4096 Dec 17 11:52 test
-rw-r--r-- 1 jenkins jenkins 3803 Dec 17 11:52 wrapper.gradle
-rw-r--r-- 1 jenkins jenkins 25 Dec 17 11:52 xbeanenv.cmd
-rwxr-xr-x 1 jenkins jenkins 27 Dec 17 11:52 xbeanenv.sh
drwxr-xr-x 2 jenkins jenkins 4096 Dec 17 11:52 xkit
+ echo which ant
which ant
+ which ant
/usr/bin/ant
+ ant -version
Apache Ant(TM) version 1.10.12 compiled on January 17 1970
+ echo <project default="test"><target name="test"><echo>Java ${ant.java.version}/${java.version}</echo><exec executable="javac"><arg value="-version"/></exec></target></project>
+ ant -f build.javacheck.xml -v
Apache Ant(TM) version 1.10.12 compiled on January 17 1970
Buildfile: <https://ci-builds.apache.org/job/POI/job/POI-XMLBeans-DSL-1.22/ws/build.javacheck.xml>
Detected Java version: 22 in: /usr/local/asfpackages/java/openjdk-22-ea+20
Detected OS: Linux
parsing buildfile <https://ci-builds.apache.org/job/POI/job/POI-XMLBeans-DSL-1.22/ws/build.javacheck.xml> with URI = <https://ci-builds.apache.org/job/POI/job/POI-XMLBeans-DSL-1.22/ws/build.javacheck.xml>
Project base dir set to: <https://ci-builds.apache.org/job/POI/job/POI-XMLBeans-DSL-1.22/ws/>
Build sequence for target(s) `test' is [test]
Complete build sequence is [test, ]
test:
parsing buildfile jar:file:/usr/share/ant/lib/ant.jar!/org/apache/tools/ant/antlib.xml with URI = jar:file:/usr/share/ant/lib/ant.jar!/org/apache/tools/ant/antlib.xml from a zip file
[echo] Java 22/22-ea
[exec] Current OS is Linux
[exec] Executing 'javac' with arguments:
[exec] '-version'
[exec]
[exec] The ' characters around the executable and arguments are
[exec] not part of the command.
[exec] javac 22-ea
BUILD SUCCESSFUL
Total time: 1 second
+ exit 0
[Gradle] - Launching build.
ERROR: Not all environment variables could be successfully injected. Check for similarly-named environment variables.
[POI-XMLBeans-DSL-1.22] $ <https://ci-builds.apache.org/job/POI/job/POI-XMLBeans-DSL-1.22/ws/gradlew> clean jenkins jacocoTestReport
To honour the JVM settings for this build a single-use Daemon process will be forked. For more on this, please refer to https://docs.gradle.org/8.4/userguide/gradle_daemon.html#sec:disabling_the_daemon in the Gradle documentation.
Daemon will be stopped at the end of the build
Configuration on demand is an incubating feature.
FAILURE: Build failed with an exception.
* Where:
Build file '<https://ci-builds.apache.org/job/POI/job/POI-XMLBeans-DSL-1.22/ws/build.gradle'> line: 37
* What went wrong:
An exception occurred applying plugin request [id: 'de.thetaphi.forbiddenapis', version: '3.4']
> Failed to apply plugin 'de.thetaphi.forbiddenapis'.
> Could not create plugin of type 'ForbiddenApisPlugin'.
> BUG! exception in phase 'semantic analysis' in source unit 'jar:file:/home/jenkins/.gradle/caches/modules-2/files-2.1/de.thetaphi/forbiddenapis/3.4/413c25496dd3128964ee80c8778b92138156de7c/forbiddenapis-3.4.jar!/de/thetaphi/forbiddenapis/gradle/plugin-init.groovy' Unsupported class file major version 66
* Try:
> Run with --stacktrace option to get the stack trace.
> Run with --info or --debug option to get more log output.
> Run with --scan to get full insights.
> Get more help at https://help.gradle.org.
BUILD FAILED in 12s
Build step 'Invoke Gradle script' changed build result to FAILURE
Build step 'Invoke Gradle script' marked build as failure
ERROR: Not all environment variables could be successfully injected. Check for similarly-named environment variables.
Archiving artifacts
ERROR: Not all environment variables could be successfully injected. Check for similarly-named environment variables.
Recording test results
ERROR: Not all environment variables could be successfully injected. Check for similarly-named environment variables.
ERROR: Step ‘Publish JUnit test result report’ failed: No test report files were found. Configuration error?
[SpotBugs] Skipping execution of recorder since overall result is 'FAILURE'
ERROR: Not all environment variables could be successfully injected. Check for similarly-named environment variables.
---------------------------------------------------------------------
To unsubscribe, e-mail: dev-unsubscribe@poi.apache.org
For additional commands, e-mail: dev-help@poi.apache.org
Build failed in Jenkins: POI » POI-XMLBeans-DSL-1.22 #12
Posted by Apache Jenkins Server <je...@builds.apache.org>.
See <https://ci-builds.apache.org/job/POI/job/POI-XMLBeans-DSL-1.22/12/display/redirect?page=changes>
Changes:
[PJ Fanning] saxon 12.4 and log4j 2.22.1
------------------------------------------
[...truncated 169.18 KB...]
A test/perf/bin/xerces.bat
AU test/perf/bin/castor.bat
A test/perf/bin/run_xmlbeans_nonmemory.bat
A test/perf/bin/run_svn.bat
A test/perf/bin/run_svn_nonmemory.bat
A test/perf/bin/run_svn.sh
A test/perf/bin/run_v1_nonmemory.bat
A test/perf/bin/run_v2_nonmemory.bat
A test/perf/bin/run_xerces_nonmemory.bat
A test/perf/bin/run_all.sh
A test/perf/bin/run_v2.sh
A test/perf/bin/run_v1.bat
A test/perf/bin/run_v2.bat
A test/perf/bin/run_jaxb.sh
A test/perf/bin/run_xerces.bat
A test/perf/bin/run_v1.sh
A test/perf/bin/run_castor.bat
A test/perf/bin/run_xerces.sh
A test/perf/bin/run_castor.sh
A test/perf/bin/run_jaxb.bat
A test/perf/bin/v1.sh
A test/perf/bin/jibx.sh
A test/perf/bin/run_jibx.bat
AU test/perf/bin/v1.bat
AU test/perf/bin/jibx.bat
A test/perf/bin/castor.properties
A test/perf/bin/run_jibx.sh
A test/perf/download.properties
A test/perf/cases
AU test/perf/cases/parser_instances.zip
A test/perf/cases/xsd
A test/perf/cases/xsd/non-primitives.xsd
A test/perf/cases/xsd/purchase-order-1.xml
A test/perf/cases/xsd/purchase-order.xsd
A test/perf/cases/xsd/purchase-order-2.xml
A test/perf/cases/xsd/purchase-order-3.xml
A test/perf/cases/xsd/doc.xsd
A test/perf/cases/xsd/purchase-order-4.xml
A test/perf/cases/xsd/purchase-order-5.xml
A test/perf/cases/xsd/purchase-order-6.xml
A test/perf/cases/xsd/purchase-order-7.xml
A test/perf/cases/xsd/purchase-order-jibxbinding.xml
A test/perf/cases/xsd/perf-results.xsd
A test/perf/cases/xsd/primitives.xsd
A test/perf/results.xml
AU test/perf/env.sh
AU test/perf/env.bat
A test/docs
AU test/docs/BuildingAndRunningTests.txt
AU test/docs/TestOrganization.txt
AU test/readme.txt
AU STATUS
A release-guide.txt
AU LICENSE.txt
A .github
A .github/workflows
A .github/workflows/test-gradle.yml
A .github/workflows/codeql-analysis.yml
A wrapper.gradle
AU NOTICE.txt
AU NOTICE-binary.txt
AU README.txt
A xkit
AU xkit/doap_XMLBeans.rdf
AU xkit/README.txt
A legal
A legal/HEADER
A KEYS
A settings.gradle
A SECURITY.md
A CHANGES.txt
A .gitignore
AU xbeanenv.sh
AU xbeanenv.cmd
U .
At revision 1915020
ERROR: Not all environment variables could be successfully injected. Check for similarly-named environment variables.
[POI-XMLBeans-DSL-1.22] $ /bin/sh -xe /tmp/jenkins10304551332307563409.sh
+ rm -rf examples excelant integrationtest main ooxml ooxml-schema scratchpad build.javacheck.xml
+ svn status
+ svn revert poi*/src/*/java9/module-info.*
svn: E155010: The node '<https://ci-builds.apache.org/job/POI/job/POI-XMLBeans-DSL-1.22/ws/poi*/src/*'> was not found.
+ true
+ svn revert src/resources/ooxml-lite-report.*
Skipped 'src/resources/ooxml-lite-report.*'
+ echo Java-Home: /home/jenkins/tools/java/latest22
Java-Home: /home/jenkins/tools/java/latest22
+ ls -al /home/jenkins/tools/java/latest22/
total 36
drwxr-xr-x 8 root root 4096 Nov 7 23:42 .
drwxrwxr-x 38 root root 4096 Dec 14 17:45 ..
drwxr-xr-x 2 root root 4096 Nov 7 23:42 bin
drwxr-xr-x 5 root root 4096 Nov 7 23:42 conf
drwxr-xr-x 3 root root 4096 Nov 7 23:42 include
drwxr-xr-x 2 root root 4096 Nov 7 23:42 jmods
drwxr-xr-x 71 root root 4096 Nov 7 23:42 legal
drwxr-xr-x 5 root root 4096 Nov 7 23:42 lib
-rw-r--r-- 1 root root 1220 Oct 18 14:34 release
+ ls -al /home/jenkins/tools/java/latest22/bin
total 472
drwxr-xr-x 2 root root 4096 Nov 7 23:42 .
drwxr-xr-x 8 root root 4096 Nov 7 23:42 ..
-rwxr-xr-x 1 root root 12384 Oct 18 14:34 jar
-rwxr-xr-x 1 root root 12392 Oct 18 14:34 jarsigner
-rwxr-xr-x 1 root root 12328 Oct 18 14:34 java
-rwxr-xr-x 1 root root 12416 Oct 18 14:34 javac
-rwxr-xr-x 1 root root 12424 Oct 18 14:34 javadoc
-rwxr-xr-x 1 root root 12384 Oct 18 14:34 javap
-rwxr-xr-x 1 root root 12384 Oct 18 14:34 jcmd
-rwxr-xr-x 1 root root 12456 Oct 18 14:34 jconsole
-rwxr-xr-x 1 root root 12384 Oct 18 14:34 jdb
-rwxr-xr-x 1 root root 12392 Oct 18 14:34 jdeprscan
-rwxr-xr-x 1 root root 12384 Oct 18 14:34 jdeps
-rwxr-xr-x 1 root root 12384 Oct 18 14:34 jfr
-rwxr-xr-x 1 root root 12384 Oct 18 14:34 jhsdb
-rwxr-xr-x 1 root root 12392 Oct 18 14:34 jimage
-rwxr-xr-x 1 root root 12416 Oct 18 14:34 jinfo
-rwxr-xr-x 1 root root 12416 Oct 18 14:34 jlink
-rwxr-xr-x 1 root root 12416 Oct 18 14:34 jmap
-rwxr-xr-x 1 root root 12384 Oct 18 14:34 jmod
-rwxr-xr-x 1 root root 12392 Oct 18 14:34 jpackage
-rwxr-xr-x 1 root root 12384 Oct 18 14:34 jps
-rwxr-xr-x 1 root root 12424 Oct 18 14:34 jrunscript
-rwxr-xr-x 1 root root 12392 Oct 18 14:34 jshell
-rwxr-xr-x 1 root root 12424 Oct 18 14:34 jstack
-rwxr-xr-x 1 root root 12384 Oct 18 14:34 jstat
-rwxr-xr-x 1 root root 12392 Oct 18 14:34 jstatd
-rwxr-xr-x 1 root root 12392 Oct 18 14:34 jwebserver
-rwxr-xr-x 1 root root 12392 Oct 18 14:34 keytool
-rwxr-xr-x 1 root root 12416 Oct 18 14:34 rmiregistry
-rwxr-xr-x 1 root root 12392 Oct 18 14:34 serialver
+ /home/jenkins/tools/java/latest22/bin/java -version
openjdk version "22-ea" 2024-03-19
OpenJDK Runtime Environment (build 22-ea+20-1570)
OpenJDK 64-Bit Server VM (build 22-ea+20-1570, mixed mode, sharing)
+ echo which java
which java
+ which java
/home/jenkins/tools/java/latest22/bin/java
+ java -version
openjdk version "22-ea" 2024-03-19
OpenJDK Runtime Environment (build 22-ea+20-1570)
OpenJDK 64-Bit Server VM (build 22-ea+20-1570, mixed mode, sharing)
+ echo which javac
which javac
+ which javac
/home/jenkins/tools/java/latest22/bin/javac
+ javac -version
javac 22-ea
+ echo Ant-Home:
Ant-Home:
+ ls -al
total 412
drwxr-xr-x 10 jenkins jenkins 4096 Dec 31 11:52 .
drwxr-xr-x 7 jenkins jenkins 4096 Dec 28 00:47 ..
-rw-r--r-- 1 jenkins jenkins 29240 Dec 31 11:52 build.gradle
-rw-r--r-- 1 jenkins jenkins 54099 Dec 31 11:52 build.xml
-rw-r--r-- 1 jenkins jenkins 11963 Dec 31 11:52 CHANGES.txt
drwxr-xr-x 3 jenkins jenkins 4096 Dec 31 11:52 .github
-rw-r--r-- 1 jenkins jenkins 14 Dec 31 11:52 .gitignore
drwxr-xr-x 3 jenkins jenkins 4096 Dec 31 11:52 gradle
-rw-r--r-- 1 jenkins jenkins 1337 Dec 31 11:52 gradle.properties
-rwxr-xr-x 1 jenkins jenkins 9125 Dec 31 11:52 gradlew
-rw-r--r-- 1 jenkins jenkins 176157 Dec 31 11:52 KEYS
drwxr-xr-x 2 jenkins jenkins 4096 Dec 31 11:52 legal
-rwxr-xr-x 1 jenkins jenkins 12458 Dec 31 11:52 LICENSE-binary.txt
-rwxr-xr-x 1 jenkins jenkins 11884 Dec 31 11:52 LICENSE.txt
-rw-r--r-- 1 jenkins jenkins 2561 Dec 31 11:52 NOTICE-binary.txt
-rw-r--r-- 1 jenkins jenkins 1592 Dec 31 11:52 NOTICE.txt
-rw-r--r-- 1 jenkins jenkins 2227 Dec 31 11:52 README.txt
-rw-r--r-- 1 jenkins jenkins 10995 Dec 31 11:52 release-guide.txt
drwxr-xr-x 16 jenkins jenkins 4096 Dec 31 11:52 samples
-rw-r--r-- 1 jenkins jenkins 238 Dec 31 11:52 SECURITY.md
-rw-r--r-- 1 jenkins jenkins 661 Dec 31 11:52 settings.gradle
drwxr-xr-x 4 jenkins jenkins 4096 Dec 31 11:52 src
-rw-r--r-- 1 jenkins jenkins 359 Dec 31 11:52 STATUS
drwxr-xr-x 4 jenkins jenkins 4096 Dec 31 11:52 .svn
drwxr-xr-x 4 jenkins jenkins 4096 Dec 31 11:52 test
-rw-r--r-- 1 jenkins jenkins 3803 Dec 31 11:52 wrapper.gradle
-rw-r--r-- 1 jenkins jenkins 25 Dec 31 11:52 xbeanenv.cmd
-rwxr-xr-x 1 jenkins jenkins 27 Dec 31 11:52 xbeanenv.sh
drwxr-xr-x 2 jenkins jenkins 4096 Dec 31 11:52 xkit
+ echo which ant
which ant
+ which ant
/usr/bin/ant
+ ant -version
Apache Ant(TM) version 1.10.12 compiled on January 17 1970
+ echo <project default="test"><target name="test"><echo>Java ${ant.java.version}/${java.version}</echo><exec executable="javac"><arg value="-version"/></exec></target></project>
+ ant -f build.javacheck.xml -v
Apache Ant(TM) version 1.10.12 compiled on January 17 1970
Buildfile: <https://ci-builds.apache.org/job/POI/job/POI-XMLBeans-DSL-1.22/ws/build.javacheck.xml>
Detected Java version: 22 in: /usr/local/asfpackages/java/openjdk-22-ea+20
Detected OS: Linux
parsing buildfile <https://ci-builds.apache.org/job/POI/job/POI-XMLBeans-DSL-1.22/ws/build.javacheck.xml> with URI = <https://ci-builds.apache.org/job/POI/job/POI-XMLBeans-DSL-1.22/ws/build.javacheck.xml>
Project base dir set to: <https://ci-builds.apache.org/job/POI/job/POI-XMLBeans-DSL-1.22/ws/>
Build sequence for target(s) `test' is [test]
Complete build sequence is [test, ]
test:
parsing buildfile jar:file:/usr/share/ant/lib/ant.jar!/org/apache/tools/ant/antlib.xml with URI = jar:file:/usr/share/ant/lib/ant.jar!/org/apache/tools/ant/antlib.xml from a zip file
[echo] Java 22/22-ea
[exec] Current OS is Linux
[exec] Executing 'javac' with arguments:
[exec] '-version'
[exec]
[exec] The ' characters around the executable and arguments are
[exec] not part of the command.
[exec] javac 22-ea
BUILD SUCCESSFUL
Total time: 0 seconds
+ exit 0
[Gradle] - Launching build.
ERROR: Not all environment variables could be successfully injected. Check for similarly-named environment variables.
[POI-XMLBeans-DSL-1.22] $ <https://ci-builds.apache.org/job/POI/job/POI-XMLBeans-DSL-1.22/ws/gradlew> clean jenkins jacocoTestReport
To honour the JVM settings for this build a single-use Daemon process will be forked. For more on this, please refer to https://docs.gradle.org/8.4/userguide/gradle_daemon.html#sec:disabling_the_daemon in the Gradle documentation.
Daemon will be stopped at the end of the build
Configuration on demand is an incubating feature.
FAILURE: Build failed with an exception.
* Where:
Build file '<https://ci-builds.apache.org/job/POI/job/POI-XMLBeans-DSL-1.22/ws/build.gradle'> line: 37
* What went wrong:
An exception occurred applying plugin request [id: 'de.thetaphi.forbiddenapis', version: '3.4']
> Failed to apply plugin 'de.thetaphi.forbiddenapis'.
> Could not create plugin of type 'ForbiddenApisPlugin'.
> BUG! exception in phase 'semantic analysis' in source unit 'jar:file:/home/jenkins/.gradle/caches/modules-2/files-2.1/de.thetaphi/forbiddenapis/3.4/413c25496dd3128964ee80c8778b92138156de7c/forbiddenapis-3.4.jar!/de/thetaphi/forbiddenapis/gradle/plugin-init.groovy' Unsupported class file major version 66
* Try:
> Run with --stacktrace option to get the stack trace.
> Run with --info or --debug option to get more log output.
> Run with --scan to get full insights.
> Get more help at https://help.gradle.org.
BUILD FAILED in 7s
Build step 'Invoke Gradle script' changed build result to FAILURE
Build step 'Invoke Gradle script' marked build as failure
ERROR: Not all environment variables could be successfully injected. Check for similarly-named environment variables.
Archiving artifacts
ERROR: Not all environment variables could be successfully injected. Check for similarly-named environment variables.
Recording test results
ERROR: Not all environment variables could be successfully injected. Check for similarly-named environment variables.
ERROR: Step ‘Publish JUnit test result report’ failed: No test report files were found. Configuration error?
[SpotBugs] Skipping execution of recorder since overall result is 'FAILURE'
ERROR: Not all environment variables could be successfully injected. Check for similarly-named environment variables.
---------------------------------------------------------------------
To unsubscribe, e-mail: dev-unsubscribe@poi.apache.org
For additional commands, e-mail: dev-help@poi.apache.org
Build failed in Jenkins: POI » POI-XMLBeans-DSL-1.22 #11
Posted by Apache Jenkins Server <je...@builds.apache.org>.
See <https://ci-builds.apache.org/job/POI/job/POI-XMLBeans-DSL-1.22/11/display/redirect?page=changes>
Changes:
[PJ Fanning] [XMLBEANS-644] support generating source when there are elements and attributes with clashing names
------------------------------------------
[...truncated 169.15 KB...]
AU test/perf/bin/castor.bat
A test/perf/bin/run_xmlbeans_nonmemory.bat
A test/perf/bin/run_svn.bat
A test/perf/bin/run_svn_nonmemory.bat
A test/perf/bin/run_svn.sh
A test/perf/bin/run_v1_nonmemory.bat
A test/perf/bin/run_v2_nonmemory.bat
A test/perf/bin/run_xerces_nonmemory.bat
A test/perf/bin/run_all.sh
A test/perf/bin/run_v2.sh
A test/perf/bin/run_v1.bat
A test/perf/bin/run_v2.bat
A test/perf/bin/run_jaxb.sh
A test/perf/bin/run_xerces.bat
A test/perf/bin/run_v1.sh
A test/perf/bin/run_castor.bat
A test/perf/bin/run_xerces.sh
A test/perf/bin/run_castor.sh
A test/perf/bin/run_jaxb.bat
A test/perf/bin/v1.sh
A test/perf/bin/jibx.sh
A test/perf/bin/run_jibx.bat
AU test/perf/bin/v1.bat
AU test/perf/bin/jibx.bat
A test/perf/bin/castor.properties
A test/perf/bin/run_jibx.sh
A test/perf/download.properties
A test/perf/cases
AU test/perf/cases/parser_instances.zip
A test/perf/cases/xsd
A test/perf/cases/xsd/non-primitives.xsd
A test/perf/cases/xsd/purchase-order-1.xml
A test/perf/cases/xsd/purchase-order.xsd
A test/perf/cases/xsd/purchase-order-2.xml
A test/perf/cases/xsd/purchase-order-3.xml
A test/perf/cases/xsd/doc.xsd
A test/perf/cases/xsd/purchase-order-4.xml
A test/perf/cases/xsd/purchase-order-5.xml
A test/perf/cases/xsd/purchase-order-6.xml
A test/perf/cases/xsd/purchase-order-7.xml
A test/perf/cases/xsd/purchase-order-jibxbinding.xml
A test/perf/cases/xsd/perf-results.xsd
A test/perf/cases/xsd/primitives.xsd
A test/perf/results.xml
AU test/perf/env.sh
AU test/perf/env.bat
A test/docs
AU test/docs/BuildingAndRunningTests.txt
AU test/docs/TestOrganization.txt
AU test/readme.txt
AU LICENSE-binary.txt
AU STATUS
A release-guide.txt
AU LICENSE.txt
A .github
A .github/workflows
A .github/workflows/test-gradle.yml
A .github/workflows/codeql-analysis.yml
A wrapper.gradle
AU NOTICE.txt
AU NOTICE-binary.txt
AU README.txt
A xkit
AU xkit/doap_XMLBeans.rdf
AU xkit/README.txt
A legal
A legal/HEADER
A KEYS
A settings.gradle
A SECURITY.md
A CHANGES.txt
A .gitignore
AU xbeanenv.sh
AU xbeanenv.cmd
U .
At revision 1914738
ERROR: Not all environment variables could be successfully injected. Check for similarly-named environment variables.
[POI-XMLBeans-DSL-1.22] $ /bin/sh -xe /tmp/jenkins16128958685524545789.sh
+ rm -rf examples excelant integrationtest main ooxml ooxml-schema scratchpad build.javacheck.xml
+ svn status
+ svn revert poi*/src/*/java9/module-info.*
svn: E155010: The node '<https://ci-builds.apache.org/job/POI/job/POI-XMLBeans-DSL-1.22/ws/poi*/src/*'> was not found.
+ true
+ svn revert src/resources/ooxml-lite-report.*
Skipped 'src/resources/ooxml-lite-report.*'
+ echo Java-Home: /home/jenkins/tools/java/latest22
Java-Home: /home/jenkins/tools/java/latest22
+ ls -al /home/jenkins/tools/java/latest22/
total 36
drwxr-xr-x 8 root root 4096 Nov 14 23:42 .
drwxrwxr-x 38 root root 4096 Dec 14 18:02 ..
drwxr-xr-x 2 root root 4096 Nov 14 23:42 bin
drwxr-xr-x 5 root root 4096 Nov 14 23:42 conf
drwxr-xr-x 3 root root 4096 Nov 14 23:42 include
drwxr-xr-x 2 root root 4096 Nov 14 23:42 jmods
drwxr-xr-x 71 root root 4096 Nov 14 23:42 legal
drwxr-xr-x 5 root root 4096 Nov 14 23:42 lib
-rw-r--r-- 1 root root 1220 Oct 18 14:34 release
+ ls -al /home/jenkins/tools/java/latest22/bin
total 472
drwxr-xr-x 2 root root 4096 Nov 14 23:42 .
drwxr-xr-x 8 root root 4096 Nov 14 23:42 ..
-rwxr-xr-x 1 root root 12384 Oct 18 14:34 jar
-rwxr-xr-x 1 root root 12392 Oct 18 14:34 jarsigner
-rwxr-xr-x 1 root root 12328 Oct 18 14:34 java
-rwxr-xr-x 1 root root 12416 Oct 18 14:34 javac
-rwxr-xr-x 1 root root 12424 Oct 18 14:34 javadoc
-rwxr-xr-x 1 root root 12384 Oct 18 14:34 javap
-rwxr-xr-x 1 root root 12384 Oct 18 14:34 jcmd
-rwxr-xr-x 1 root root 12456 Oct 18 14:34 jconsole
-rwxr-xr-x 1 root root 12384 Oct 18 14:34 jdb
-rwxr-xr-x 1 root root 12392 Oct 18 14:34 jdeprscan
-rwxr-xr-x 1 root root 12384 Oct 18 14:34 jdeps
-rwxr-xr-x 1 root root 12384 Oct 18 14:34 jfr
-rwxr-xr-x 1 root root 12384 Oct 18 14:34 jhsdb
-rwxr-xr-x 1 root root 12392 Oct 18 14:34 jimage
-rwxr-xr-x 1 root root 12416 Oct 18 14:34 jinfo
-rwxr-xr-x 1 root root 12416 Oct 18 14:34 jlink
-rwxr-xr-x 1 root root 12416 Oct 18 14:34 jmap
-rwxr-xr-x 1 root root 12384 Oct 18 14:34 jmod
-rwxr-xr-x 1 root root 12392 Oct 18 14:34 jpackage
-rwxr-xr-x 1 root root 12384 Oct 18 14:34 jps
-rwxr-xr-x 1 root root 12424 Oct 18 14:34 jrunscript
-rwxr-xr-x 1 root root 12392 Oct 18 14:34 jshell
-rwxr-xr-x 1 root root 12424 Oct 18 14:34 jstack
-rwxr-xr-x 1 root root 12384 Oct 18 14:34 jstat
-rwxr-xr-x 1 root root 12392 Oct 18 14:34 jstatd
-rwxr-xr-x 1 root root 12392 Oct 18 14:34 jwebserver
-rwxr-xr-x 1 root root 12392 Oct 18 14:34 keytool
-rwxr-xr-x 1 root root 12416 Oct 18 14:34 rmiregistry
-rwxr-xr-x 1 root root 12392 Oct 18 14:34 serialver
+ /home/jenkins/tools/java/latest22/bin/java -version
openjdk version "22-ea" 2024-03-19
OpenJDK Runtime Environment (build 22-ea+20-1570)
OpenJDK 64-Bit Server VM (build 22-ea+20-1570, mixed mode, sharing)
+ echo which java
which java
+ which java
/home/jenkins/tools/java/latest22/bin/java
+ java -version
openjdk version "22-ea" 2024-03-19
OpenJDK Runtime Environment (build 22-ea+20-1570)
OpenJDK 64-Bit Server VM (build 22-ea+20-1570, mixed mode, sharing)
+ echo which javac
which javac
+ which javac
/home/jenkins/tools/java/latest22/bin/javac
+ javac -version
javac 22-ea
+ echo Ant-Home:
Ant-Home:
+ ls -al
total 412
drwxr-xr-x 10 jenkins jenkins 4096 Dec 17 11:52 .
drwxr-xr-x 7 jenkins jenkins 4096 Dec 17 11:52 ..
-rw-r--r-- 1 jenkins jenkins 29240 Dec 17 11:52 build.gradle
-rw-r--r-- 1 jenkins jenkins 54099 Dec 17 11:52 build.xml
-rw-r--r-- 1 jenkins jenkins 11963 Dec 17 11:52 CHANGES.txt
drwxr-xr-x 3 jenkins jenkins 4096 Dec 17 11:52 .github
-rw-r--r-- 1 jenkins jenkins 14 Dec 17 11:52 .gitignore
drwxr-xr-x 3 jenkins jenkins 4096 Dec 17 11:52 gradle
-rw-r--r-- 1 jenkins jenkins 1337 Dec 17 11:52 gradle.properties
-rwxr-xr-x 1 jenkins jenkins 9125 Dec 17 11:52 gradlew
-rw-r--r-- 1 jenkins jenkins 176157 Dec 17 11:52 KEYS
drwxr-xr-x 2 jenkins jenkins 4096 Dec 17 11:52 legal
-rwxr-xr-x 1 jenkins jenkins 12458 Dec 17 11:52 LICENSE-binary.txt
-rwxr-xr-x 1 jenkins jenkins 11884 Dec 17 11:52 LICENSE.txt
-rw-r--r-- 1 jenkins jenkins 2561 Dec 17 11:52 NOTICE-binary.txt
-rw-r--r-- 1 jenkins jenkins 1592 Dec 17 11:52 NOTICE.txt
-rw-r--r-- 1 jenkins jenkins 2227 Dec 17 11:52 README.txt
-rw-r--r-- 1 jenkins jenkins 10995 Dec 17 11:52 release-guide.txt
drwxr-xr-x 16 jenkins jenkins 4096 Dec 17 11:52 samples
-rw-r--r-- 1 jenkins jenkins 238 Dec 17 11:52 SECURITY.md
-rw-r--r-- 1 jenkins jenkins 661 Dec 17 11:52 settings.gradle
drwxr-xr-x 4 jenkins jenkins 4096 Dec 17 11:52 src
-rw-r--r-- 1 jenkins jenkins 359 Dec 17 11:52 STATUS
drwxr-xr-x 4 jenkins jenkins 4096 Dec 17 11:52 .svn
drwxr-xr-x 4 jenkins jenkins 4096 Dec 17 11:52 test
-rw-r--r-- 1 jenkins jenkins 3803 Dec 17 11:52 wrapper.gradle
-rw-r--r-- 1 jenkins jenkins 25 Dec 17 11:52 xbeanenv.cmd
-rwxr-xr-x 1 jenkins jenkins 27 Dec 17 11:52 xbeanenv.sh
drwxr-xr-x 2 jenkins jenkins 4096 Dec 17 11:52 xkit
+ echo which ant
which ant
+ which ant
/usr/bin/ant
+ ant -version
Apache Ant(TM) version 1.10.12 compiled on January 17 1970
+ echo <project default="test"><target name="test"><echo>Java ${ant.java.version}/${java.version}</echo><exec executable="javac"><arg value="-version"/></exec></target></project>
+ ant -f build.javacheck.xml -v
Apache Ant(TM) version 1.10.12 compiled on January 17 1970
Buildfile: <https://ci-builds.apache.org/job/POI/job/POI-XMLBeans-DSL-1.22/ws/build.javacheck.xml>
Detected Java version: 22 in: /usr/local/asfpackages/java/openjdk-22-ea+20
Detected OS: Linux
parsing buildfile <https://ci-builds.apache.org/job/POI/job/POI-XMLBeans-DSL-1.22/ws/build.javacheck.xml> with URI = <https://ci-builds.apache.org/job/POI/job/POI-XMLBeans-DSL-1.22/ws/build.javacheck.xml>
Project base dir set to: <https://ci-builds.apache.org/job/POI/job/POI-XMLBeans-DSL-1.22/ws/>
Build sequence for target(s) `test' is [test]
Complete build sequence is [test, ]
test:
parsing buildfile jar:file:/usr/share/ant/lib/ant.jar!/org/apache/tools/ant/antlib.xml with URI = jar:file:/usr/share/ant/lib/ant.jar!/org/apache/tools/ant/antlib.xml from a zip file
[echo] Java 22/22-ea
[exec] Current OS is Linux
[exec] Executing 'javac' with arguments:
[exec] '-version'
[exec]
[exec] The ' characters around the executable and arguments are
[exec] not part of the command.
[exec] javac 22-ea
BUILD SUCCESSFUL
Total time: 0 seconds
+ exit 0
[Gradle] - Launching build.
ERROR: Not all environment variables could be successfully injected. Check for similarly-named environment variables.
[POI-XMLBeans-DSL-1.22] $ <https://ci-builds.apache.org/job/POI/job/POI-XMLBeans-DSL-1.22/ws/gradlew> clean jenkins jacocoTestReport
To honour the JVM settings for this build a single-use Daemon process will be forked. For more on this, please refer to https://docs.gradle.org/8.4/userguide/gradle_daemon.html#sec:disabling_the_daemon in the Gradle documentation.
Daemon will be stopped at the end of the build
Configuration on demand is an incubating feature.
FAILURE: Build failed with an exception.
* Where:
Build file '<https://ci-builds.apache.org/job/POI/job/POI-XMLBeans-DSL-1.22/ws/build.gradle'> line: 37
* What went wrong:
An exception occurred applying plugin request [id: 'de.thetaphi.forbiddenapis', version: '3.4']
> Failed to apply plugin 'de.thetaphi.forbiddenapis'.
> Could not create plugin of type 'ForbiddenApisPlugin'.
> BUG! exception in phase 'semantic analysis' in source unit 'jar:file:/home/jenkins/.gradle/caches/modules-2/files-2.1/de.thetaphi/forbiddenapis/3.4/413c25496dd3128964ee80c8778b92138156de7c/forbiddenapis-3.4.jar!/de/thetaphi/forbiddenapis/gradle/plugin-init.groovy' Unsupported class file major version 66
* Try:
> Run with --stacktrace option to get the stack trace.
> Run with --info or --debug option to get more log output.
> Run with --scan to get full insights.
> Get more help at https://help.gradle.org.
BUILD FAILED in 12s
Build step 'Invoke Gradle script' changed build result to FAILURE
Build step 'Invoke Gradle script' marked build as failure
ERROR: Not all environment variables could be successfully injected. Check for similarly-named environment variables.
Archiving artifacts
ERROR: Not all environment variables could be successfully injected. Check for similarly-named environment variables.
Recording test results
ERROR: Not all environment variables could be successfully injected. Check for similarly-named environment variables.
ERROR: Step ‘Publish JUnit test result report’ failed: No test report files were found. Configuration error?
[SpotBugs] Skipping execution of recorder since overall result is 'FAILURE'
ERROR: Not all environment variables could be successfully injected. Check for similarly-named environment variables.
---------------------------------------------------------------------
To unsubscribe, e-mail: dev-unsubscribe@poi.apache.org
For additional commands, e-mail: dev-help@poi.apache.org
Build failed in Jenkins: POI » POI-XMLBeans-DSL-1.22 #10
Posted by Apache Jenkins Server <je...@builds.apache.org>.
See <https://ci-builds.apache.org/job/POI/job/POI-XMLBeans-DSL-1.22/10/display/redirect?page=changes>
Changes:
[PJ Fanning] [XMLBEANS-646] Hex Binary decoding support can throw ArrayIndexOutOfBoundException
------------------------------------------
[...truncated 168.84 KB...]
A test/perf/bin/castor.sh
A test/perf/bin/jaxb.bat
A test/perf/bin/run_xmlbeans_all.bat
A test/perf/bin/jaxb.sh
A test/perf/bin/xerces.bat
AU test/perf/bin/castor.bat
A test/perf/bin/run_xmlbeans_nonmemory.bat
A test/perf/bin/run_svn.bat
A test/perf/bin/run_svn_nonmemory.bat
A test/perf/bin/run_svn.sh
A test/perf/bin/run_v1_nonmemory.bat
A test/perf/bin/run_v2_nonmemory.bat
A test/perf/bin/run_xerces_nonmemory.bat
A test/perf/bin/run_all.sh
A test/perf/bin/run_v2.sh
A test/perf/bin/run_v1.bat
A test/perf/bin/run_v2.bat
A test/perf/bin/run_jaxb.sh
A test/perf/bin/run_xerces.bat
A test/perf/bin/run_v1.sh
A test/perf/bin/run_castor.bat
A test/perf/bin/run_xerces.sh
A test/perf/bin/run_castor.sh
A test/perf/bin/run_jaxb.bat
A test/perf/bin/v1.sh
A test/perf/bin/jibx.sh
A test/perf/bin/run_jibx.bat
AU test/perf/bin/v1.bat
AU test/perf/bin/jibx.bat
A test/perf/bin/castor.properties
A test/perf/bin/run_jibx.sh
A test/perf/download.properties
A test/perf/cases
AU test/perf/cases/parser_instances.zip
A test/perf/cases/xsd
A test/perf/cases/xsd/non-primitives.xsd
A test/perf/cases/xsd/purchase-order-1.xml
A test/perf/cases/xsd/purchase-order.xsd
A test/perf/cases/xsd/purchase-order-2.xml
A test/perf/cases/xsd/purchase-order-3.xml
A test/perf/cases/xsd/doc.xsd
A test/perf/cases/xsd/purchase-order-4.xml
A test/perf/cases/xsd/purchase-order-5.xml
A test/perf/cases/xsd/purchase-order-6.xml
A test/perf/cases/xsd/purchase-order-7.xml
A test/perf/cases/xsd/purchase-order-jibxbinding.xml
A test/perf/cases/xsd/perf-results.xsd
A test/perf/cases/xsd/primitives.xsd
A test/perf/results.xml
AU test/perf/env.sh
AU test/perf/env.bat
A test/docs
AU test/docs/BuildingAndRunningTests.txt
AU test/docs/TestOrganization.txt
AU test/readme.txt
AU LICENSE-binary.txt
AU STATUS
A release-guide.txt
AU LICENSE.txt
A .github
A .github/workflows
A .github/workflows/test-gradle.yml
A .github/workflows/codeql-analysis.yml
A wrapper.gradle
AU NOTICE.txt
AU NOTICE-binary.txt
AU README.txt
A xkit
AU xkit/doap_XMLBeans.rdf
AU xkit/README.txt
A legal
A legal/HEADER
A KEYS
A settings.gradle
A SECURITY.md
A CHANGES.txt
A .gitignore
AU xbeanenv.sh
AU xbeanenv.cmd
U .
At revision 1914507
ERROR: Not all environment variables could be successfully injected. Check for similarly-named environment variables.
[POI-XMLBeans-DSL-1.22] $ /bin/sh -xe /tmp/jenkins10632220564805659183.sh
+ rm -rf examples excelant integrationtest main ooxml ooxml-schema scratchpad build.javacheck.xml
+ svn status
+ svn revert poi*/src/*/java9/module-info.*
svn: E155010: The node '<https://ci-builds.apache.org/job/POI/job/POI-XMLBeans-DSL-1.22/ws/poi*/src/*'> was not found.
+ true
+ svn revert src/resources/ooxml-lite-report.*
Skipped 'src/resources/ooxml-lite-report.*'
+ echo Java-Home: /home/jenkins/tools/java/latest22
Java-Home: /home/jenkins/tools/java/latest22
+ ls -al /home/jenkins/tools/java/latest22/
total 36
drwxr-xr-x 8 root root 4096 Nov 13 21:50 .
drwxrwxr-x 37 root root 4096 Nov 13 21:55 ..
drwxr-xr-x 2 root root 4096 Nov 13 21:50 bin
drwxr-xr-x 5 root root 4096 Nov 13 21:50 conf
drwxr-xr-x 3 root root 4096 Nov 13 21:50 include
drwxr-xr-x 2 root root 4096 Nov 13 21:50 jmods
drwxr-xr-x 71 root root 4096 Nov 13 21:50 legal
drwxr-xr-x 5 root root 4096 Nov 13 21:50 lib
-rw-r--r-- 1 root root 1220 Oct 18 14:34 release
+ ls -al /home/jenkins/tools/java/latest22/bin
total 472
drwxr-xr-x 2 root root 4096 Nov 13 21:50 .
drwxr-xr-x 8 root root 4096 Nov 13 21:50 ..
-rwxr-xr-x 1 root root 12384 Oct 18 14:34 jar
-rwxr-xr-x 1 root root 12392 Oct 18 14:34 jarsigner
-rwxr-xr-x 1 root root 12328 Oct 18 14:34 java
-rwxr-xr-x 1 root root 12416 Oct 18 14:34 javac
-rwxr-xr-x 1 root root 12424 Oct 18 14:34 javadoc
-rwxr-xr-x 1 root root 12384 Oct 18 14:34 javap
-rwxr-xr-x 1 root root 12384 Oct 18 14:34 jcmd
-rwxr-xr-x 1 root root 12456 Oct 18 14:34 jconsole
-rwxr-xr-x 1 root root 12384 Oct 18 14:34 jdb
-rwxr-xr-x 1 root root 12392 Oct 18 14:34 jdeprscan
-rwxr-xr-x 1 root root 12384 Oct 18 14:34 jdeps
-rwxr-xr-x 1 root root 12384 Oct 18 14:34 jfr
-rwxr-xr-x 1 root root 12384 Oct 18 14:34 jhsdb
-rwxr-xr-x 1 root root 12392 Oct 18 14:34 jimage
-rwxr-xr-x 1 root root 12416 Oct 18 14:34 jinfo
-rwxr-xr-x 1 root root 12416 Oct 18 14:34 jlink
-rwxr-xr-x 1 root root 12416 Oct 18 14:34 jmap
-rwxr-xr-x 1 root root 12384 Oct 18 14:34 jmod
-rwxr-xr-x 1 root root 12392 Oct 18 14:34 jpackage
-rwxr-xr-x 1 root root 12384 Oct 18 14:34 jps
-rwxr-xr-x 1 root root 12424 Oct 18 14:34 jrunscript
-rwxr-xr-x 1 root root 12392 Oct 18 14:34 jshell
-rwxr-xr-x 1 root root 12424 Oct 18 14:34 jstack
-rwxr-xr-x 1 root root 12384 Oct 18 14:34 jstat
-rwxr-xr-x 1 root root 12392 Oct 18 14:34 jstatd
-rwxr-xr-x 1 root root 12392 Oct 18 14:34 jwebserver
-rwxr-xr-x 1 root root 12392 Oct 18 14:34 keytool
-rwxr-xr-x 1 root root 12416 Oct 18 14:34 rmiregistry
-rwxr-xr-x 1 root root 12392 Oct 18 14:34 serialver
+ /home/jenkins/tools/java/latest22/bin/java -version
openjdk version "22-ea" 2024-03-19
OpenJDK Runtime Environment (build 22-ea+20-1570)
OpenJDK 64-Bit Server VM (build 22-ea+20-1570, mixed mode, sharing)
+ echo which java
which java
+ which java
/home/jenkins/tools/java/latest22/bin/java
+ java -version
openjdk version "22-ea" 2024-03-19
OpenJDK Runtime Environment (build 22-ea+20-1570)
OpenJDK 64-Bit Server VM (build 22-ea+20-1570, mixed mode, sharing)
+ echo which javac
which javac
+ which javac
/home/jenkins/tools/java/latest22/bin/javac
+ javac -version
javac 22-ea
+ echo Ant-Home:
Ant-Home:
+ ls -al
total 412
drwxr-xr-x 10 jenkins jenkins 4096 Dec 10 11:55 .
drwxr-xr-x 4 jenkins jenkins 4096 Dec 10 11:52 ..
-rw-r--r-- 1 jenkins jenkins 29240 Dec 10 11:55 build.gradle
-rw-r--r-- 1 jenkins jenkins 54099 Dec 10 11:55 build.xml
-rw-r--r-- 1 jenkins jenkins 11963 Dec 10 11:55 CHANGES.txt
drwxr-xr-x 3 jenkins jenkins 4096 Dec 10 11:55 .github
-rw-r--r-- 1 jenkins jenkins 14 Dec 10 11:55 .gitignore
drwxr-xr-x 3 jenkins jenkins 4096 Dec 10 11:55 gradle
-rw-r--r-- 1 jenkins jenkins 1337 Dec 10 11:55 gradle.properties
-rwxr-xr-x 1 jenkins jenkins 9125 Dec 10 11:55 gradlew
-rw-r--r-- 1 jenkins jenkins 176157 Dec 10 11:55 KEYS
drwxr-xr-x 2 jenkins jenkins 4096 Dec 10 11:55 legal
-rwxr-xr-x 1 jenkins jenkins 12458 Dec 10 11:55 LICENSE-binary.txt
-rwxr-xr-x 1 jenkins jenkins 11884 Dec 10 11:55 LICENSE.txt
-rw-r--r-- 1 jenkins jenkins 2561 Dec 10 11:55 NOTICE-binary.txt
-rw-r--r-- 1 jenkins jenkins 1592 Dec 10 11:55 NOTICE.txt
-rw-r--r-- 1 jenkins jenkins 2227 Dec 10 11:55 README.txt
-rw-r--r-- 1 jenkins jenkins 10995 Dec 10 11:55 release-guide.txt
drwxr-xr-x 16 jenkins jenkins 4096 Dec 10 11:55 samples
-rw-r--r-- 1 jenkins jenkins 238 Dec 10 11:55 SECURITY.md
-rw-r--r-- 1 jenkins jenkins 661 Dec 10 11:55 settings.gradle
drwxr-xr-x 4 jenkins jenkins 4096 Dec 10 11:55 src
-rw-r--r-- 1 jenkins jenkins 359 Dec 10 11:55 STATUS
drwxr-xr-x 4 jenkins jenkins 4096 Dec 10 11:56 .svn
drwxr-xr-x 4 jenkins jenkins 4096 Dec 10 11:55 test
-rw-r--r-- 1 jenkins jenkins 3803 Dec 10 11:55 wrapper.gradle
-rw-r--r-- 1 jenkins jenkins 25 Dec 10 11:55 xbeanenv.cmd
-rwxr-xr-x 1 jenkins jenkins 27 Dec 10 11:55 xbeanenv.sh
drwxr-xr-x 2 jenkins jenkins 4096 Dec 10 11:55 xkit
+ echo which ant
which ant
+ which ant
/usr/bin/ant
+ ant -version
Apache Ant(TM) version 1.10.12 compiled on January 17 1970
+ echo <project default="test"><target name="test"><echo>Java ${ant.java.version}/${java.version}</echo><exec executable="javac"><arg value="-version"/></exec></target></project>
+ ant -f build.javacheck.xml -v
Apache Ant(TM) version 1.10.12 compiled on January 17 1970
Buildfile: <https://ci-builds.apache.org/job/POI/job/POI-XMLBeans-DSL-1.22/ws/build.javacheck.xml>
Detected Java version: 22 in: /usr/local/asfpackages/java/openjdk-22-ea+20
Detected OS: Linux
parsing buildfile <https://ci-builds.apache.org/job/POI/job/POI-XMLBeans-DSL-1.22/ws/build.javacheck.xml> with URI = <https://ci-builds.apache.org/job/POI/job/POI-XMLBeans-DSL-1.22/ws/build.javacheck.xml>
Project base dir set to: <https://ci-builds.apache.org/job/POI/job/POI-XMLBeans-DSL-1.22/ws/>
Build sequence for target(s) `test' is [test]
Complete build sequence is [test, ]
test:
parsing buildfile jar:file:/usr/share/ant/lib/ant.jar!/org/apache/tools/ant/antlib.xml with URI = jar:file:/usr/share/ant/lib/ant.jar!/org/apache/tools/ant/antlib.xml from a zip file
[echo] Java 22/22-ea
[exec] Current OS is Linux
[exec] Executing 'javac' with arguments:
[exec] '-version'
[exec]
[exec] The ' characters around the executable and arguments are
[exec] not part of the command.
[exec] javac 22-ea
BUILD SUCCESSFUL
Total time: 0 seconds
+ exit 0
[Gradle] - Launching build.
ERROR: Not all environment variables could be successfully injected. Check for similarly-named environment variables.
[POI-XMLBeans-DSL-1.22] $ <https://ci-builds.apache.org/job/POI/job/POI-XMLBeans-DSL-1.22/ws/gradlew> clean jenkins jacocoTestReport
To honour the JVM settings for this build a single-use Daemon process will be forked. For more on this, please refer to https://docs.gradle.org/8.4/userguide/gradle_daemon.html#sec:disabling_the_daemon in the Gradle documentation.
Daemon will be stopped at the end of the build
Configuration on demand is an incubating feature.
FAILURE: Build failed with an exception.
* What went wrong:
Could not open settings generic class cache for settings file '<https://ci-builds.apache.org/job/POI/job/POI-XMLBeans-DSL-1.22/ws/settings.gradle'> (/home/jenkins/.gradle/caches/8.4/scripts/devul57fzd6vjk8dlqxbfr7tr).
> BUG! exception in phase 'semantic analysis' in source unit '_BuildScript_' Unsupported class file major version 66
* Try:
> Run with --stacktrace option to get the stack trace.
> Run with --info or --debug option to get more log output.
> Run with --scan to get full insights.
> Get more help at https://help.gradle.org.
BUILD FAILED in 9s
Build step 'Invoke Gradle script' changed build result to FAILURE
Build step 'Invoke Gradle script' marked build as failure
ERROR: Not all environment variables could be successfully injected. Check for similarly-named environment variables.
Archiving artifacts
ERROR: Not all environment variables could be successfully injected. Check for similarly-named environment variables.
Recording test results
ERROR: Not all environment variables could be successfully injected. Check for similarly-named environment variables.
ERROR: Step ‘Publish JUnit test result report’ failed: No test report files were found. Configuration error?
[SpotBugs] Skipping execution of recorder since overall result is 'FAILURE'
ERROR: Not all environment variables could be successfully injected. Check for similarly-named environment variables.
---------------------------------------------------------------------
To unsubscribe, e-mail: dev-unsubscribe@poi.apache.org
For additional commands, e-mail: dev-help@poi.apache.org
Build failed in Jenkins: POI » POI-XMLBeans-DSL-1.22 #9
Posted by Apache Jenkins Server <je...@builds.apache.org>.
See <https://ci-builds.apache.org/job/POI/job/POI-XMLBeans-DSL-1.22/9/display/redirect?page=changes>
Changes:
[PJ Fanning] snapshot version
------------------------------------------
Started by an SCM change
Running as SYSTEM
ERROR: Not all environment variables could be successfully injected. Check for similarly-named environment variables.
[EnvInject] - Loading node environment variables.
[EnvInject] - Preparing an environment for the build.
[EnvInject] - Keeping Jenkins system variables.
[EnvInject] - Keeping Jenkins build variables.
[EnvInject] - Injecting as environment variables the properties content
FORREST_HOME=/home/jenkins/tools/forrest/latest
LANG=en_US.UTF-8
[EnvInject] - Variables injected successfully.
[EnvInject] - Injecting contributions.
Building remotely on builds56 (tmp-22 ubuntu) in workspace <https://ci-builds.apache.org/job/POI/job/POI-XMLBeans-DSL-1.22/ws/>
ERROR: Not all environment variables could be successfully injected. Check for similarly-named environment variables.
Updating https://svn.apache.org/repos/asf/xmlbeans/trunk at revision '2023-11-19T11:52:11.556 +0000'
U build.gradle
U build.xml
U gradle.properties
At revision 1913962
ERROR: Not all environment variables could be successfully injected. Check for similarly-named environment variables.
[POI-XMLBeans-DSL-1.22] $ /bin/sh -xe /tmp/jenkins15362535993102387443.sh
+ rm -rf examples excelant integrationtest main ooxml ooxml-schema scratchpad build.javacheck.xml
+ svn status
+ svn revert poi*/src/*/java9/module-info.*
svn: E155010: The node '<https://ci-builds.apache.org/job/POI/job/POI-XMLBeans-DSL-1.22/ws/poi*/src/*'> was not found.
+ true
+ svn revert src/resources/ooxml-lite-report.*
Skipped 'src/resources/ooxml-lite-report.*'
+ echo Java-Home: /home/jenkins/tools/java/latest22
Java-Home: /home/jenkins/tools/java/latest22
+ ls -al /home/jenkins/tools/java/latest22/
total 36
drwxr-xr-x 8 root root 4096 Nov 7 23:42 .
drwxrwxr-x 37 root root 4096 Nov 10 14:15 ..
drwxr-xr-x 2 root root 4096 Nov 7 23:42 bin
drwxr-xr-x 5 root root 4096 Nov 7 23:42 conf
drwxr-xr-x 3 root root 4096 Nov 7 23:42 include
drwxr-xr-x 2 root root 4096 Nov 7 23:42 jmods
drwxr-xr-x 71 root root 4096 Nov 7 23:42 legal
drwxr-xr-x 5 root root 4096 Nov 7 23:42 lib
-rw-r--r-- 1 root root 1220 Oct 18 14:34 release
+ ls -al /home/jenkins/tools/java/latest22/bin
total 472
drwxr-xr-x 2 root root 4096 Nov 7 23:42 .
drwxr-xr-x 8 root root 4096 Nov 7 23:42 ..
-rwxr-xr-x 1 root root 12384 Oct 18 14:34 jar
-rwxr-xr-x 1 root root 12392 Oct 18 14:34 jarsigner
-rwxr-xr-x 1 root root 12328 Oct 18 14:34 java
-rwxr-xr-x 1 root root 12416 Oct 18 14:34 javac
-rwxr-xr-x 1 root root 12424 Oct 18 14:34 javadoc
-rwxr-xr-x 1 root root 12384 Oct 18 14:34 javap
-rwxr-xr-x 1 root root 12384 Oct 18 14:34 jcmd
-rwxr-xr-x 1 root root 12456 Oct 18 14:34 jconsole
-rwxr-xr-x 1 root root 12384 Oct 18 14:34 jdb
-rwxr-xr-x 1 root root 12392 Oct 18 14:34 jdeprscan
-rwxr-xr-x 1 root root 12384 Oct 18 14:34 jdeps
-rwxr-xr-x 1 root root 12384 Oct 18 14:34 jfr
-rwxr-xr-x 1 root root 12384 Oct 18 14:34 jhsdb
-rwxr-xr-x 1 root root 12392 Oct 18 14:34 jimage
-rwxr-xr-x 1 root root 12416 Oct 18 14:34 jinfo
-rwxr-xr-x 1 root root 12416 Oct 18 14:34 jlink
-rwxr-xr-x 1 root root 12416 Oct 18 14:34 jmap
-rwxr-xr-x 1 root root 12384 Oct 18 14:34 jmod
-rwxr-xr-x 1 root root 12392 Oct 18 14:34 jpackage
-rwxr-xr-x 1 root root 12384 Oct 18 14:34 jps
-rwxr-xr-x 1 root root 12424 Oct 18 14:34 jrunscript
-rwxr-xr-x 1 root root 12392 Oct 18 14:34 jshell
-rwxr-xr-x 1 root root 12424 Oct 18 14:34 jstack
-rwxr-xr-x 1 root root 12384 Oct 18 14:34 jstat
-rwxr-xr-x 1 root root 12392 Oct 18 14:34 jstatd
-rwxr-xr-x 1 root root 12392 Oct 18 14:34 jwebserver
-rwxr-xr-x 1 root root 12392 Oct 18 14:34 keytool
-rwxr-xr-x 1 root root 12416 Oct 18 14:34 rmiregistry
-rwxr-xr-x 1 root root 12392 Oct 18 14:34 serialver
+ /home/jenkins/tools/java/latest22/bin/java -version
openjdk version "22-ea" 2024-03-19
OpenJDK Runtime Environment (build 22-ea+20-1570)
OpenJDK 64-Bit Server VM (build 22-ea+20-1570, mixed mode, sharing)
+ echo which java
which java
+ which java
/home/jenkins/tools/java/latest22/bin/java
+ java -version
openjdk version "22-ea" 2024-03-19
OpenJDK Runtime Environment (build 22-ea+20-1570)
OpenJDK 64-Bit Server VM (build 22-ea+20-1570, mixed mode, sharing)
+ echo which javac
which javac
+ which javac
/home/jenkins/tools/java/latest22/bin/javac
+ javac -version
javac 22-ea
+ echo Ant-Home:
Ant-Home:
+ ls -al
total 416
drwxr-xr-x 11 jenkins jenkins 4096 Nov 19 11:52 .
drwxr-xr-x 5 jenkins jenkins 4096 Nov 12 16:21 ..
-rw-r--r-- 1 jenkins jenkins 29240 Nov 19 11:52 build.gradle
-rw-r--r-- 1 jenkins jenkins 54099 Nov 19 11:52 build.xml
-rw-r--r-- 1 jenkins jenkins 11963 Nov 12 11:52 CHANGES.txt
drwxr-xr-x 3 jenkins jenkins 4096 Nov 12 11:52 .github
-rw-r--r-- 1 jenkins jenkins 14 Nov 12 11:52 .gitignore
drwxr-xr-x 4 jenkins jenkins 4096 Nov 12 11:52 .gradle
drwxr-xr-x 3 jenkins jenkins 4096 Nov 12 11:52 gradle
-rw-r--r-- 1 jenkins jenkins 1337 Nov 19 11:52 gradle.properties
-rwxr-xr-x 1 jenkins jenkins 9125 Nov 12 11:52 gradlew
-rw-r--r-- 1 jenkins jenkins 176157 Nov 12 11:52 KEYS
drwxr-xr-x 2 jenkins jenkins 4096 Nov 12 11:52 legal
-rwxr-xr-x 1 jenkins jenkins 12458 Nov 12 11:52 LICENSE-binary.txt
-rwxr-xr-x 1 jenkins jenkins 11884 Nov 12 11:52 LICENSE.txt
-rw-r--r-- 1 jenkins jenkins 2561 Nov 12 11:52 NOTICE-binary.txt
-rw-r--r-- 1 jenkins jenkins 1592 Nov 12 11:52 NOTICE.txt
-rw-r--r-- 1 jenkins jenkins 2227 Nov 12 11:52 README.txt
-rw-r--r-- 1 jenkins jenkins 10995 Nov 12 11:52 release-guide.txt
drwxr-xr-x 16 jenkins jenkins 4096 Nov 12 11:52 samples
-rw-r--r-- 1 jenkins jenkins 238 Nov 12 11:52 SECURITY.md
-rw-r--r-- 1 jenkins jenkins 661 Nov 12 11:52 settings.gradle
drwxr-xr-x 4 jenkins jenkins 4096 Nov 12 11:52 src
-rw-r--r-- 1 jenkins jenkins 359 Nov 12 11:52 STATUS
drwxr-xr-x 4 jenkins jenkins 4096 Nov 19 11:52 .svn
drwxr-xr-x 4 jenkins jenkins 4096 Nov 12 11:52 test
-rw-r--r-- 1 jenkins jenkins 3803 Nov 12 11:52 wrapper.gradle
-rw-r--r-- 1 jenkins jenkins 25 Nov 12 11:52 xbeanenv.cmd
-rwxr-xr-x 1 jenkins jenkins 27 Nov 12 11:52 xbeanenv.sh
drwxr-xr-x 2 jenkins jenkins 4096 Nov 12 11:52 xkit
+ echo which ant
which ant
+ which ant
/usr/bin/ant
+ ant -version
Apache Ant(TM) version 1.10.12 compiled on January 17 1970
+ echo <project default="test"><target name="test"><echo>Java ${ant.java.version}/${java.version}</echo><exec executable="javac"><arg value="-version"/></exec></target></project>
+ ant -f build.javacheck.xml -v
Apache Ant(TM) version 1.10.12 compiled on January 17 1970
Buildfile: <https://ci-builds.apache.org/job/POI/job/POI-XMLBeans-DSL-1.22/ws/build.javacheck.xml>
Detected Java version: 22 in: /usr/local/asfpackages/java/openjdk-22-ea+20
Detected OS: Linux
parsing buildfile <https://ci-builds.apache.org/job/POI/job/POI-XMLBeans-DSL-1.22/ws/build.javacheck.xml> with URI = <https://ci-builds.apache.org/job/POI/job/POI-XMLBeans-DSL-1.22/ws/build.javacheck.xml>
Project base dir set to: <https://ci-builds.apache.org/job/POI/job/POI-XMLBeans-DSL-1.22/ws/>
Build sequence for target(s) `test' is [test]
Complete build sequence is [test, ]
test:
parsing buildfile jar:file:/usr/share/ant/lib/ant.jar!/org/apache/tools/ant/antlib.xml with URI = jar:file:/usr/share/ant/lib/ant.jar!/org/apache/tools/ant/antlib.xml from a zip file
[echo] Java 22/22-ea
[exec] Current OS is Linux
[exec] Executing 'javac' with arguments:
[exec] '-version'
[exec]
[exec] The ' characters around the executable and arguments are
[exec] not part of the command.
[exec] javac 22-ea
BUILD SUCCESSFUL
Total time: 0 seconds
+ exit 0
[Gradle] - Launching build.
ERROR: Not all environment variables could be successfully injected. Check for similarly-named environment variables.
[POI-XMLBeans-DSL-1.22] $ <https://ci-builds.apache.org/job/POI/job/POI-XMLBeans-DSL-1.22/ws/gradlew> clean jenkins jacocoTestReport
To honour the JVM settings for this build a single-use Daemon process will be forked. For more on this, please refer to https://docs.gradle.org/8.4/userguide/gradle_daemon.html#sec:disabling_the_daemon in the Gradle documentation.
Daemon will be stopped at the end of the build
Configuration on demand is an incubating feature.
FAILURE: Build failed with an exception.
* What went wrong:
Could not open settings generic class cache for settings file '<https://ci-builds.apache.org/job/POI/job/POI-XMLBeans-DSL-1.22/ws/settings.gradle'> (/home/jenkins/.gradle/caches/8.4/scripts/devul57fzd6vjk8dlqxbfr7tr).
> BUG! exception in phase 'semantic analysis' in source unit '_BuildScript_' Unsupported class file major version 66
* Try:
> Run with --stacktrace option to get the stack trace.
> Run with --info or --debug option to get more log output.
> Run with --scan to get full insights.
> Get more help at https://help.gradle.org.
BUILD FAILED in 4s
Build step 'Invoke Gradle script' changed build result to FAILURE
Build step 'Invoke Gradle script' marked build as failure
ERROR: Not all environment variables could be successfully injected. Check for similarly-named environment variables.
Archiving artifacts
ERROR: Not all environment variables could be successfully injected. Check for similarly-named environment variables.
Recording test results
ERROR: Not all environment variables could be successfully injected. Check for similarly-named environment variables.
ERROR: Step ‘Publish JUnit test result report’ failed: No test report files were found. Configuration error?
[SpotBugs] Skipping execution of recorder since overall result is 'FAILURE'
ERROR: Not all environment variables could be successfully injected. Check for similarly-named environment variables.
---------------------------------------------------------------------
To unsubscribe, e-mail: dev-unsubscribe@poi.apache.org
For additional commands, e-mail: dev-help@poi.apache.org
Build failed in Jenkins: POI » POI-XMLBeans-DSL-1.22 #8
Posted by Apache Jenkins Server <je...@builds.apache.org>.
See <https://ci-builds.apache.org/job/POI/job/POI-XMLBeans-DSL-1.22/8/display/redirect?page=changes>
Changes:
[PJ Fanning] gradle 8.4
[PJ Fanning] remove test jars
[PJ Fanning] remove test jars
[PJ Fanning] prep v5.2.0
------------------------------------------
[...truncated 167.61 KB...]
A src/test/resources/xbean/xmlcursor/xquery/Constructor.xq
A src/test/resources/xbean/xmlcursor/xquery/Join.xq
A src/test/resources/xbean/xmlcursor/xquery/NIST
A src/test/resources/xbean/xmlcursor/xquery/NIST/XQcatalog.xsd
A src/test/resources/xbean/xmlcursor/xquery/bookstore.xml
A src/test/resources/xbean/xmlcursor/xquery/employees.xml
AU src/test/resources/xbean/xmlcursor/xquery/xmlQuery.zip
A src/test/resources/xbean/xmlcursor/xstypes
AU src/test/resources/xbean/xmlcursor/xstypes/default.xsd
AU src/test/resources/xbean/xmlcursor/xstypes/person.xsd
AU src/test/resources/xbean/xmlcursor/xstypes/setters.xsd
AU src/test/resources/xbean/xmlcursor/xstypes/xstypes.xml
AU src/test/resources/xbean/xmlcursor/TranXML_License.txt
AU src/test/resources/xbean/xmlcursor/W3C_Software_Licence.txt
A src/test/resources/xbean/xmltokensource
AU src/test/resources/xbean/xmltokensource/PrettyPrintNamespaceTest.xsd
A src/test/resources/xbean/dom
A src/test/resources/xbean/dom/id.xsd
A src/test/resources/xbean/dom/dumb.xsd
A src/test/resources/xbean/dom/ComplexTypeTest.xsd
A src/test/resources/xbean/dom/id.xml
A src/test/resources/xbean/dom/W3C
A src/test/resources/xbean/dom/W3C/level2
A src/test/resources/xbean/dom/W3C/level2/core
A src/test/resources/xbean/dom/W3C/level2/core/files
AU src/test/resources/xbean/dom/W3C/level2/core/files/staff2.dtd
AU src/test/resources/xbean/dom/W3C/level2/core/files/staff.xml
AU src/test/resources/xbean/dom/W3C/level2/core/files/staffNS.xml
AU src/test/resources/xbean/dom/W3C/level2/core/files/staff2.xml
AU src/test/resources/xbean/dom/W3C/level2/core/files/nodtdstaff.xml
AU src/test/resources/xbean/dom/W3C/level2/core/files/xhtml1-frameset.dtd
AU src/test/resources/xbean/dom/W3C/level2/core/files/hc_staff.xml
AU src/test/resources/xbean/dom/W3C/level2/core/files/xhtml1-transitional.dtd
AU src/test/resources/xbean/dom/W3C/level2/core/files/staff.dtd
AU src/test/resources/xbean/dom/W3C/level2/core/files/xhtml1-strict.dtd
AU src/test/resources/xbean/dom/W3C/level2/core/files/staffNS.dtd
AU src/test/resources/xbean/dom/W3C/level2/core/files/README
A src/test/resources/xbean/marshal
A src/test/resources/xbean/marshal/com
A src/test/resources/xbean/marshal/com/mytest
AU src/test/resources/xbean/marshal/com/mytest/YourClass.java
AU src/test/resources/xbean/tranxml.tar.bz2
A src/test/resources/forbiddenApis
A src/test/resources/forbiddenApis/forbidden-signatures-prod.txt
A src/test/resources/forbiddenApis/forbidden-signatures.txt
A src/test/resources/schema
A src/test/resources/schema/appview
AU src/test/resources/schema/appview/Add_AcctSiebel7.xml
A src/test/java.ignore
A src/test/java.ignore/drt
A src/test/java.ignore/drt/drtcases
AU src/test/java.ignore/drt/drtcases/MarshalTests.java
AU src/test/java.ignore/drt/drtcases/TestEnv.java
AU src/test/java.ignore/drt/drtcases/BindingTests.java
AU LICENSE-binary.txt
A build.gradle
AU STATUS
A release-guide.txt
AU LICENSE.txt
A .github
A .github/workflows
A .github/workflows/test-gradle.yml
A .github/workflows/codeql-analysis.yml
A wrapper.gradle
AU NOTICE.txt
AU NOTICE-binary.txt
AU README.txt
A xkit
AU xkit/doap_XMLBeans.rdf
AU xkit/README.txt
A legal
A legal/HEADER
A KEYS
A settings.gradle
A SECURITY.md
A CHANGES.txt
A .gitignore
AU xbeanenv.sh
AU xbeanenv.cmd
U .
At revision 1913731
ERROR: Not all environment variables could be successfully injected. Check for similarly-named environment variables.
[POI-XMLBeans-DSL-1.22] $ /bin/sh -xe /tmp/jenkins9489261860665107197.sh
+ rm -rf examples excelant integrationtest main ooxml ooxml-schema scratchpad build.javacheck.xml
+ svn status
+ svn revert poi*/src/*/java9/module-info.*
svn: E155010: The node '<https://ci-builds.apache.org/job/POI/job/POI-XMLBeans-DSL-1.22/ws/poi*/src/*'> was not found.
+ true
+ svn revert src/resources/ooxml-lite-report.*
Skipped 'src/resources/ooxml-lite-report.*'
+ echo Java-Home: /home/jenkins/tools/java/latest22
Java-Home: /home/jenkins/tools/java/latest22
+ ls -al /home/jenkins/tools/java/latest22/
total 36
drwxr-xr-x 8 root root 4096 Nov 7 23:42 .
drwxrwxr-x 37 root root 4096 Nov 10 14:15 ..
drwxr-xr-x 2 root root 4096 Nov 7 23:42 bin
drwxr-xr-x 5 root root 4096 Nov 7 23:42 conf
drwxr-xr-x 3 root root 4096 Nov 7 23:42 include
drwxr-xr-x 2 root root 4096 Nov 7 23:42 jmods
drwxr-xr-x 71 root root 4096 Nov 7 23:42 legal
drwxr-xr-x 5 root root 4096 Nov 7 23:42 lib
-rw-r--r-- 1 root root 1220 Oct 18 14:34 release
+ ls -al /home/jenkins/tools/java/latest22/bin
total 472
drwxr-xr-x 2 root root 4096 Nov 7 23:42 .
drwxr-xr-x 8 root root 4096 Nov 7 23:42 ..
-rwxr-xr-x 1 root root 12384 Oct 18 14:34 jar
-rwxr-xr-x 1 root root 12392 Oct 18 14:34 jarsigner
-rwxr-xr-x 1 root root 12328 Oct 18 14:34 java
-rwxr-xr-x 1 root root 12416 Oct 18 14:34 javac
-rwxr-xr-x 1 root root 12424 Oct 18 14:34 javadoc
-rwxr-xr-x 1 root root 12384 Oct 18 14:34 javap
-rwxr-xr-x 1 root root 12384 Oct 18 14:34 jcmd
-rwxr-xr-x 1 root root 12456 Oct 18 14:34 jconsole
-rwxr-xr-x 1 root root 12384 Oct 18 14:34 jdb
-rwxr-xr-x 1 root root 12392 Oct 18 14:34 jdeprscan
-rwxr-xr-x 1 root root 12384 Oct 18 14:34 jdeps
-rwxr-xr-x 1 root root 12384 Oct 18 14:34 jfr
-rwxr-xr-x 1 root root 12384 Oct 18 14:34 jhsdb
-rwxr-xr-x 1 root root 12392 Oct 18 14:34 jimage
-rwxr-xr-x 1 root root 12416 Oct 18 14:34 jinfo
-rwxr-xr-x 1 root root 12416 Oct 18 14:34 jlink
-rwxr-xr-x 1 root root 12416 Oct 18 14:34 jmap
-rwxr-xr-x 1 root root 12384 Oct 18 14:34 jmod
-rwxr-xr-x 1 root root 12392 Oct 18 14:34 jpackage
-rwxr-xr-x 1 root root 12384 Oct 18 14:34 jps
-rwxr-xr-x 1 root root 12424 Oct 18 14:34 jrunscript
-rwxr-xr-x 1 root root 12392 Oct 18 14:34 jshell
-rwxr-xr-x 1 root root 12424 Oct 18 14:34 jstack
-rwxr-xr-x 1 root root 12384 Oct 18 14:34 jstat
-rwxr-xr-x 1 root root 12392 Oct 18 14:34 jstatd
-rwxr-xr-x 1 root root 12392 Oct 18 14:34 jwebserver
-rwxr-xr-x 1 root root 12392 Oct 18 14:34 keytool
-rwxr-xr-x 1 root root 12416 Oct 18 14:34 rmiregistry
-rwxr-xr-x 1 root root 12392 Oct 18 14:34 serialver
+ /home/jenkins/tools/java/latest22/bin/java -version
openjdk version "22-ea" 2024-03-19
OpenJDK Runtime Environment (build 22-ea+20-1570)
OpenJDK 64-Bit Server VM (build 22-ea+20-1570, mixed mode, sharing)
+ echo which java
which java
+ which java
/home/jenkins/tools/java/latest22/bin/java
+ java -version
openjdk version "22-ea" 2024-03-19
OpenJDK Runtime Environment (build 22-ea+20-1570)
OpenJDK 64-Bit Server VM (build 22-ea+20-1570, mixed mode, sharing)
+ echo which javac
which javac
+ which javac
/home/jenkins/tools/java/latest22/bin/javac
+ javac -version
javac 22-ea
+ echo Ant-Home:
Ant-Home:
+ ls -al
total 412
drwxr-xr-x 10 jenkins jenkins 4096 Nov 12 11:52 .
drwxr-xr-x 4 jenkins jenkins 4096 Nov 12 11:52 ..
-rw-r--r-- 1 jenkins jenkins 29240 Nov 12 11:52 build.gradle
-rw-r--r-- 1 jenkins jenkins 54091 Nov 12 11:52 build.xml
-rw-r--r-- 1 jenkins jenkins 11963 Nov 12 11:52 CHANGES.txt
drwxr-xr-x 3 jenkins jenkins 4096 Nov 12 11:52 .github
-rw-r--r-- 1 jenkins jenkins 14 Nov 12 11:52 .gitignore
drwxr-xr-x 3 jenkins jenkins 4096 Nov 12 11:52 gradle
-rw-r--r-- 1 jenkins jenkins 1329 Nov 12 11:52 gradle.properties
-rwxr-xr-x 1 jenkins jenkins 9125 Nov 12 11:52 gradlew
-rw-r--r-- 1 jenkins jenkins 176157 Nov 12 11:52 KEYS
drwxr-xr-x 2 jenkins jenkins 4096 Nov 12 11:52 legal
-rwxr-xr-x 1 jenkins jenkins 12458 Nov 12 11:52 LICENSE-binary.txt
-rwxr-xr-x 1 jenkins jenkins 11884 Nov 12 11:52 LICENSE.txt
-rw-r--r-- 1 jenkins jenkins 2561 Nov 12 11:52 NOTICE-binary.txt
-rw-r--r-- 1 jenkins jenkins 1592 Nov 12 11:52 NOTICE.txt
-rw-r--r-- 1 jenkins jenkins 2227 Nov 12 11:52 README.txt
-rw-r--r-- 1 jenkins jenkins 10995 Nov 12 11:52 release-guide.txt
drwxr-xr-x 16 jenkins jenkins 4096 Nov 12 11:52 samples
-rw-r--r-- 1 jenkins jenkins 238 Nov 12 11:52 SECURITY.md
-rw-r--r-- 1 jenkins jenkins 661 Nov 12 11:52 settings.gradle
drwxr-xr-x 4 jenkins jenkins 4096 Nov 12 11:52 src
-rw-r--r-- 1 jenkins jenkins 359 Nov 12 11:52 STATUS
drwxr-xr-x 4 jenkins jenkins 4096 Nov 12 11:52 .svn
drwxr-xr-x 4 jenkins jenkins 4096 Nov 12 11:52 test
-rw-r--r-- 1 jenkins jenkins 3803 Nov 12 11:52 wrapper.gradle
-rw-r--r-- 1 jenkins jenkins 25 Nov 12 11:52 xbeanenv.cmd
-rwxr-xr-x 1 jenkins jenkins 27 Nov 12 11:52 xbeanenv.sh
drwxr-xr-x 2 jenkins jenkins 4096 Nov 12 11:52 xkit
+ echo which ant
which ant
+ which ant
/usr/bin/ant
+ ant -version
Apache Ant(TM) version 1.10.12 compiled on January 17 1970
+ echo <project default="test"><target name="test"><echo>Java ${ant.java.version}/${java.version}</echo><exec executable="javac"><arg value="-version"/></exec></target></project>
+ ant -f build.javacheck.xml -v
Apache Ant(TM) version 1.10.12 compiled on January 17 1970
Buildfile: <https://ci-builds.apache.org/job/POI/job/POI-XMLBeans-DSL-1.22/ws/build.javacheck.xml>
Detected Java version: 22 in: /usr/local/asfpackages/java/openjdk-22-ea+20
Detected OS: Linux
parsing buildfile <https://ci-builds.apache.org/job/POI/job/POI-XMLBeans-DSL-1.22/ws/build.javacheck.xml> with URI = <https://ci-builds.apache.org/job/POI/job/POI-XMLBeans-DSL-1.22/ws/build.javacheck.xml>
Project base dir set to: <https://ci-builds.apache.org/job/POI/job/POI-XMLBeans-DSL-1.22/ws/>
Build sequence for target(s) `test' is [test]
Complete build sequence is [test, ]
test:
parsing buildfile jar:file:/usr/share/ant/lib/ant.jar!/org/apache/tools/ant/antlib.xml with URI = jar:file:/usr/share/ant/lib/ant.jar!/org/apache/tools/ant/antlib.xml from a zip file
[echo] Java 22/22-ea
[exec] Current OS is Linux
[exec] Executing 'javac' with arguments:
[exec] '-version'
[exec]
[exec] The ' characters around the executable and arguments are
[exec] not part of the command.
[exec] javac 22-ea
BUILD SUCCESSFUL
Total time: 0 seconds
+ exit 0
[Gradle] - Launching build.
ERROR: Not all environment variables could be successfully injected. Check for similarly-named environment variables.
[POI-XMLBeans-DSL-1.22] $ <https://ci-builds.apache.org/job/POI/job/POI-XMLBeans-DSL-1.22/ws/gradlew> clean jenkins jacocoTestReport
To honour the JVM settings for this build a single-use Daemon process will be forked. For more on this, please refer to https://docs.gradle.org/8.4/userguide/gradle_daemon.html#sec:disabling_the_daemon in the Gradle documentation.
Daemon will be stopped at the end of the build
Configuration on demand is an incubating feature.
FAILURE: Build failed with an exception.
* What went wrong:
Could not open settings generic class cache for settings file '<https://ci-builds.apache.org/job/POI/job/POI-XMLBeans-DSL-1.22/ws/settings.gradle'> (/home/jenkins/.gradle/caches/8.4/scripts/devul57fzd6vjk8dlqxbfr7tr).
> BUG! exception in phase 'semantic analysis' in source unit '_BuildScript_' Unsupported class file major version 66
* Try:
> Run with --stacktrace option to get the stack trace.
> Run with --info or --debug option to get more log output.
> Run with --scan to get full insights.
> Get more help at https://help.gradle.org.
BUILD FAILED in 4s
Build step 'Invoke Gradle script' changed build result to FAILURE
Build step 'Invoke Gradle script' marked build as failure
ERROR: Not all environment variables could be successfully injected. Check for similarly-named environment variables.
Archiving artifacts
ERROR: Not all environment variables could be successfully injected. Check for similarly-named environment variables.
Recording test results
ERROR: Not all environment variables could be successfully injected. Check for similarly-named environment variables.
ERROR: Step ‘Publish JUnit test result report’ failed: No test report files were found. Configuration error?
[SpotBugs] Skipping execution of recorder since overall result is 'FAILURE'
ERROR: Not all environment variables could be successfully injected. Check for similarly-named environment variables.
---------------------------------------------------------------------
To unsubscribe, e-mail: dev-unsubscribe@poi.apache.org
For additional commands, e-mail: dev-help@poi.apache.org
Build failed in Jenkins: POI » POI-XMLBeans-DSL-1.22 #7
Posted by Apache Jenkins Server <je...@builds.apache.org>.
See <https://ci-builds.apache.org/job/POI/job/POI-XMLBeans-DSL-1.22/7/display/redirect?page=changes>
Changes:
[PJ Fanning] log4j 2.21.1
------------------------------------------
[...truncated 169.10 KB...]
A test/perf/bin/run_all_nonmemory.bat
A test/perf/bin/jaxb2.bat
A test/perf/bin/xerces.sh
A test/perf/bin/castor.sh
A test/perf/bin/jaxb.bat
A test/perf/bin/run_xmlbeans_all.bat
A test/perf/bin/jaxb.sh
A test/perf/bin/xerces.bat
AU test/perf/bin/castor.bat
A test/perf/bin/run_xmlbeans_nonmemory.bat
A test/perf/bin/run_svn.bat
A test/perf/bin/run_svn_nonmemory.bat
A test/perf/bin/run_svn.sh
A test/perf/bin/run_v1_nonmemory.bat
A test/perf/bin/run_v2_nonmemory.bat
A test/perf/bin/run_xerces_nonmemory.bat
A test/perf/bin/run_all.sh
A test/perf/bin/run_v2.sh
A test/perf/bin/run_v1.bat
A test/perf/bin/run_v2.bat
A test/perf/bin/run_jaxb.sh
A test/perf/bin/run_xerces.bat
A test/perf/bin/run_v1.sh
A test/perf/bin/run_castor.bat
A test/perf/bin/run_xerces.sh
A test/perf/bin/run_castor.sh
A test/perf/bin/run_jaxb.bat
A test/perf/bin/v1.sh
A test/perf/bin/jibx.sh
A test/perf/bin/run_jibx.bat
AU test/perf/bin/v1.bat
AU test/perf/bin/jibx.bat
A test/perf/bin/castor.properties
A test/perf/bin/run_jibx.sh
A test/perf/download.properties
A test/perf/cases
AU test/perf/cases/parser_instances.zip
A test/perf/cases/xsd
A test/perf/cases/xsd/non-primitives.xsd
A test/perf/cases/xsd/purchase-order-1.xml
A test/perf/cases/xsd/purchase-order.xsd
A test/perf/cases/xsd/purchase-order-2.xml
A test/perf/cases/xsd/purchase-order-3.xml
A test/perf/cases/xsd/doc.xsd
A test/perf/cases/xsd/purchase-order-4.xml
A test/perf/cases/xsd/purchase-order-5.xml
A test/perf/cases/xsd/purchase-order-6.xml
A test/perf/cases/xsd/purchase-order-7.xml
A test/perf/cases/xsd/purchase-order-jibxbinding.xml
A test/perf/cases/xsd/perf-results.xsd
A test/perf/cases/xsd/primitives.xsd
A test/perf/results.xml
AU test/perf/env.sh
AU test/perf/env.bat
A test/tools
A test/tools/lib
A test/tools/lib/xsl
AU test/tools/lib/xsl/junit.css
AU test/tools/lib/xsl/TestReport.xsl
AU test/tools/lib/xsl/TestReport.xsd
A test/tools/lib/ant-ext
AU test/tools/lib/ant-ext/antexts.jar
AU test/tools/lib/ant-ext/ant-contrib-0.6.jar
AU test/tools/lib/JWhich.jar
A test/docs
AU test/docs/BuildingAndRunningTests.txt
AU test/docs/TestOrganization.txt
AU test/readme.txt
A settings.gradle
A SECURITY.md
A CHANGES.txt
A .gitignore
AU xbeanenv.sh
AU xbeanenv.cmd
U .
At revision 1913423
ERROR: Not all environment variables could be successfully injected. Check for similarly-named environment variables.
[POI-XMLBeans-DSL-1.22] $ /bin/sh -xe /tmp/jenkins10585458730454102676.sh
+ rm -rf examples excelant integrationtest main ooxml ooxml-schema scratchpad build.javacheck.xml
+ svn status
+ svn revert poi*/src/*/java9/module-info.*
svn: E155010: The node '<https://ci-builds.apache.org/job/POI/job/POI-XMLBeans-DSL-1.22/ws/poi*/src/*'> was not found.
+ true
+ svn revert src/resources/ooxml-lite-report.*
Skipped 'src/resources/ooxml-lite-report.*'
+ echo Java-Home: /home/jenkins/tools/java/latest22
Java-Home: /home/jenkins/tools/java/latest22
+ ls -al /home/jenkins/tools/java/latest22/
total 36
drwxr-xr-x 8 root root 4096 Oct 24 15:54 .
drwxrwxr-x 37 root root 4096 Oct 24 15:54 ..
drwxr-xr-x 2 root root 4096 Oct 24 15:54 bin
drwxr-xr-x 5 root root 4096 Oct 24 15:54 conf
drwxr-xr-x 3 root root 4096 Oct 24 15:54 include
drwxr-xr-x 2 root root 4096 Oct 24 15:54 jmods
drwxr-xr-x 71 root root 4096 Oct 24 15:54 legal
drwxr-xr-x 5 root root 4096 Oct 24 15:54 lib
-rw-r--r-- 1 root root 1220 Oct 18 14:34 release
+ ls -al /home/jenkins/tools/java/latest22/bin
total 472
drwxr-xr-x 2 root root 4096 Oct 24 15:54 .
drwxr-xr-x 8 root root 4096 Oct 24 15:54 ..
-rwxr-xr-x 1 root root 12384 Oct 18 14:34 jar
-rwxr-xr-x 1 root root 12392 Oct 18 14:34 jarsigner
-rwxr-xr-x 1 root root 12328 Oct 18 14:34 java
-rwxr-xr-x 1 root root 12416 Oct 18 14:34 javac
-rwxr-xr-x 1 root root 12424 Oct 18 14:34 javadoc
-rwxr-xr-x 1 root root 12384 Oct 18 14:34 javap
-rwxr-xr-x 1 root root 12384 Oct 18 14:34 jcmd
-rwxr-xr-x 1 root root 12456 Oct 18 14:34 jconsole
-rwxr-xr-x 1 root root 12384 Oct 18 14:34 jdb
-rwxr-xr-x 1 root root 12392 Oct 18 14:34 jdeprscan
-rwxr-xr-x 1 root root 12384 Oct 18 14:34 jdeps
-rwxr-xr-x 1 root root 12384 Oct 18 14:34 jfr
-rwxr-xr-x 1 root root 12384 Oct 18 14:34 jhsdb
-rwxr-xr-x 1 root root 12392 Oct 18 14:34 jimage
-rwxr-xr-x 1 root root 12416 Oct 18 14:34 jinfo
-rwxr-xr-x 1 root root 12416 Oct 18 14:34 jlink
-rwxr-xr-x 1 root root 12416 Oct 18 14:34 jmap
-rwxr-xr-x 1 root root 12384 Oct 18 14:34 jmod
-rwxr-xr-x 1 root root 12392 Oct 18 14:34 jpackage
-rwxr-xr-x 1 root root 12384 Oct 18 14:34 jps
-rwxr-xr-x 1 root root 12424 Oct 18 14:34 jrunscript
-rwxr-xr-x 1 root root 12392 Oct 18 14:34 jshell
-rwxr-xr-x 1 root root 12424 Oct 18 14:34 jstack
-rwxr-xr-x 1 root root 12384 Oct 18 14:34 jstat
-rwxr-xr-x 1 root root 12392 Oct 18 14:34 jstatd
-rwxr-xr-x 1 root root 12392 Oct 18 14:34 jwebserver
-rwxr-xr-x 1 root root 12392 Oct 18 14:34 keytool
-rwxr-xr-x 1 root root 12416 Oct 18 14:34 rmiregistry
-rwxr-xr-x 1 root root 12392 Oct 18 14:34 serialver
+ /home/jenkins/tools/java/latest22/bin/java -version
openjdk version "22-ea" 2024-03-19
OpenJDK Runtime Environment (build 22-ea+20-1570)
OpenJDK 64-Bit Server VM (build 22-ea+20-1570, mixed mode, sharing)
+ echo which java
which java
+ which java
/home/jenkins/tools/java/latest22/bin/java
+ java -version
openjdk version "22-ea" 2024-03-19
OpenJDK Runtime Environment (build 22-ea+20-1570)
OpenJDK 64-Bit Server VM (build 22-ea+20-1570, mixed mode, sharing)
+ echo which javac
which javac
+ which javac
/home/jenkins/tools/java/latest22/bin/javac
+ javac -version
javac 22-ea
+ echo Ant-Home:
Ant-Home:
+ ls -al
total 412
drwxr-xr-x 10 jenkins jenkins 4096 Oct 29 11:52 .
drwxr-xr-x 6 jenkins jenkins 4096 Oct 29 11:52 ..
-rw-r--r-- 1 jenkins jenkins 29240 Oct 29 11:52 build.gradle
-rw-r--r-- 1 jenkins jenkins 54100 Oct 29 11:52 build.xml
-rw-r--r-- 1 jenkins jenkins 11963 Oct 29 11:52 CHANGES.txt
drwxr-xr-x 3 jenkins jenkins 4096 Oct 29 11:52 .github
-rw-r--r-- 1 jenkins jenkins 14 Oct 29 11:52 .gitignore
drwxr-xr-x 3 jenkins jenkins 4096 Oct 29 11:52 gradle
-rw-r--r-- 1 jenkins jenkins 1338 Oct 29 11:52 gradle.properties
-rwxr-xr-x 1 jenkins jenkins 9125 Oct 29 11:52 gradlew
-rw-r--r-- 1 jenkins jenkins 176157 Oct 29 11:52 KEYS
drwxr-xr-x 2 jenkins jenkins 4096 Oct 29 11:52 legal
-rwxr-xr-x 1 jenkins jenkins 12458 Oct 29 11:52 LICENSE-binary.txt
-rwxr-xr-x 1 jenkins jenkins 11884 Oct 29 11:52 LICENSE.txt
-rw-r--r-- 1 jenkins jenkins 2561 Oct 29 11:52 NOTICE-binary.txt
-rw-r--r-- 1 jenkins jenkins 1592 Oct 29 11:52 NOTICE.txt
-rw-r--r-- 1 jenkins jenkins 2227 Oct 29 11:52 README.txt
-rw-r--r-- 1 jenkins jenkins 10995 Oct 29 11:52 release-guide.txt
drwxr-xr-x 16 jenkins jenkins 4096 Oct 29 11:52 samples
-rw-r--r-- 1 jenkins jenkins 238 Oct 29 11:52 SECURITY.md
-rw-r--r-- 1 jenkins jenkins 661 Oct 29 11:52 settings.gradle
drwxr-xr-x 4 jenkins jenkins 4096 Oct 29 11:52 src
-rw-r--r-- 1 jenkins jenkins 359 Oct 29 11:52 STATUS
drwxr-xr-x 4 jenkins jenkins 4096 Oct 29 11:52 .svn
drwxr-xr-x 5 jenkins jenkins 4096 Oct 29 11:52 test
-rw-r--r-- 1 jenkins jenkins 3803 Oct 29 11:52 wrapper.gradle
-rw-r--r-- 1 jenkins jenkins 25 Oct 29 11:52 xbeanenv.cmd
-rwxr-xr-x 1 jenkins jenkins 27 Oct 29 11:52 xbeanenv.sh
drwxr-xr-x 2 jenkins jenkins 4096 Oct 29 11:52 xkit
+ echo which ant
which ant
+ which ant
/usr/bin/ant
+ ant -version
Apache Ant(TM) version 1.10.5 compiled on March 28 2019
+ echo <project default="test"><target name="test"><echo>Java ${ant.java.version}/${java.version}</echo><exec executable="javac"><arg value="-version"/></exec></target></project>
+ ant -f build.javacheck.xml -v
Apache Ant(TM) version 1.10.5 compiled on March 28 2019
Buildfile: <https://ci-builds.apache.org/job/POI/job/POI-XMLBeans-DSL-1.22/ws/build.javacheck.xml>
Detected Java version: 22 in: /usr/local/asfpackages/java/openjdk-22-ea+20
Detected OS: Linux
parsing buildfile <https://ci-builds.apache.org/job/POI/job/POI-XMLBeans-DSL-1.22/ws/build.javacheck.xml> with URI = <https://ci-builds.apache.org/job/POI/job/POI-XMLBeans-DSL-1.22/ws/build.javacheck.xml>
Project base dir set to: <https://ci-builds.apache.org/job/POI/job/POI-XMLBeans-DSL-1.22/ws/>
Build sequence for target(s) `test' is [test]
Complete build sequence is [test, ]
test:
parsing buildfile jar:file:/usr/share/ant/lib/ant.jar!/org/apache/tools/ant/antlib.xml with URI = jar:file:/usr/share/ant/lib/ant.jar!/org/apache/tools/ant/antlib.xml from a zip file
[echo] Java 22/22-ea
[exec] Current OS is Linux
[exec] Executing 'javac' with arguments:
[exec] '-version'
[exec]
[exec] The ' characters around the executable and arguments are
[exec] not part of the command.
[exec] javac 22-ea
BUILD SUCCESSFUL
Total time: 0 seconds
+ exit 0
[Gradle] - Launching build.
ERROR: Not all environment variables could be successfully injected. Check for similarly-named environment variables.
[POI-XMLBeans-DSL-1.22] $ <https://ci-builds.apache.org/job/POI/job/POI-XMLBeans-DSL-1.22/ws/gradlew> clean jenkins jacocoTestReport
To honour the JVM settings for this build a single-use Daemon process will be forked. For more on this, please refer to https://docs.gradle.org/8.3/userguide/gradle_daemon.html#sec:disabling_the_daemon in the Gradle documentation.
Daemon will be stopped at the end of the build
Configuration on demand is an incubating feature.
FAILURE: Build failed with an exception.
* Where:
Build file '<https://ci-builds.apache.org/job/POI/job/POI-XMLBeans-DSL-1.22/ws/build.gradle'> line: 37
* What went wrong:
An exception occurred applying plugin request [id: 'de.thetaphi.forbiddenapis', version: '3.4']
> Failed to apply plugin 'de.thetaphi.forbiddenapis'.
> Could not create plugin of type 'ForbiddenApisPlugin'.
> BUG! exception in phase 'semantic analysis' in source unit 'jar:file:/home/jenkins/.gradle/caches/modules-2/files-2.1/de.thetaphi/forbiddenapis/3.4/413c25496dd3128964ee80c8778b92138156de7c/forbiddenapis-3.4.jar!/de/thetaphi/forbiddenapis/gradle/plugin-init.groovy' Unsupported class file major version 66
* Try:
> Run with --stacktrace option to get the stack trace.
> Run with --info or --debug option to get more log output.
> Run with --scan to get full insights.
> Get more help at https://help.gradle.org.
BUILD FAILED in 9s
Build step 'Invoke Gradle script' changed build result to FAILURE
Build step 'Invoke Gradle script' marked build as failure
ERROR: Not all environment variables could be successfully injected. Check for similarly-named environment variables.
Archiving artifacts
ERROR: Not all environment variables could be successfully injected. Check for similarly-named environment variables.
Recording test results
ERROR: Not all environment variables could be successfully injected. Check for similarly-named environment variables.
ERROR: Step ?Publish JUnit test result report? failed: No test report files were found. Configuration error?
[SpotBugs] Skipping execution of recorder since overall result is 'FAILURE'
ERROR: Not all environment variables could be successfully injected. Check for similarly-named environment variables.
---------------------------------------------------------------------
To unsubscribe, e-mail: dev-unsubscribe@poi.apache.org
For additional commands, e-mail: dev-help@poi.apache.org
Build failed in Jenkins: POI » POI-XMLBeans-DSL-1.22 #6
Posted by Apache Jenkins Server <je...@builds.apache.org>.
See <https://ci-builds.apache.org/job/POI/job/POI-XMLBeans-DSL-1.22/6/display/redirect?page=changes>
Changes:
[PJ Fanning] [XMLBEANS-474] another negative array size possibility
[PJ Fanning] try to fix issue in Diff
[PJ Fanning] update class
[PJ Fanning] [XMLBEANS-642] use java.nio.file.Files APIs
[PJ Fanning] typos
[PJ Fanning] update license
[PJ Fanning] [XMLBEANS-631] log4j 2.21.0
[PJ Fanning] [XMLBEANS-474] try to support writing larger XML output
------------------------------------------
Started by an SCM change
Running as SYSTEM
ERROR: Not all environment variables could be successfully injected. Check for similarly-named environment variables.
[EnvInject] - Loading node environment variables.
[EnvInject] - Preparing an environment for the build.
[EnvInject] - Keeping Jenkins system variables.
[EnvInject] - Keeping Jenkins build variables.
[EnvInject] - Injecting as environment variables the properties content
FORREST_HOME=/home/jenkins/tools/forrest/latest
LANG=en_US.UTF-8
[EnvInject] - Variables injected successfully.
[EnvInject] - Injecting contributions.
Building remotely on builds29 (ubuntu) in workspace <https://ci-builds.apache.org/job/POI/job/POI-XMLBeans-DSL-1.22/ws/>
ERROR: Not all environment variables could be successfully injected. Check for similarly-named environment variables.
Updating https://svn.apache.org/repos/asf/xmlbeans/trunk at revision '2023-10-22T11:52:08.879 +0000'
U build.gradle
U src/main/java/org/apache/xmlbeans/impl/store/Saver.java
U src/main/java/org/apache/xmlbeans/impl/store/Cursor.java
U src/main/java/org/apache/xmlbeans/impl/common/IOUtil.java
U src/main/java/org/apache/xmlbeans/impl/common/JarHelper.java
U src/main/java/org/apache/xmlbeans/impl/repackage/Repackage.java
U src/main/java/org/apache/xmlbeans/impl/schema/FileResourceLoader.java
U src/main/java/org/apache/xmlbeans/impl/schema/SchemaTypeLoaderBase.java
U src/main/java/org/apache/xmlbeans/impl/schema/StscImporter.java
U src/main/java/org/apache/xmlbeans/impl/soap/FactoryFinder.java
U src/main/java/org/apache/xmlbeans/impl/tool/RunXQuery.java
U src/main/java/org/apache/xmlbeans/impl/tool/SchemaResourceManager.java
U src/main/java/org/apache/xmlbeans/impl/tool/StreamInstanceValidator.java
U src/main/java/org/apache/xmlbeans/impl/tool/XsbDumper.java
U src/main/java/org/apache/xmlbeans/impl/util/FilerImpl.java
U src/main/java9/module-info.class
U src/main/maven/org.apache.xmlbeans/xmlbeans/pom.xml
U src/main/maven/plugin.xml
U src/test/java/org/apache/xmlbeans/impl/tool/Diff.java
U src/test/java/compile/scomp/incr/schemaCompile/detailed/ModelGroupTests.java
U src/test/java/xmlobject/detailed/XmlObjectAbstractClassTest.java
U LICENSE-binary.txt
U build.xml
At revision 1913198
ERROR: Not all environment variables could be successfully injected. Check for similarly-named environment variables.
[POI-XMLBeans-DSL-1.22] $ /bin/sh -xe /tmp/jenkins1567853033465644390.sh
+ rm -rf examples excelant integrationtest main ooxml ooxml-schema scratchpad build.javacheck.xml
+ svn status
+ svn revert poi*/src/*/java9/module-info.*
svn: E155010: The node '<https://ci-builds.apache.org/job/POI/job/POI-XMLBeans-DSL-1.22/ws/poi*/src/*'> was not found.
+ true
+ svn revert src/resources/ooxml-lite-report.*
Skipped 'src/resources/ooxml-lite-report.*'
+ echo Java-Home: /home/jenkins/tools/java/latest22
Java-Home: /home/jenkins/tools/java/latest22
+ ls -al /home/jenkins/tools/java/latest22/
total 36
drwxr-xr-x 8 root root 4096 Jun 14 06:03 .
drwxr-xr-x 36 root root 4096 Oct 16 14:27 ..
drwxr-xr-x 2 root root 4096 Jun 14 06:03 bin
drwxr-xr-x 5 root root 4096 Jun 14 06:03 conf
drwxr-xr-x 3 root root 4096 Jun 14 06:03 include
drwxr-xr-x 2 root root 4096 Jun 14 06:03 jmods
drwxr-xr-x 71 root root 4096 Jun 14 06:03 legal
drwxr-xr-x 5 root root 4096 Jun 14 06:03 lib
-rw-r--r-- 1 root root 1216 Jun 8 22:33 release
+ ls -al /home/jenkins/tools/java/latest22/bin
total 472
drwxr-xr-x 2 root root 4096 Jun 14 06:03 .
drwxr-xr-x 8 root root 4096 Jun 14 06:03 ..
-rwxr-xr-x 1 root root 12384 Jun 8 22:33 jar
-rwxr-xr-x 1 root root 12392 Jun 8 22:33 jarsigner
-rwxr-xr-x 1 root root 12328 Jun 8 22:33 java
-rwxr-xr-x 1 root root 12416 Jun 8 22:33 javac
-rwxr-xr-x 1 root root 12424 Jun 8 22:33 javadoc
-rwxr-xr-x 1 root root 12384 Jun 8 22:33 javap
-rwxr-xr-x 1 root root 12384 Jun 8 22:33 jcmd
-rwxr-xr-x 1 root root 12456 Jun 8 22:33 jconsole
-rwxr-xr-x 1 root root 12384 Jun 8 22:33 jdb
-rwxr-xr-x 1 root root 12392 Jun 8 22:33 jdeprscan
-rwxr-xr-x 1 root root 12384 Jun 8 22:33 jdeps
-rwxr-xr-x 1 root root 12384 Jun 8 22:33 jfr
-rwxr-xr-x 1 root root 12384 Jun 8 22:33 jhsdb
-rwxr-xr-x 1 root root 12392 Jun 8 22:33 jimage
-rwxr-xr-x 1 root root 12416 Jun 8 22:33 jinfo
-rwxr-xr-x 1 root root 12416 Jun 8 22:33 jlink
-rwxr-xr-x 1 root root 12416 Jun 8 22:33 jmap
-rwxr-xr-x 1 root root 12384 Jun 8 22:33 jmod
-rwxr-xr-x 1 root root 12392 Jun 8 22:33 jpackage
-rwxr-xr-x 1 root root 12384 Jun 8 22:33 jps
-rwxr-xr-x 1 root root 12424 Jun 8 22:33 jrunscript
-rwxr-xr-x 1 root root 12392 Jun 8 22:33 jshell
-rwxr-xr-x 1 root root 12424 Jun 8 22:33 jstack
-rwxr-xr-x 1 root root 12384 Jun 8 22:33 jstat
-rwxr-xr-x 1 root root 12392 Jun 8 22:33 jstatd
-rwxr-xr-x 1 root root 12392 Jun 8 22:33 jwebserver
-rwxr-xr-x 1 root root 12392 Jun 8 22:33 keytool
-rwxr-xr-x 1 root root 12416 Jun 8 22:33 rmiregistry
-rwxr-xr-x 1 root root 12392 Jun 8 22:33 serialver
+ /home/jenkins/tools/java/latest22/bin/java -version
openjdk version "22-ea" 2024-03-19
OpenJDK Runtime Environment (build 22-ea+1-7)
OpenJDK 64-Bit Server VM (build 22-ea+1-7, mixed mode, sharing)
+ echo which java
which java
+ which java
/home/jenkins/tools/java/latest22/bin/java
+ java -version
openjdk version "22-ea" 2024-03-19
OpenJDK Runtime Environment (build 22-ea+1-7)
OpenJDK 64-Bit Server VM (build 22-ea+1-7, mixed mode, sharing)
+ echo which javac
which javac
+ which javac
/home/jenkins/tools/java/latest22/bin/javac
+ javac -version
javac 22-ea
+ echo Ant-Home:
Ant-Home:
+ ls -al
total 416
drwxr-xr-x 11 jenkins jenkins 4096 Oct 22 11:52 .
drwxr-xr-x 6 jenkins jenkins 4096 Sep 29 12:07 ..
-rw-r--r-- 1 jenkins jenkins 29240 Oct 22 11:52 build.gradle
-rw-r--r-- 1 jenkins jenkins 54100 Oct 22 11:52 build.xml
-rw-r--r-- 1 jenkins jenkins 11963 Aug 13 11:52 CHANGES.txt
drwxr-xr-x 3 jenkins jenkins 4096 Aug 13 11:52 .github
-rw-r--r-- 1 jenkins jenkins 14 Aug 13 11:52 .gitignore
drwxr-xr-x 3 jenkins jenkins 4096 Aug 13 11:52 gradle
drwxr-xr-x 5 jenkins jenkins 4096 Sep 24 11:52 .gradle
-rw-r--r-- 1 jenkins jenkins 1338 Aug 13 11:52 gradle.properties
-rwxr-xr-x 1 jenkins jenkins 9125 Oct 8 11:52 gradlew
-rw-r--r-- 1 jenkins jenkins 176157 Aug 13 11:52 KEYS
drwxr-xr-x 2 jenkins jenkins 4096 Aug 13 11:52 legal
-rwxr-xr-x 1 jenkins jenkins 12458 Oct 22 11:52 LICENSE-binary.txt
-rwxr-xr-x 1 jenkins jenkins 11884 Aug 13 11:52 LICENSE.txt
-rw-r--r-- 1 jenkins jenkins 2561 Aug 13 11:52 NOTICE-binary.txt
-rw-r--r-- 1 jenkins jenkins 1592 Aug 13 11:52 NOTICE.txt
-rw-r--r-- 1 jenkins jenkins 2227 Aug 13 11:52 README.txt
-rw-r--r-- 1 jenkins jenkins 10995 Sep 24 11:52 release-guide.txt
drwxr-xr-x 16 jenkins jenkins 4096 Aug 13 11:52 samples
-rw-r--r-- 1 jenkins jenkins 238 Aug 13 11:52 SECURITY.md
-rw-r--r-- 1 jenkins jenkins 661 Aug 13 11:52 settings.gradle
drwxr-xr-x 4 jenkins jenkins 4096 Aug 13 11:52 src
-rw-r--r-- 1 jenkins jenkins 359 Oct 8 11:52 STATUS
drwxr-xr-x 4 jenkins jenkins 4096 Oct 22 11:52 .svn
drwxr-xr-x 5 jenkins jenkins 4096 Aug 13 11:52 test
-rw-r--r-- 1 jenkins jenkins 3803 Aug 13 11:52 wrapper.gradle
-rw-r--r-- 1 jenkins jenkins 25 Aug 13 11:52 xbeanenv.cmd
-rwxr-xr-x 1 jenkins jenkins 27 Aug 13 11:52 xbeanenv.sh
drwxr-xr-x 2 jenkins jenkins 4096 Aug 13 11:52 xkit
+ echo which ant
which ant
+ which ant
/usr/bin/ant
+ ant -version
Apache Ant(TM) version 1.10.5 compiled on March 28 2019
+ echo <project default="test"><target name="test"><echo>Java ${ant.java.version}/${java.version}</echo><exec executable="javac"><arg value="-version"/></exec></target></project>
+ ant -f build.javacheck.xml -v
Apache Ant(TM) version 1.10.5 compiled on March 28 2019
Buildfile: <https://ci-builds.apache.org/job/POI/job/POI-XMLBeans-DSL-1.22/ws/build.javacheck.xml>
Detected Java version: 22 in: /usr/local/asfpackages/java/openjdk-22-ea+1
Detected OS: Linux
parsing buildfile <https://ci-builds.apache.org/job/POI/job/POI-XMLBeans-DSL-1.22/ws/build.javacheck.xml> with URI = <https://ci-builds.apache.org/job/POI/job/POI-XMLBeans-DSL-1.22/ws/build.javacheck.xml>
Project base dir set to: <https://ci-builds.apache.org/job/POI/job/POI-XMLBeans-DSL-1.22/ws/>
Build sequence for target(s) `test' is [test]
Complete build sequence is [test, ]
test:
parsing buildfile jar:file:/usr/share/ant/lib/ant.jar!/org/apache/tools/ant/antlib.xml with URI = jar:file:/usr/share/ant/lib/ant.jar!/org/apache/tools/ant/antlib.xml from a zip file
[echo] Java 22/22-ea
[exec] Current OS is Linux
[exec] Executing 'javac' with arguments:
[exec] '-version'
[exec]
[exec] The ' characters around the executable and arguments are
[exec] not part of the command.
[exec] javac 22-ea
BUILD SUCCESSFUL
Total time: 1 second
+ exit 0
[Gradle] - Launching build.
ERROR: Not all environment variables could be successfully injected. Check for similarly-named environment variables.
[POI-XMLBeans-DSL-1.22] $ <https://ci-builds.apache.org/job/POI/job/POI-XMLBeans-DSL-1.22/ws/gradlew> clean jenkins jacocoTestReport
To honour the JVM settings for this build a single-use Daemon process will be forked. For more on this, please refer to https://docs.gradle.org/8.3/userguide/gradle_daemon.html#sec:disabling_the_daemon in the Gradle documentation.
Daemon will be stopped at the end of the build
Configuration on demand is an incubating feature.
FAILURE: Build failed with an exception.
* Where:
Build file '<https://ci-builds.apache.org/job/POI/job/POI-XMLBeans-DSL-1.22/ws/build.gradle'> line: 37
* What went wrong:
An exception occurred applying plugin request [id: 'de.thetaphi.forbiddenapis', version: '3.4']
> Failed to apply plugin 'de.thetaphi.forbiddenapis'.
> Could not create plugin of type 'ForbiddenApisPlugin'.
> BUG! exception in phase 'semantic analysis' in source unit 'jar:file:/home/jenkins/.gradle/caches/modules-2/files-2.1/de.thetaphi/forbiddenapis/3.4/413c25496dd3128964ee80c8778b92138156de7c/forbiddenapis-3.4.jar!/de/thetaphi/forbiddenapis/gradle/plugin-init.groovy' Unsupported class file major version 66
* Try:
> Run with --stacktrace option to get the stack trace.
> Run with --info or --debug option to get more log output.
> Run with --scan to get full insights.
> Get more help at https://help.gradle.org.
BUILD FAILED in 14s
Build step 'Invoke Gradle script' changed build result to FAILURE
Build step 'Invoke Gradle script' marked build as failure
ERROR: Not all environment variables could be successfully injected. Check for similarly-named environment variables.
Archiving artifacts
ERROR: Not all environment variables could be successfully injected. Check for similarly-named environment variables.
Recording test results
ERROR: Not all environment variables could be successfully injected. Check for similarly-named environment variables.
ERROR: Step ?Publish JUnit test result report? failed: No test report files were found. Configuration error?
[SpotBugs] Skipping execution of recorder since overall result is 'FAILURE'
ERROR: Not all environment variables could be successfully injected. Check for similarly-named environment variables.
---------------------------------------------------------------------
To unsubscribe, e-mail: dev-unsubscribe@poi.apache.org
For additional commands, e-mail: dev-help@poi.apache.org
Build failed in Jenkins: POI » POI-XMLBeans-DSL-1.22 #5
Posted by Apache Jenkins Server <je...@builds.apache.org>.
See <https://ci-builds.apache.org/job/POI/job/POI-XMLBeans-DSL-1.22/5/display/redirect?page=changes>
Changes:
[PJ Fanning] [XMLBEANS-641] add check for empty local part when saving XML
------------------------------------------
Started by an SCM change
Running as SYSTEM
ERROR: Not all environment variables could be successfully injected. Check for similarly-named environment variables.
[EnvInject] - Loading node environment variables.
[EnvInject] - Preparing an environment for the build.
[EnvInject] - Keeping Jenkins system variables.
[EnvInject] - Keeping Jenkins build variables.
[EnvInject] - Injecting as environment variables the properties content
FORREST_HOME=/home/jenkins/tools/forrest/latest
LANG=en_US.UTF-8
[EnvInject] - Variables injected successfully.
[EnvInject] - Injecting contributions.
Building remotely on builds29 (ubuntu) in workspace <https://ci-builds.apache.org/job/POI/job/POI-XMLBeans-DSL-1.22/ws/>
ERROR: Not all environment variables could be successfully injected. Check for similarly-named environment variables.
Updating https://svn.apache.org/repos/asf/xmlbeans/trunk at revision '2023-10-08T11:52:09.116 +0000'
U src/main/java/org/apache/xmlbeans/impl/store/Saver.java
U src/main/java/org/apache/xmlbeans/impl/xpath/saxon/SaxonXPath.java
U src/main/java/org/apache/xmlbeans/impl/xpath/saxon/SaxonXQuery.java
U src/main/java9/module-info.class
U src/main/maven/org.apache.xmlbeans/xmlbeans/pom.xml
U src/main/maven/plugin.xml
U STATUS
U LICENSE-binary.txt
U build.gradle
U build.xml
U gradlew
At revision 1912818
ERROR: Not all environment variables could be successfully injected. Check for similarly-named environment variables.
[POI-XMLBeans-DSL-1.22] $ /bin/sh -xe /tmp/jenkins7512040935565637926.sh
+ rm -rf examples excelant integrationtest main ooxml ooxml-schema scratchpad build.javacheck.xml
+ svn status
+ svn revert poi*/src/*/java9/module-info.*
svn: E155010: The node '<https://ci-builds.apache.org/job/POI/job/POI-XMLBeans-DSL-1.22/ws/poi*/src/*'> was not found.
+ true
+ svn revert src/resources/ooxml-lite-report.*
Skipped 'src/resources/ooxml-lite-report.*'
+ echo Java-Home: /home/jenkins/tools/java/latest22
Java-Home: /home/jenkins/tools/java/latest22
+ ls -al /home/jenkins/tools/java/latest22/
total 36
drwxr-xr-x 8 root root 4096 Jun 14 06:03 .
drwxr-xr-x 35 root root 4096 Jul 19 19:13 ..
drwxr-xr-x 2 root root 4096 Jun 14 06:03 bin
drwxr-xr-x 5 root root 4096 Jun 14 06:03 conf
drwxr-xr-x 3 root root 4096 Jun 14 06:03 include
drwxr-xr-x 2 root root 4096 Jun 14 06:03 jmods
drwxr-xr-x 71 root root 4096 Jun 14 06:03 legal
drwxr-xr-x 5 root root 4096 Jun 14 06:03 lib
-rw-r--r-- 1 root root 1216 Jun 8 22:33 release
+ ls -al /home/jenkins/tools/java/latest22/bin
total 472
drwxr-xr-x 2 root root 4096 Jun 14 06:03 .
drwxr-xr-x 8 root root 4096 Jun 14 06:03 ..
-rwxr-xr-x 1 root root 12384 Jun 8 22:33 jar
-rwxr-xr-x 1 root root 12392 Jun 8 22:33 jarsigner
-rwxr-xr-x 1 root root 12328 Jun 8 22:33 java
-rwxr-xr-x 1 root root 12416 Jun 8 22:33 javac
-rwxr-xr-x 1 root root 12424 Jun 8 22:33 javadoc
-rwxr-xr-x 1 root root 12384 Jun 8 22:33 javap
-rwxr-xr-x 1 root root 12384 Jun 8 22:33 jcmd
-rwxr-xr-x 1 root root 12456 Jun 8 22:33 jconsole
-rwxr-xr-x 1 root root 12384 Jun 8 22:33 jdb
-rwxr-xr-x 1 root root 12392 Jun 8 22:33 jdeprscan
-rwxr-xr-x 1 root root 12384 Jun 8 22:33 jdeps
-rwxr-xr-x 1 root root 12384 Jun 8 22:33 jfr
-rwxr-xr-x 1 root root 12384 Jun 8 22:33 jhsdb
-rwxr-xr-x 1 root root 12392 Jun 8 22:33 jimage
-rwxr-xr-x 1 root root 12416 Jun 8 22:33 jinfo
-rwxr-xr-x 1 root root 12416 Jun 8 22:33 jlink
-rwxr-xr-x 1 root root 12416 Jun 8 22:33 jmap
-rwxr-xr-x 1 root root 12384 Jun 8 22:33 jmod
-rwxr-xr-x 1 root root 12392 Jun 8 22:33 jpackage
-rwxr-xr-x 1 root root 12384 Jun 8 22:33 jps
-rwxr-xr-x 1 root root 12424 Jun 8 22:33 jrunscript
-rwxr-xr-x 1 root root 12392 Jun 8 22:33 jshell
-rwxr-xr-x 1 root root 12424 Jun 8 22:33 jstack
-rwxr-xr-x 1 root root 12384 Jun 8 22:33 jstat
-rwxr-xr-x 1 root root 12392 Jun 8 22:33 jstatd
-rwxr-xr-x 1 root root 12392 Jun 8 22:33 jwebserver
-rwxr-xr-x 1 root root 12392 Jun 8 22:33 keytool
-rwxr-xr-x 1 root root 12416 Jun 8 22:33 rmiregistry
-rwxr-xr-x 1 root root 12392 Jun 8 22:33 serialver
+ /home/jenkins/tools/java/latest22/bin/java -version
openjdk version "22-ea" 2024-03-19
OpenJDK Runtime Environment (build 22-ea+1-7)
OpenJDK 64-Bit Server VM (build 22-ea+1-7, mixed mode, sharing)
+ echo which java
which java
+ which java
/home/jenkins/tools/java/latest22/bin/java
+ java -version
openjdk version "22-ea" 2024-03-19
OpenJDK Runtime Environment (build 22-ea+1-7)
OpenJDK 64-Bit Server VM (build 22-ea+1-7, mixed mode, sharing)
+ echo which javac
which javac
+ which javac
/home/jenkins/tools/java/latest22/bin/javac
+ javac -version
javac 22-ea
+ echo Ant-Home:
Ant-Home:
+ ls -al
total 416
drwxr-xr-x 11 jenkins jenkins 4096 Oct 8 11:52 .
drwxr-xr-x 6 jenkins jenkins 4096 Sep 29 12:07 ..
-rw-r--r-- 1 jenkins jenkins 29240 Oct 8 11:52 build.gradle
-rw-r--r-- 1 jenkins jenkins 54100 Oct 8 11:52 build.xml
-rw-r--r-- 1 jenkins jenkins 11963 Aug 13 11:52 CHANGES.txt
drwxr-xr-x 3 jenkins jenkins 4096 Aug 13 11:52 .github
-rw-r--r-- 1 jenkins jenkins 14 Aug 13 11:52 .gitignore
drwxr-xr-x 3 jenkins jenkins 4096 Aug 13 11:52 gradle
drwxr-xr-x 5 jenkins jenkins 4096 Sep 24 11:52 .gradle
-rw-r--r-- 1 jenkins jenkins 1338 Aug 13 11:52 gradle.properties
-rwxr-xr-x 1 jenkins jenkins 9125 Oct 8 11:52 gradlew
-rw-r--r-- 1 jenkins jenkins 176157 Aug 13 11:52 KEYS
drwxr-xr-x 2 jenkins jenkins 4096 Aug 13 11:52 legal
-rwxr-xr-x 1 jenkins jenkins 12458 Oct 8 11:52 LICENSE-binary.txt
-rwxr-xr-x 1 jenkins jenkins 11884 Aug 13 11:52 LICENSE.txt
-rw-r--r-- 1 jenkins jenkins 2561 Aug 13 11:52 NOTICE-binary.txt
-rw-r--r-- 1 jenkins jenkins 1592 Aug 13 11:52 NOTICE.txt
-rw-r--r-- 1 jenkins jenkins 2227 Aug 13 11:52 README.txt
-rw-r--r-- 1 jenkins jenkins 10995 Sep 24 11:52 release-guide.txt
drwxr-xr-x 16 jenkins jenkins 4096 Aug 13 11:52 samples
-rw-r--r-- 1 jenkins jenkins 238 Aug 13 11:52 SECURITY.md
-rw-r--r-- 1 jenkins jenkins 661 Aug 13 11:52 settings.gradle
drwxr-xr-x 4 jenkins jenkins 4096 Aug 13 11:52 src
-rw-r--r-- 1 jenkins jenkins 359 Oct 8 11:52 STATUS
drwxr-xr-x 4 jenkins jenkins 4096 Oct 8 11:52 .svn
drwxr-xr-x 5 jenkins jenkins 4096 Aug 13 11:52 test
-rw-r--r-- 1 jenkins jenkins 3803 Aug 13 11:52 wrapper.gradle
-rw-r--r-- 1 jenkins jenkins 25 Aug 13 11:52 xbeanenv.cmd
-rwxr-xr-x 1 jenkins jenkins 27 Aug 13 11:52 xbeanenv.sh
drwxr-xr-x 2 jenkins jenkins 4096 Aug 13 11:52 xkit
+ echo which ant
which ant
+ which ant
/usr/bin/ant
+ ant -version
Apache Ant(TM) version 1.10.5 compiled on March 28 2019
+ echo <project default="test"><target name="test"><echo>Java ${ant.java.version}/${java.version}</echo><exec executable="javac"><arg value="-version"/></exec></target></project>
+ ant -f build.javacheck.xml -v
Apache Ant(TM) version 1.10.5 compiled on March 28 2019
Buildfile: <https://ci-builds.apache.org/job/POI/job/POI-XMLBeans-DSL-1.22/ws/build.javacheck.xml>
Detected Java version: 22 in: /usr/local/asfpackages/java/openjdk-22-ea+1
Detected OS: Linux
parsing buildfile <https://ci-builds.apache.org/job/POI/job/POI-XMLBeans-DSL-1.22/ws/build.javacheck.xml> with URI = <https://ci-builds.apache.org/job/POI/job/POI-XMLBeans-DSL-1.22/ws/build.javacheck.xml>
Project base dir set to: <https://ci-builds.apache.org/job/POI/job/POI-XMLBeans-DSL-1.22/ws/>
Build sequence for target(s) `test' is [test]
Complete build sequence is [test, ]
test:
parsing buildfile jar:file:/usr/share/ant/lib/ant.jar!/org/apache/tools/ant/antlib.xml with URI = jar:file:/usr/share/ant/lib/ant.jar!/org/apache/tools/ant/antlib.xml from a zip file
[echo] Java 22/22-ea
[exec] Current OS is Linux
[exec] Executing 'javac' with arguments:
[exec] '-version'
[exec]
[exec] The ' characters around the executable and arguments are
[exec] not part of the command.
[exec] javac 22-ea
BUILD SUCCESSFUL
Total time: 1 second
+ exit 0
[Gradle] - Launching build.
ERROR: Not all environment variables could be successfully injected. Check for similarly-named environment variables.
[POI-XMLBeans-DSL-1.22] $ <https://ci-builds.apache.org/job/POI/job/POI-XMLBeans-DSL-1.22/ws/gradlew> clean jenkins jacocoTestReport
To honour the JVM settings for this build a single-use Daemon process will be forked. For more on this, please refer to https://docs.gradle.org/8.3/userguide/gradle_daemon.html#sec:disabling_the_daemon in the Gradle documentation.
Daemon will be stopped at the end of the build
Configuration on demand is an incubating feature.
FAILURE: Build failed with an exception.
* Where:
Build file '<https://ci-builds.apache.org/job/POI/job/POI-XMLBeans-DSL-1.22/ws/build.gradle'> line: 37
* What went wrong:
An exception occurred applying plugin request [id: 'de.thetaphi.forbiddenapis', version: '3.4']
> Failed to apply plugin 'de.thetaphi.forbiddenapis'.
> Could not create plugin of type 'ForbiddenApisPlugin'.
> BUG! exception in phase 'semantic analysis' in source unit 'jar:file:/home/jenkins/.gradle/caches/modules-2/files-2.1/de.thetaphi/forbiddenapis/3.4/413c25496dd3128964ee80c8778b92138156de7c/forbiddenapis-3.4.jar!/de/thetaphi/forbiddenapis/gradle/plugin-init.groovy' Unsupported class file major version 66
* Try:
> Run with --stacktrace option to get the stack trace.
> Run with --info or --debug option to get more log output.
> Run with --scan to get full insights.
> Get more help at https://help.gradle.org.
BUILD FAILED in 14s
Build step 'Invoke Gradle script' changed build result to FAILURE
Build step 'Invoke Gradle script' marked build as failure
ERROR: Not all environment variables could be successfully injected. Check for similarly-named environment variables.
Archiving artifacts
ERROR: Not all environment variables could be successfully injected. Check for similarly-named environment variables.
Recording test results
ERROR: Not all environment variables could be successfully injected. Check for similarly-named environment variables.
ERROR: Step ?Publish JUnit test result report? failed: No test report files were found. Configuration error?
[SpotBugs] Skipping execution of recorder since overall result is 'FAILURE'
ERROR: Not all environment variables could be successfully injected. Check for similarly-named environment variables.
---------------------------------------------------------------------
To unsubscribe, e-mail: dev-unsubscribe@poi.apache.org
For additional commands, e-mail: dev-help@poi.apache.org
Build failed in Jenkins: POI » POI-XMLBeans-DSL-1.22 #4
Posted by Apache Jenkins Server <je...@builds.apache.org>.
See <https://ci-builds.apache.org/job/POI/job/POI-XMLBeans-DSL-1.22/4/display/redirect?page=changes>
Changes:
[PJ Fanning] web site
[PJ Fanning] saxon 12.3
[PJ Fanning] upgrade xmlresolver
[PJ Fanning] upgrade javaparser
[PJ Fanning] upgrade ant
[PJ Fanning] update gradlew
------------------------------------------
[...truncated 168.94 KB...]
A test/perf/bin/svn.bat
AU test/perf/bin/v2.bat
A test/perf/bin/parsers.bat
A test/perf/bin/run_jaxb2.bat
A test/perf/bin/run_all.bat
A test/perf/bin/run_all_nonmemory.bat
A test/perf/bin/jaxb2.bat
A test/perf/bin/xerces.sh
A test/perf/bin/castor.sh
A test/perf/bin/jaxb.bat
A test/perf/bin/run_xmlbeans_all.bat
A test/perf/bin/jaxb.sh
A test/perf/bin/xerces.bat
AU test/perf/bin/castor.bat
A test/perf/bin/run_xmlbeans_nonmemory.bat
A test/perf/bin/run_svn.bat
A test/perf/bin/run_svn_nonmemory.bat
A test/perf/bin/run_svn.sh
A test/perf/bin/run_v1_nonmemory.bat
A test/perf/bin/run_v2_nonmemory.bat
A test/perf/bin/run_xerces_nonmemory.bat
A test/perf/bin/run_all.sh
A test/perf/bin/run_v2.sh
A test/perf/bin/run_v1.bat
A test/perf/bin/run_v2.bat
A test/perf/bin/run_jaxb.sh
A test/perf/bin/run_xerces.bat
A test/perf/bin/run_v1.sh
A test/perf/bin/run_castor.bat
A test/perf/bin/run_xerces.sh
A test/perf/bin/run_castor.sh
A test/perf/bin/run_jaxb.bat
A test/perf/bin/v1.sh
A test/perf/bin/jibx.sh
A test/perf/bin/run_jibx.bat
AU test/perf/bin/v1.bat
AU test/perf/bin/jibx.bat
A test/perf/bin/castor.properties
A test/perf/bin/run_jibx.sh
A test/perf/download.properties
A test/perf/cases
AU test/perf/cases/parser_instances.zip
A test/perf/cases/xsd
A test/perf/cases/xsd/non-primitives.xsd
A test/perf/cases/xsd/purchase-order-1.xml
A test/perf/cases/xsd/purchase-order.xsd
A test/perf/cases/xsd/purchase-order-2.xml
A test/perf/cases/xsd/purchase-order-3.xml
A test/perf/cases/xsd/doc.xsd
A test/perf/cases/xsd/purchase-order-4.xml
A test/perf/cases/xsd/purchase-order-5.xml
A test/perf/cases/xsd/purchase-order-6.xml
A test/perf/cases/xsd/purchase-order-7.xml
A test/perf/cases/xsd/purchase-order-jibxbinding.xml
A test/perf/cases/xsd/perf-results.xsd
A test/perf/cases/xsd/primitives.xsd
A test/perf/results.xml
AU test/perf/env.sh
AU test/perf/env.bat
A test/tools
A test/tools/lib
A test/tools/lib/xsl
AU test/tools/lib/xsl/junit.css
AU test/tools/lib/xsl/TestReport.xsl
AU test/tools/lib/xsl/TestReport.xsd
A test/tools/lib/ant-ext
AU test/tools/lib/ant-ext/antexts.jar
AU test/tools/lib/ant-ext/ant-contrib-0.6.jar
AU test/tools/lib/JWhich.jar
A test/docs
AU test/docs/BuildingAndRunningTests.txt
AU test/docs/TestOrganization.txt
AU test/readme.txt
A settings.gradle
A SECURITY.md
A CHANGES.txt
A .gitignore
AU xbeanenv.sh
AU xbeanenv.cmd
U .
At revision 1912661
ERROR: Not all environment variables could be successfully injected. Check for similarly-named environment variables.
[POI-XMLBeans-DSL-1.22] $ /bin/sh -xe /tmp/jenkins2164064991366383416.sh
+ rm -rf examples excelant integrationtest main ooxml ooxml-schema scratchpad build.javacheck.xml
+ svn status
+ svn revert poi*/src/*/java9/module-info.*
svn: E155010: The node '<https://ci-builds.apache.org/job/POI/job/POI-XMLBeans-DSL-1.22/ws/poi*/src/*'> was not found.
+ true
+ svn revert src/resources/ooxml-lite-report.*
Skipped 'src/resources/ooxml-lite-report.*'
+ echo Java-Home: /home/jenkins/tools/java/latest22
Java-Home: /home/jenkins/tools/java/latest22
+ ls -al /home/jenkins/tools/java/latest22/
total 36
drwxr-xr-x 8 root root 4096 Jul 19 20:04 .
drwxrwxr-x 35 root root 4096 Jul 19 20:06 ..
drwxr-xr-x 2 root root 4096 Jul 19 20:04 bin
drwxr-xr-x 5 root root 4096 Jul 19 20:04 conf
drwxr-xr-x 3 root root 4096 Jul 19 20:04 include
drwxr-xr-x 2 root root 4096 Jul 19 20:04 jmods
drwxr-xr-x 71 root root 4096 Jul 19 20:04 legal
drwxr-xr-x 5 root root 4096 Jul 19 20:04 lib
-rw-r--r-- 1 root root 1216 Jun 8 22:33 release
+ ls -al /home/jenkins/tools/java/latest22/bin
total 472
drwxr-xr-x 2 root root 4096 Jul 19 20:04 .
drwxr-xr-x 8 root root 4096 Jul 19 20:04 ..
-rwxr-xr-x 1 root root 12384 Jun 8 22:33 jar
-rwxr-xr-x 1 root root 12392 Jun 8 22:33 jarsigner
-rwxr-xr-x 1 root root 12328 Jun 8 22:33 java
-rwxr-xr-x 1 root root 12416 Jun 8 22:33 javac
-rwxr-xr-x 1 root root 12424 Jun 8 22:33 javadoc
-rwxr-xr-x 1 root root 12384 Jun 8 22:33 javap
-rwxr-xr-x 1 root root 12384 Jun 8 22:33 jcmd
-rwxr-xr-x 1 root root 12456 Jun 8 22:33 jconsole
-rwxr-xr-x 1 root root 12384 Jun 8 22:33 jdb
-rwxr-xr-x 1 root root 12392 Jun 8 22:33 jdeprscan
-rwxr-xr-x 1 root root 12384 Jun 8 22:33 jdeps
-rwxr-xr-x 1 root root 12384 Jun 8 22:33 jfr
-rwxr-xr-x 1 root root 12384 Jun 8 22:33 jhsdb
-rwxr-xr-x 1 root root 12392 Jun 8 22:33 jimage
-rwxr-xr-x 1 root root 12416 Jun 8 22:33 jinfo
-rwxr-xr-x 1 root root 12416 Jun 8 22:33 jlink
-rwxr-xr-x 1 root root 12416 Jun 8 22:33 jmap
-rwxr-xr-x 1 root root 12384 Jun 8 22:33 jmod
-rwxr-xr-x 1 root root 12392 Jun 8 22:33 jpackage
-rwxr-xr-x 1 root root 12384 Jun 8 22:33 jps
-rwxr-xr-x 1 root root 12424 Jun 8 22:33 jrunscript
-rwxr-xr-x 1 root root 12392 Jun 8 22:33 jshell
-rwxr-xr-x 1 root root 12424 Jun 8 22:33 jstack
-rwxr-xr-x 1 root root 12384 Jun 8 22:33 jstat
-rwxr-xr-x 1 root root 12392 Jun 8 22:33 jstatd
-rwxr-xr-x 1 root root 12392 Jun 8 22:33 jwebserver
-rwxr-xr-x 1 root root 12392 Jun 8 22:33 keytool
-rwxr-xr-x 1 root root 12416 Jun 8 22:33 rmiregistry
-rwxr-xr-x 1 root root 12392 Jun 8 22:33 serialver
+ /home/jenkins/tools/java/latest22/bin/java -version
openjdk version "22-ea" 2024-03-19
OpenJDK Runtime Environment (build 22-ea+1-7)
OpenJDK 64-Bit Server VM (build 22-ea+1-7, mixed mode, sharing)
+ echo which java
which java
+ which java
/home/jenkins/tools/java/latest22/bin/java
+ java -version
openjdk version "22-ea" 2024-03-19
OpenJDK Runtime Environment (build 22-ea+1-7)
OpenJDK 64-Bit Server VM (build 22-ea+1-7, mixed mode, sharing)
+ echo which javac
which javac
+ which javac
/home/jenkins/tools/java/latest22/bin/javac
+ javac -version
javac 22-ea
+ echo Ant-Home:
Ant-Home:
+ ls -al
total 412
drwxr-xr-x 10 jenkins jenkins 4096 Oct 1 16:08 .
drwxr-xr-x 4 jenkins jenkins 4096 Oct 1 16:03 ..
-rw-r--r-- 1 jenkins jenkins 29240 Oct 1 16:08 build.gradle
-rw-r--r-- 1 jenkins jenkins 54100 Oct 1 16:08 build.xml
-rw-r--r-- 1 jenkins jenkins 11963 Oct 1 16:08 CHANGES.txt
drwxr-xr-x 3 jenkins jenkins 4096 Oct 1 16:08 .github
-rw-r--r-- 1 jenkins jenkins 14 Oct 1 16:08 .gitignore
drwxr-xr-x 3 jenkins jenkins 4096 Oct 1 16:08 gradle
-rw-r--r-- 1 jenkins jenkins 1338 Oct 1 16:08 gradle.properties
-rwxr-xr-x 1 jenkins jenkins 9125 Oct 1 16:08 gradlew
-rw-r--r-- 1 jenkins jenkins 176157 Oct 1 16:08 KEYS
drwxr-xr-x 2 jenkins jenkins 4096 Oct 1 16:08 legal
-rwxr-xr-x 1 jenkins jenkins 12458 Oct 1 16:08 LICENSE-binary.txt
-rwxr-xr-x 1 jenkins jenkins 11884 Oct 1 16:08 LICENSE.txt
-rw-r--r-- 1 jenkins jenkins 2561 Oct 1 16:08 NOTICE-binary.txt
-rw-r--r-- 1 jenkins jenkins 1592 Oct 1 16:08 NOTICE.txt
-rw-r--r-- 1 jenkins jenkins 2227 Oct 1 16:08 README.txt
-rw-r--r-- 1 jenkins jenkins 10995 Oct 1 16:08 release-guide.txt
drwxr-xr-x 16 jenkins jenkins 4096 Oct 1 16:08 samples
-rw-r--r-- 1 jenkins jenkins 238 Oct 1 16:08 SECURITY.md
-rw-r--r-- 1 jenkins jenkins 661 Oct 1 16:08 settings.gradle
drwxr-xr-x 4 jenkins jenkins 4096 Oct 1 16:08 src
-rw-r--r-- 1 jenkins jenkins 359 Oct 1 16:08 STATUS
drwxr-xr-x 4 jenkins jenkins 4096 Oct 1 16:08 .svn
drwxr-xr-x 5 jenkins jenkins 4096 Oct 1 16:08 test
-rw-r--r-- 1 jenkins jenkins 3803 Oct 1 16:08 wrapper.gradle
-rw-r--r-- 1 jenkins jenkins 25 Oct 1 16:08 xbeanenv.cmd
-rwxr-xr-x 1 jenkins jenkins 27 Oct 1 16:08 xbeanenv.sh
drwxr-xr-x 2 jenkins jenkins 4096 Oct 1 16:08 xkit
+ echo which ant
which ant
+ which ant
/usr/bin/ant
+ ant -version
Apache Ant(TM) version 1.10.5 compiled on March 28 2019
+ echo <project default="test"><target name="test"><echo>Java ${ant.java.version}/${java.version}</echo><exec executable="javac"><arg value="-version"/></exec></target></project>
+ ant -f build.javacheck.xml -v
Apache Ant(TM) version 1.10.5 compiled on March 28 2019
Buildfile: <https://ci-builds.apache.org/job/POI/job/POI-XMLBeans-DSL-1.22/ws/build.javacheck.xml>
Detected Java version: 22 in: /usr/local/asfpackages/java/openjdk-22-ea+1
Detected OS: Linux
parsing buildfile <https://ci-builds.apache.org/job/POI/job/POI-XMLBeans-DSL-1.22/ws/build.javacheck.xml> with URI = <https://ci-builds.apache.org/job/POI/job/POI-XMLBeans-DSL-1.22/ws/build.javacheck.xml>
Project base dir set to: <https://ci-builds.apache.org/job/POI/job/POI-XMLBeans-DSL-1.22/ws/>
Build sequence for target(s) `test' is [test]
Complete build sequence is [test, ]
test:
parsing buildfile jar:file:/usr/share/ant/lib/ant.jar!/org/apache/tools/ant/antlib.xml with URI = jar:file:/usr/share/ant/lib/ant.jar!/org/apache/tools/ant/antlib.xml from a zip file
[echo] Java 22/22-ea
[exec] Current OS is Linux
[exec] Executing 'javac' with arguments:
[exec] '-version'
[exec]
[exec] The ' characters around the executable and arguments are
[exec] not part of the command.
[exec] javac 22-ea
BUILD SUCCESSFUL
Total time: 1 second
+ exit 0
[Gradle] - Launching build.
ERROR: Not all environment variables could be successfully injected. Check for similarly-named environment variables.
[POI-XMLBeans-DSL-1.22] $ <https://ci-builds.apache.org/job/POI/job/POI-XMLBeans-DSL-1.22/ws/gradlew> clean jenkins jacocoTestReport
To honour the JVM settings for this build a single-use Daemon process will be forked. For more on this, please refer to https://docs.gradle.org/8.3/userguide/gradle_daemon.html#sec:disabling_the_daemon in the Gradle documentation.
Daemon will be stopped at the end of the build
Configuration on demand is an incubating feature.
FAILURE: Build failed with an exception.
* What went wrong:
Could not open settings generic class cache for settings file '<https://ci-builds.apache.org/job/POI/job/POI-XMLBeans-DSL-1.22/ws/settings.gradle'> (/home/jenkins/.gradle/caches/8.3/scripts/8ugtk549zbyo7dlpn3zjxa8zc).
> BUG! exception in phase 'semantic analysis' in source unit '_BuildScript_' Unsupported class file major version 66
* Try:
> Run with --stacktrace option to get the stack trace.
> Run with --info or --debug option to get more log output.
> Run with --scan to get full insights.
> Get more help at https://help.gradle.org.
BUILD FAILED in 14s
Build step 'Invoke Gradle script' changed build result to FAILURE
Build step 'Invoke Gradle script' marked build as failure
ERROR: Not all environment variables could be successfully injected. Check for similarly-named environment variables.
Archiving artifacts
ERROR: Not all environment variables could be successfully injected. Check for similarly-named environment variables.
Recording test results
ERROR: Not all environment variables could be successfully injected. Check for similarly-named environment variables.
ERROR: Step ?Publish JUnit test result report? failed: No test report files were found. Configuration error?
[SpotBugs] Skipping execution of recorder since overall result is 'FAILURE'
ERROR: Not all environment variables could be successfully injected. Check for similarly-named environment variables.
---------------------------------------------------------------------
To unsubscribe, e-mail: dev-unsubscribe@poi.apache.org
For additional commands, e-mail: dev-help@poi.apache.org