You are viewing a plain text version of this content. The canonical link for it is here.
Posted to builds@beam.apache.org by Apache Jenkins Server <je...@builds.apache.org> on 2023/08/11 00:13:05 UTC

Build failed in Jenkins: beam_PostCommit_Java_PVR_Spark_Batch #2363

See <https://ci-beam.apache.org/job/beam_PostCommit_Java_PVR_Spark_Batch/2363/display/redirect>

Changes:


------------------------------------------
[...truncated 45.13 KB...]
#9 CACHED

#10 exporting to image
#10 exporting layers done
#10 writing image sha256:d90a2108e7f710b9bbe5e5e3f53ab55c05db2d12fa5cde511f4f5a41ea77c300 done
#10 naming to docker.io/library/golicenses-java done
#10 DONE 0.0s

> Task :sdks:java:container:pullLicenses
    Uninstalling pip-20.0.2:
      Successfully uninstalled pip-20.0.2
  Attempting uninstall: setuptools
    Found existing installation: setuptools 44.0.0
    Uninstalling setuptools-44.0.0:
      Successfully uninstalled setuptools-44.0.0
Successfully installed pip-23.2.1 setuptools-68.0.0 wheel-0.41.1
Collecting beautifulsoup4<5.0,>=4.9.0 (from -r <https://ci-beam.apache.org/job/beam_PostCommit_Java_PVR_Spark_Batch/ws/src/sdks/java/container/license_scripts/requirement.txt> (line 19))
  Using cached beautifulsoup4-4.12.2-py3-none-any.whl (142 kB)
Collecting pyyaml<7,>=6.0.1 (from -r <https://ci-beam.apache.org/job/beam_PostCommit_Java_PVR_Spark_Batch/ws/src/sdks/java/container/license_scripts/requirement.txt> (line 20))
  Obtaining dependency information for pyyaml<7,>=6.0.1 from https://files.pythonhosted.org/packages/c8/6b/6600ac24725c7388255b2f5add93f91e58a5d7efaf4af244fdbcc11a541b/PyYAML-6.0.1-cp38-cp38-manylinux_2_17_x86_64.manylinux2014_x86_64.whl.metadata
  Using cached PyYAML-6.0.1-cp38-cp38-manylinux_2_17_x86_64.manylinux2014_x86_64.whl.metadata (2.1 kB)
Collecting tenacity<9.0,>=6.1.0 (from -r <https://ci-beam.apache.org/job/beam_PostCommit_Java_PVR_Spark_Batch/ws/src/sdks/java/container/license_scripts/requirement.txt> (line 21))
  Using cached tenacity-8.2.2-py3-none-any.whl (24 kB)
Collecting soupsieve>1.2 (from beautifulsoup4<5.0,>=4.9.0->-r <https://ci-beam.apache.org/job/beam_PostCommit_Java_PVR_Spark_Batch/ws/src/sdks/java/container/license_scripts/requirement.txt> (line 19))
  Using cached soupsieve-2.4.1-py3-none-any.whl (36 kB)
Using cached PyYAML-6.0.1-cp38-cp38-manylinux_2_17_x86_64.manylinux2014_x86_64.whl (736 kB)
Installing collected packages: tenacity, soupsieve, pyyaml, beautifulsoup4
Successfully installed beautifulsoup4-4.12.2 pyyaml-6.0.1 soupsieve-2.4.1 tenacity-8.2.2
Executing python <https://ci-beam.apache.org/job/beam_PostCommit_Java_PVR_Spark_Batch/ws/src/sdks/java/container/license_scripts/pull_licenses_java.py> --license_index=<https://ci-beam.apache.org/job/beam_PostCommit_Java_PVR_Spark_Batch/ws/src/sdks/java/container/build/reports/dependency-license/index.json>        --output_dir=<https://ci-beam.apache.org/job/beam_PostCommit_Java_PVR_Spark_Batch/ws/src/sdks/java/container/build/target/java_third_party_licenses>        --dep_url_yaml=<https://ci-beam.apache.org/job/beam_PostCommit_Java_PVR_Spark_Batch/ws/src/sdks/java/container/license_scripts/dep_urls_java.yaml>        --manual_license_path=<https://ci-beam.apache.org/job/beam_PostCommit_Java_PVR_Spark_Batch/ws/src/sdks/java/container/license_scripts/manual_licenses>
INFO:root:Pulling license for 126 dependencies using 16 threads.
INFO:root:Replaced local file URL with file://<https://ci-beam.apache.org/job/beam_PostCommit_Java_PVR_Spark_Batch/ws/src/sdks/java/container/license_scripts/manual_licenses/xz/COPYING> for xz-1.5
INFO:root:pull_licenses_java.py succeed. It took 1.448637 seconds with 16 threads.
Copying licenses from <https://ci-beam.apache.org/job/beam_PostCommit_Java_PVR_Spark_Batch/ws/src/sdks/java/container/build/target/java_third_party_licenses> to <https://ci-beam.apache.org/job/beam_PostCommit_Java_PVR_Spark_Batch/ws/src/sdks/java/container/build/target/third_party_licenses.>
Finished license_scripts.sh

> Task :release:go-licenses:java:dockerRun
+ rm -rf '/output/*'
+ go get github.com/apache/beam/sdks/v2/java/container
go: downloading github.com/apache/beam/sdks/v2 v2.49.0
go: downloading github.com/apache/beam v2.49.0+incompatible

> Task :sdks:java:container:java8:copyJavaThirdPartyLicenses

> Task :sdks:java:container:downloadCloudProfilerAgent
  % Total    % Received % Xferd  Average Speed   Time    Time     Time  Current
                                 Dload  Upload   Total   Spent    Left  Speed
  0     0    0     0    0     0      0      0 --:--:-- --:--:-- --:--:--     0version.txt
NOTICES
profiler_java_agent.so
100 4183k  100 4183k    0     0  24.3M      0 --:--:-- --:--:-- --:--:-- 24.3M

> Task :sdks:java:container:goPrepare UP-TO-DATE

> Task :release:go-licenses:java:dockerRun
go: downloading github.com/golang/protobuf v1.5.3
go: downloading google.golang.org/grpc v1.56.1
go: downloading google.golang.org/protobuf v1.31.0
go: downloading golang.org/x/sys v0.9.0
go: downloading golang.org/x/net v0.11.0
go: downloading google.golang.org/genproto/googleapis/rpc v0.0.0-20230530153820-e85fd2cbaebc
go: downloading google.golang.org/genproto v0.0.0-20230530153820-e85fd2cbaebc
go: downloading golang.org/x/text v0.10.0
go: added github.com/apache/beam/sdks/v2 v2.49.0
go: added github.com/golang/protobuf v1.5.3
go: added golang.org/x/net v0.11.0
go: added golang.org/x/sys v0.9.0
go: added golang.org/x/text v0.10.0
go: added google.golang.org/genproto/googleapis/rpc v0.0.0-20230530153820-e85fd2cbaebc
go: added google.golang.org/grpc v1.56.1
go: added google.golang.org/protobuf v1.31.0
+ go-licenses save github.com/apache/beam/sdks/v2/java/container --save_path=/output/licenses

> Task :sdks:java:container:goBuild
/home/jenkins/go/bin/go1.21.0 build -o ./build/target/linux_amd64/boot boot.go boot_test.go pathingjar.go pathingjar_test.go

> Task :sdks:java:container:java8:copySdkHarnessLauncher
Execution optimizations have been disabled for task ':sdks:java:container:java8:copySdkHarnessLauncher' to ensure correctness due to the following reasons:
  - Gradle detected a problem with the following location: '<https://ci-beam.apache.org/job/beam_PostCommit_Java_PVR_Spark_Batch/ws/src/sdks/java/container/build/target'.> Reason: Task ':sdks:java:container:java8:copySdkHarnessLauncher' uses this output of task ':sdks:java:container:pullLicenses' without declaring an explicit or implicit dependency. This can lead to incorrect results being produced, depending on what order the tasks are executed. Please refer to https://docs.gradle.org/7.6.2/userguide/validation_problems.html#implicit_dependency for more details about this problem.

> Task :release:go-licenses:java:dockerRun
W0810 22:26:19.102343      38 library.go:101] "golang.org/x/sys/unix" contains non-Go code that can't be inspected for further dependencies:
/go/pkg/mod/golang.org/x/sys@v0.9.0/unix/asm_linux_amd64.s
+ go-licenses csv github.com/apache/beam/sdks/v2/java/container
+ tee /output/licenses/list.csv
W0810 22:26:26.647226      83 library.go:101] "golang.org/x/sys/unix" contains non-Go code that can't be inspected for further dependencies:
/go/pkg/mod/golang.org/x/sys@v0.9.0/unix/asm_linux_amd64.s
github.com/apache/beam/sdks/v2/go,https://github.com/apache/beam/blob/sdks/v2.49.0/sdks/go/README.md,Apache-2.0
github.com/apache/beam/sdks/v2/java/container,https://github.com/apache/beam/blob/sdks/v2.49.0/sdks/LICENSE,Apache-2.0
github.com/golang/protobuf,https://github.com/golang/protobuf/blob/v1.5.3/LICENSE,BSD-3-Clause
golang.org/x/net,https://cs.opensource.google/go/x/net/+/v0.11.0:LICENSE,BSD-3-Clause
golang.org/x/sys/unix,https://cs.opensource.google/go/x/sys/+/v0.9.0:LICENSE,BSD-3-Clause
golang.org/x/text,https://cs.opensource.google/go/x/text/+/v0.10.0:LICENSE,BSD-3-Clause
google.golang.org/genproto/googleapis/rpc/status,https://github.com/googleapis/go-genproto/blob/e85fd2cbaebc/googleapis/rpc/LICENSE,Apache-2.0
google.golang.org/grpc,https://github.com/grpc/grpc-go/blob/v1.56.1/LICENSE,Apache-2.0
google.golang.org/protobuf,https://github.com/protocolbuffers/protobuf-go/blob/v1.31.0/LICENSE,BSD-3-Clause
+ chmod -R a+w /output/licenses

> Task :release:go-licenses:java:createLicenses
> Task :sdks:java:container:java8:copyGolangLicenses
> Task :sdks:java:container:java8:dockerPrepare
> Task :runners:spark:3:job-server:validatesPortableRunnerBatch

> Task :sdks:java:container:java8:docker
#1 [internal] load build definition from Dockerfile
#1 transferring dockerfile: 2.58kB done
#1 DONE 0.0s

#2 [internal] load .dockerignore
#2 transferring context: 2B done
#2 DONE 0.0s

#3 [internal] load metadata for docker.io/library/eclipse-temurin:8
#3 DONE 0.5s

#4 [ 1/16] FROM docker.io/library/eclipse-temurin:8@sha256:9a8b8f1cdec4c50818b948cdd55cf45bc6bc39fa569004afe8c1b86986c200fe
#4 resolve docker.io/library/eclipse-temurin:8@sha256:9a8b8f1cdec4c50818b948cdd55cf45bc6bc39fa569004afe8c1b86986c200fe 0.0s done
#4 ...

#5 [internal] load build context
#5 transferring context: 47.13MB 0.8s done
#5 DONE 0.8s

#6 [ 2/16] ADD target/slf4j-api.jar /opt/apache/beam/jars/
#6 DONE 18.7s

#4 [ 1/16] FROM docker.io/library/eclipse-temurin:8@sha256:9a8b8f1cdec4c50818b948cdd55cf45bc6bc39fa569004afe8c1b86986c200fe
#4 ...

#7 [ 3/16] ADD target/slf4j-jdk14.jar /opt/apache/beam/jars/
#7 DONE 3.0s

#4 [ 1/16] FROM docker.io/library/eclipse-temurin:8@sha256:9a8b8f1cdec4c50818b948cdd55cf45bc6bc39fa569004afe8c1b86986c200fe
#4 ...

#8 [ 4/16] ADD target/jcl-over-slf4j.jar /opt/apache/beam/jars/
#8 DONE 1.8s

#4 [ 1/16] FROM docker.io/library/eclipse-temurin:8@sha256:9a8b8f1cdec4c50818b948cdd55cf45bc6bc39fa569004afe8c1b86986c200fe
#4 ...

#9 [ 5/16] ADD target/log4j-over-slf4j.jar /opt/apache/beam/jars/
#9 DONE 0.7s

#4 [ 1/16] FROM docker.io/library/eclipse-temurin:8@sha256:9a8b8f1cdec4c50818b948cdd55cf45bc6bc39fa569004afe8c1b86986c200fe
#4 ...

#10 [ 6/16] ADD target/log4j-to-slf4j.jar /opt/apache/beam/jars/
#10 DONE 0.1s

#11 [ 7/16] ADD target/beam-sdks-java-harness.jar /opt/apache/beam/jars/
#11 DONE 0.6s

#4 [ 1/16] FROM docker.io/library/eclipse-temurin:8@sha256:9a8b8f1cdec4c50818b948cdd55cf45bc6bc39fa569004afe8c1b86986c200fe
#4 ...

#12 [ 8/16] COPY target/jamm.jar target/open-module-agent*.jar /opt/apache/beam/jars/
#12 DONE 0.2s

#4 [ 1/16] FROM docker.io/library/eclipse-temurin:8@sha256:9a8b8f1cdec4c50818b948cdd55cf45bc6bc39fa569004afe8c1b86986c200fe
#4 ...

#13 [ 9/16] COPY target/linux_amd64/boot /opt/apache/beam/
#13 DONE 0.2s

#14 [10/16] COPY target/LICENSE /opt/apache/beam/
#14 DONE 0.1s

#4 [ 1/16] FROM docker.io/library/eclipse-temurin:8@sha256:9a8b8f1cdec4c50818b948cdd55cf45bc6bc39fa569004afe8c1b86986c200fe
#4 ...

#15 [11/16] COPY target/NOTICE /opt/apache/beam/
#15 DONE 0.1s

#16 [12/16] ADD target/third_party_licenses /opt/apache/beam/third_party_licenses/
#16 DONE 0.2s

#17 [13/16] COPY target/LICENSE target/options/* /opt/apache/beam/options/
#17 DONE 0.1s

#4 [ 1/16] FROM docker.io/library/eclipse-temurin:8@sha256:9a8b8f1cdec4c50818b948cdd55cf45bc6bc39fa569004afe8c1b86986c200fe
#4 ...

#18 [14/16] COPY target/go-licenses/* /opt/apache/beam/third_party_licenses/golang/
#18 DONE 0.1s

#19 [15/16] RUN if [ "true" = "false" ] ; then     rm -rf /opt/apache/beam/third_party_licenses ;    fi
#19 DONE 0.8s

#20 [16/16] COPY target/profiler/* /opt/google_cloud_profiler/
#20 DONE 0.1s

#21 exporting to image
#21 exporting layers
#21 exporting layers 0.3s done
#21 writing image sha256:80880a08b090013cff8a4fd3005899cc5079a55f0e6f6e7b55a65fbf751d6b4b done
#21 naming to docker.io/apache/beam_java8_sdk:2.51.0.dev done
#21 DONE 0.3s

#4 [ 1/16] FROM docker.io/library/eclipse-temurin:8@sha256:9a8b8f1cdec4c50818b948cdd55cf45bc6bc39fa569004afe8c1b86986c200fe

> Task :runners:spark:3:job-server:validatesPortableRunnerBatch

org.apache.beam.sdk.transforms.CombineTest$WindowingTests > testWindowedCombineGloballyAsSingletonView FAILED
    java.lang.RuntimeException at CombineTest.java:1402
[shutdown-hook-0] INFO org.apache.spark.util.ShutdownHookManager - Shutdown hook called
[shutdown-hook-0] INFO org.apache.spark.util.ShutdownHookManager - Deleting directory /tmp/spark-6babd8b8-dd5a-4c66-aed4-b4de707e6899
[shutdown-hook-0] INFO org.apache.spark.util.ShutdownHookManager - Shutdown hook called
[shutdown-hook-0] INFO org.apache.spark.util.ShutdownHookManager - Deleting directory /tmp/spark-075bd737-333f-4742-93bc-4c6fdb94ab28
[shutdown-hook-0] INFO org.apache.spark.util.ShutdownHookManager - Shutdown hook called
[shutdown-hook-0] INFO org.apache.spark.util.ShutdownHookManager - Deleting directory /tmp/spark-1c9e6645-bcbe-49c4-89b6-b8cc27ec6f63
[shutdown-hook-0] INFO org.apache.spark.util.ShutdownHookManager - Shutdown hook called
[shutdown-hook-0] INFO org.apache.spark.util.ShutdownHookManager - Deleting directory /tmp/spark-0a64ecba-e3ea-4d5c-92d7-81712b444478

234 tests completed, 1 failed, 1 skipped

> Task :runners:spark:3:job-server:validatesPortableRunnerBatch FAILED
> Task :runners:spark:3:job-server:validatesPortableRunnerDocker
[shutdown-hook-0] INFO org.apache.spark.util.ShutdownHookManager - Shutdown hook called
[shutdown-hook-0] INFO org.apache.spark.util.ShutdownHookManager - Deleting directory /tmp/spark-6258dc5e-6740-4dc9-84f5-7f0be2bc1671

FAILURE: Build failed with an exception.

* What went wrong:
Execution failed for task ':runners:spark:3:job-server:validatesPortableRunnerBatch'.
> There were failing tests. See the report at: file://<https://ci-beam.apache.org/job/beam_PostCommit_Java_PVR_Spark_Batch/ws/src/runners/spark/3/job-server/build/reports/tests/validatesPortableRunnerBatch/index.html>

* Try:
> Run with --stacktrace option to get the stack trace.
> Run with --info or --debug option to get more log output.

* Get more help at https://help.gradle.org

Deprecated Gradle features were used in this build, making it incompatible with Gradle 8.0.

You can use '--warning-mode all' to show the individual deprecation warnings and determine if they come from your own scripts or plugins.

See https://docs.gradle.org/7.6.2/userguide/command_line_interface.html#sec:command_line_warnings

Execution optimizations have been disabled for 1 invalid unit(s) of work during this build to ensure correctness.
Please consult deprecation warnings for more details.

BUILD FAILED in 1h 47m 28s
118 actionable tasks: 73 executed, 41 from cache, 4 up-to-date

Publishing build scan...
https://ge.apache.org/s/wdozj2gwwfvqg

Build step 'Invoke Gradle script' changed build result to FAILURE
Build step 'Invoke Gradle script' marked build as failure

---------------------------------------------------------------------
To unsubscribe, e-mail: builds-unsubscribe@beam.apache.org
For additional commands, e-mail: builds-help@beam.apache.org


Jenkins build is back to normal : beam_PostCommit_Java_PVR_Spark_Batch #2367

Posted by Apache Jenkins Server <je...@builds.apache.org>.
See <https://ci-beam.apache.org/job/beam_PostCommit_Java_PVR_Spark_Batch/2367/display/redirect>


---------------------------------------------------------------------
To unsubscribe, e-mail: builds-unsubscribe@beam.apache.org
For additional commands, e-mail: builds-help@beam.apache.org


Build failed in Jenkins: beam_PostCommit_Java_PVR_Spark_Batch #2366

Posted by Apache Jenkins Server <je...@builds.apache.org>.
See <https://ci-beam.apache.org/job/beam_PostCommit_Java_PVR_Spark_Batch/2366/display/redirect?page=changes>

Changes:

[noreply] Revert #27878 (#27968)


------------------------------------------
[...truncated 44.44 KB...]
#1 DONE 0.1s

#2 [internal] load .dockerignore
#2 transferring context:
#2 transferring context: 2B done
#2 DONE 0.1s

#3 [internal] load metadata for docker.io/library/golang:1.20-bullseye
#3 DONE 0.4s

#4 [1/5] FROM docker.io/library/golang:1.20-bullseye@sha256:74b09b3b6fa5aa542df8ef974cb745eb477be72f6fcf821517fb410aff532b00
#4 DONE 0.0s

#5 [internal] load build context
#5 transferring context: 1.96kB 0.1s done
#5 DONE 0.2s

#6 [2/5] WORKDIR /usr/src/app
#6 CACHED

#7 [3/5] COPY go.mod ./
#7 CACHED

#8 [4/5] RUN go install github.com/google/go-licenses@latest
#8 CACHED

#9 [5/5] COPY get-licenses.sh /opt/apache/beam/
#9 CACHED

#10 exporting to image
#10 exporting layers done
#10 writing image sha256:5859dab1c76a301ce3821d19434043c1ea1a5ba417d6b99e6b912f9fa850fb9d done
#10 naming to docker.io/library/golicenses-java done
#10 DONE 0.0s

> Task :sdks:java:container:pullLicenses
    Uninstalling pip-20.0.2:
      Successfully uninstalled pip-20.0.2
  Attempting uninstall: setuptools
    Found existing installation: setuptools 44.0.0
    Uninstalling setuptools-44.0.0:
      Successfully uninstalled setuptools-44.0.0
Successfully installed pip-23.2.1 setuptools-68.0.0 wheel-0.41.1
Collecting beautifulsoup4<5.0,>=4.9.0 (from -r <https://ci-beam.apache.org/job/beam_PostCommit_Java_PVR_Spark_Batch/ws/src/sdks/java/container/license_scripts/requirement.txt> (line 19))
  Using cached beautifulsoup4-4.12.2-py3-none-any.whl (142 kB)
Collecting pyyaml<7,>=6.0.1 (from -r <https://ci-beam.apache.org/job/beam_PostCommit_Java_PVR_Spark_Batch/ws/src/sdks/java/container/license_scripts/requirement.txt> (line 20))
  Obtaining dependency information for pyyaml<7,>=6.0.1 from https://files.pythonhosted.org/packages/c8/6b/6600ac24725c7388255b2f5add93f91e58a5d7efaf4af244fdbcc11a541b/PyYAML-6.0.1-cp38-cp38-manylinux_2_17_x86_64.manylinux2014_x86_64.whl.metadata
  Using cached PyYAML-6.0.1-cp38-cp38-manylinux_2_17_x86_64.manylinux2014_x86_64.whl.metadata (2.1 kB)
Collecting tenacity<9.0,>=6.1.0 (from -r <https://ci-beam.apache.org/job/beam_PostCommit_Java_PVR_Spark_Batch/ws/src/sdks/java/container/license_scripts/requirement.txt> (line 21))
  Using cached tenacity-8.2.2-py3-none-any.whl (24 kB)
Collecting soupsieve>1.2 (from beautifulsoup4<5.0,>=4.9.0->-r <https://ci-beam.apache.org/job/beam_PostCommit_Java_PVR_Spark_Batch/ws/src/sdks/java/container/license_scripts/requirement.txt> (line 19))
  Using cached soupsieve-2.4.1-py3-none-any.whl (36 kB)
Using cached PyYAML-6.0.1-cp38-cp38-manylinux_2_17_x86_64.manylinux2014_x86_64.whl (736 kB)
Installing collected packages: tenacity, soupsieve, pyyaml, beautifulsoup4
Successfully installed beautifulsoup4-4.12.2 pyyaml-6.0.1 soupsieve-2.4.1 tenacity-8.2.2
Executing python <https://ci-beam.apache.org/job/beam_PostCommit_Java_PVR_Spark_Batch/ws/src/sdks/java/container/license_scripts/pull_licenses_java.py> --license_index=<https://ci-beam.apache.org/job/beam_PostCommit_Java_PVR_Spark_Batch/ws/src/sdks/java/container/build/reports/dependency-license/index.json>        --output_dir=<https://ci-beam.apache.org/job/beam_PostCommit_Java_PVR_Spark_Batch/ws/src/sdks/java/container/build/target/java_third_party_licenses>        --dep_url_yaml=<https://ci-beam.apache.org/job/beam_PostCommit_Java_PVR_Spark_Batch/ws/src/sdks/java/container/license_scripts/dep_urls_java.yaml>        --manual_license_path=<https://ci-beam.apache.org/job/beam_PostCommit_Java_PVR_Spark_Batch/ws/src/sdks/java/container/license_scripts/manual_licenses>
INFO:root:Pulling license for 126 dependencies using 16 threads.
INFO:root:Replaced local file URL with file://<https://ci-beam.apache.org/job/beam_PostCommit_Java_PVR_Spark_Batch/ws/src/sdks/java/container/license_scripts/manual_licenses/xz/COPYING> for xz-1.5
INFO:root:pull_licenses_java.py succeed. It took 13.560346 seconds with 16 threads.
Copying licenses from <https://ci-beam.apache.org/job/beam_PostCommit_Java_PVR_Spark_Batch/ws/src/sdks/java/container/build/target/java_third_party_licenses> to <https://ci-beam.apache.org/job/beam_PostCommit_Java_PVR_Spark_Batch/ws/src/sdks/java/container/build/target/third_party_licenses.>
Finished license_scripts.sh

> Task :release:go-licenses:java:dockerRun
+ rm -rf '/output/*'
+ go get github.com/apache/beam/sdks/v2/java/container
go: downloading github.com/apache/beam/sdks/v2 v2.49.0
go: downloading github.com/apache/beam v2.49.0+incompatible
go: downloading github.com/golang/protobuf v1.5.3
go: downloading google.golang.org/grpc v1.56.1
go: downloading google.golang.org/protobuf v1.31.0
go: downloading golang.org/x/sys v0.9.0
go: downloading google.golang.org/genproto/googleapis/rpc v0.0.0-20230530153820-e85fd2cbaebc
go: downloading golang.org/x/net v0.11.0
go: downloading google.golang.org/genproto v0.0.0-20230530153820-e85fd2cbaebc
go: downloading golang.org/x/text v0.10.0
go: added github.com/apache/beam/sdks/v2 v2.49.0
go: added github.com/golang/protobuf v1.5.3
go: added golang.org/x/net v0.11.0
go: added golang.org/x/sys v0.9.0
go: added golang.org/x/text v0.10.0
go: added google.golang.org/genproto/googleapis/rpc v0.0.0-20230530153820-e85fd2cbaebc
go: added google.golang.org/grpc v1.56.1
go: added google.golang.org/protobuf v1.31.0
+ go-licenses save github.com/apache/beam/sdks/v2/java/container --save_path=/output/licenses
W0811 16:21:20.101980      36 library.go:101] "golang.org/x/sys/unix" contains non-Go code that can't be inspected for further dependencies:
/go/pkg/mod/golang.org/x/sys@v0.9.0/unix/asm_linux_amd64.s
+ go-licenses csv github.com/apache/beam/sdks/v2/java/container
+ tee /output/licenses/list.csv

> Task :sdks:java:container:java8:copyJavaThirdPartyLicenses

> Task :sdks:java:container:downloadCloudProfilerAgent
  % Total    % Received % Xferd  Average Speed   Time    Time     Time  Current
                                 Dload  Upload   Total   Spent    Left  Speed
  0     0    0     0    0     0      0      0 --:--:-- --:--:-- --:--:--     0version.txt
NOTICES
profiler_java_agent.so
100 4183k  100 4183k    0     0  14.0M      0 --:--:-- --:--:-- --:--:-- 14.0M

> Task :sdks:java:container:goPrepare UP-TO-DATE

> Task :release:go-licenses:java:dockerRun
W0811 16:21:27.099920      82 library.go:101] "golang.org/x/sys/unix" contains non-Go code that can't be inspected for further dependencies:
/go/pkg/mod/golang.org/x/sys@v0.9.0/unix/asm_linux_amd64.s

> Task :sdks:java:container:goBuild
/home/jenkins/go/bin/go1.21.0 build -o ./build/target/linux_amd64/boot boot.go boot_test.go pathingjar.go pathingjar_test.go

> Task :sdks:java:container:java8:copySdkHarnessLauncher
Execution optimizations have been disabled for task ':sdks:java:container:java8:copySdkHarnessLauncher' to ensure correctness due to the following reasons:
  - Gradle detected a problem with the following location: '<https://ci-beam.apache.org/job/beam_PostCommit_Java_PVR_Spark_Batch/ws/src/sdks/java/container/build/target'.> Reason: Task ':sdks:java:container:java8:copySdkHarnessLauncher' uses this output of task ':sdks:java:container:pullLicenses' without declaring an explicit or implicit dependency. This can lead to incorrect results being produced, depending on what order the tasks are executed. Please refer to https://docs.gradle.org/7.6.2/userguide/validation_problems.html#implicit_dependency for more details about this problem.

> Task :runners:spark:3:job-server:validatesPortableRunnerBatch

> Task :release:go-licenses:java:dockerRun
github.com/apache/beam/sdks/v2/go,https://github.com/apache/beam/blob/sdks/v2.49.0/sdks/go/README.md,Apache-2.0
github.com/apache/beam/sdks/v2/java/container,https://github.com/apache/beam/blob/sdks/v2.49.0/sdks/LICENSE,Apache-2.0
github.com/golang/protobuf,https://github.com/golang/protobuf/blob/v1.5.3/LICENSE,BSD-3-Clause
golang.org/x/net,https://cs.opensource.google/go/x/net/+/v0.11.0:LICENSE,BSD-3-Clause
golang.org/x/sys/unix,https://cs.opensource.google/go/x/sys/+/v0.9.0:LICENSE,BSD-3-Clause
golang.org/x/text,https://cs.opensource.google/go/x/text/+/v0.10.0:LICENSE,BSD-3-Clause
google.golang.org/genproto/googleapis/rpc/status,https://github.com/googleapis/go-genproto/blob/e85fd2cbaebc/googleapis/rpc/LICENSE,Apache-2.0
google.golang.org/grpc,https://github.com/grpc/grpc-go/blob/v1.56.1/LICENSE,Apache-2.0
google.golang.org/protobuf,https://github.com/protocolbuffers/protobuf-go/blob/v1.31.0/LICENSE,BSD-3-Clause
+ chmod -R a+w /output/licenses

> Task :release:go-licenses:java:createLicenses
> Task :sdks:java:container:java8:copyGolangLicenses
> Task :sdks:java:container:java8:dockerPrepare

> Task :sdks:java:container:java8:docker
#1 [internal] load build definition from Dockerfile
#1 transferring dockerfile: 2.58kB done
#1 DONE 0.0s

#2 [internal] load .dockerignore
#2 transferring context: 2B done
#2 DONE 0.0s

#3 [internal] load metadata for docker.io/library/eclipse-temurin:8
#3 DONE 0.3s

#4 [ 1/16] FROM docker.io/library/eclipse-temurin:8@sha256:9a8b8f1cdec4c50818b948cdd55cf45bc6bc39fa569004afe8c1b86986c200fe
#4 resolve docker.io/library/eclipse-temurin:8@sha256:9a8b8f1cdec4c50818b948cdd55cf45bc6bc39fa569004afe8c1b86986c200fe 0.0s done
#4 CACHED

#5 [internal] load build context
#5 transferring context: 47.13MB 0.4s done
#5 DONE 0.5s

#6 [ 2/16] ADD target/slf4j-api.jar /opt/apache/beam/jars/
#6 DONE 1.5s

#7 [ 3/16] ADD target/slf4j-jdk14.jar /opt/apache/beam/jars/
#7 DONE 0.1s

#8 [ 4/16] ADD target/jcl-over-slf4j.jar /opt/apache/beam/jars/
#8 DONE 0.1s

#9 [ 5/16] ADD target/log4j-over-slf4j.jar /opt/apache/beam/jars/
#9 DONE 0.1s

#10 [ 6/16] ADD target/log4j-to-slf4j.jar /opt/apache/beam/jars/
#10 DONE 0.1s

#11 [ 7/16] ADD target/beam-sdks-java-harness.jar /opt/apache/beam/jars/
#11 DONE 0.1s

#12 [ 8/16] COPY target/jamm.jar target/open-module-agent*.jar /opt/apache/beam/jars/
#12 DONE 0.1s

#13 [ 9/16] COPY target/linux_amd64/boot /opt/apache/beam/
#13 DONE 0.2s

#14 [10/16] COPY target/LICENSE /opt/apache/beam/
#14 DONE 0.1s

#15 [11/16] COPY target/NOTICE /opt/apache/beam/
#15 DONE 0.1s

#16 [12/16] ADD target/third_party_licenses /opt/apache/beam/third_party_licenses/
#16 DONE 0.3s

#17 [13/16] COPY target/LICENSE target/options/* /opt/apache/beam/options/
#17 DONE 0.1s

#18 [14/16] COPY target/go-licenses/* /opt/apache/beam/third_party_licenses/golang/
#18 DONE 0.1s

#19 [15/16] RUN if [ "true" = "false" ] ; then     rm -rf /opt/apache/beam/third_party_licenses ;    fi
#19 DONE 0.4s

#20 [16/16] COPY target/profiler/* /opt/google_cloud_profiler/
#20 DONE 0.1s

#21 exporting to image
#21 exporting layers
#21 exporting layers 0.3s done
#21 writing image sha256:b102b8aeaec966ad8f2179208cf739dde55749ea337654983d658f2e6ace44eb done
#21 naming to docker.io/apache/beam_java8_sdk:2.51.0.dev done
#21 DONE 0.3s

> Task :runners:spark:3:job-server:validatesPortableRunnerBatch

org.apache.beam.sdk.transforms.ParDoTest$MultipleInputsAndOutputTests > testParDoWithOnlyTaggedOutput FAILED
    java.lang.RuntimeException at ParDoTest.java:818
[shutdown-hook-0] INFO org.apache.spark.util.ShutdownHookManager - Shutdown hook called
[shutdown-hook-0] INFO org.apache.spark.util.ShutdownHookManager - Deleting directory /tmp/spark-8301743d-acb3-44e9-b45b-e073a638feb9
[shutdown-hook-0] INFO org.apache.spark.util.ShutdownHookManager - Shutdown hook called
[shutdown-hook-0] INFO org.apache.spark.util.ShutdownHookManager - Deleting directory /tmp/spark-f87bd6a3-9db5-4d23-a61d-bcb4cda11fd0
[shutdown-hook-0] INFO org.apache.spark.util.ShutdownHookManager - Shutdown hook called
[shutdown-hook-0] INFO org.apache.spark.util.ShutdownHookManager - Deleting directory /tmp/spark-599b0e5e-3e4d-4e80-a46e-387eb179b159
[shutdown-hook-0] INFO org.apache.spark.util.ShutdownHookManager - Shutdown hook called
[shutdown-hook-0] INFO org.apache.spark.util.ShutdownHookManager - Deleting directory /tmp/spark-0d258e9b-f668-4a62-8a2c-c4f34f1995dd

234 tests completed, 1 failed, 1 skipped

> Task :runners:spark:3:job-server:validatesPortableRunnerBatch FAILED
> Task :runners:spark:3:job-server:validatesPortableRunnerDocker FROM-CACHE

FAILURE: Build failed with an exception.

* What went wrong:
Execution failed for task ':runners:spark:3:job-server:validatesPortableRunnerBatch'.
> There were failing tests. See the report at: file://<https://ci-beam.apache.org/job/beam_PostCommit_Java_PVR_Spark_Batch/ws/src/runners/spark/3/job-server/build/reports/tests/validatesPortableRunnerBatch/index.html>

* Try:
> Run with --stacktrace option to get the stack trace.
> Run with --info or --debug option to get more log output.

* Get more help at https://help.gradle.org

Deprecated Gradle features were used in this build, making it incompatible with Gradle 8.0.

You can use '--warning-mode all' to show the individual deprecation warnings and determine if they come from your own scripts or plugins.

See https://docs.gradle.org/7.6.2/userguide/command_line_interface.html#sec:command_line_warnings

Execution optimizations have been disabled for 1 invalid unit(s) of work during this build to ensure correctness.
Please consult deprecation warnings for more details.

BUILD FAILED in 1h 51m 25s
118 actionable tasks: 72 executed, 42 from cache, 4 up-to-date

Publishing build scan...
https://ge.apache.org/s/76jkndoukkaxc

Build step 'Invoke Gradle script' changed build result to FAILURE
Build step 'Invoke Gradle script' marked build as failure

---------------------------------------------------------------------
To unsubscribe, e-mail: builds-unsubscribe@beam.apache.org
For additional commands, e-mail: builds-help@beam.apache.org


Build failed in Jenkins: beam_PostCommit_Java_PVR_Spark_Batch #2365

Posted by Apache Jenkins Server <je...@builds.apache.org>.
See <https://ci-beam.apache.org/job/beam_PostCommit_Java_PVR_Spark_Batch/2365/display/redirect>

Changes:


------------------------------------------
[...truncated 44.81 KB...]

#5 [internal] load build context
#5 transferring context: 1.96kB 0.0s done
#5 DONE 0.0s

#6 [2/5] WORKDIR /usr/src/app
#6 CACHED

#7 [3/5] COPY go.mod ./
#7 CACHED

#8 [4/5] RUN go install github.com/google/go-licenses@latest
#8 CACHED

#9 [5/5] COPY get-licenses.sh /opt/apache/beam/
#9 CACHED

#10 exporting to image
#10 exporting layers done
#10 writing image sha256:5859dab1c76a301ce3821d19434043c1ea1a5ba417d6b99e6b912f9fa850fb9d
#10 writing image sha256:5859dab1c76a301ce3821d19434043c1ea1a5ba417d6b99e6b912f9fa850fb9d done
#10 naming to docker.io/library/golicenses-java done
#10 DONE 0.0s

> Task :sdks:java:container:pullLicenses
Collecting wheel
  Using cached wheel-0.41.1-py3-none-any.whl (64 kB)
Installing collected packages: pip, setuptools, wheel
  Attempting uninstall: pip
    Found existing installation: pip 20.0.2
    Uninstalling pip-20.0.2:
      Successfully uninstalled pip-20.0.2
  Attempting uninstall: setuptools
    Found existing installation: setuptools 44.0.0
    Uninstalling setuptools-44.0.0:
      Successfully uninstalled setuptools-44.0.0
Successfully installed pip-23.2.1 setuptools-68.0.0 wheel-0.41.1
Collecting beautifulsoup4<5.0,>=4.9.0 (from -r <https://ci-beam.apache.org/job/beam_PostCommit_Java_PVR_Spark_Batch/ws/src/sdks/java/container/license_scripts/requirement.txt> (line 19))
  Using cached beautifulsoup4-4.12.2-py3-none-any.whl (142 kB)
Collecting pyyaml<7,>=6.0.1 (from -r <https://ci-beam.apache.org/job/beam_PostCommit_Java_PVR_Spark_Batch/ws/src/sdks/java/container/license_scripts/requirement.txt> (line 20))
  Obtaining dependency information for pyyaml<7,>=6.0.1 from https://files.pythonhosted.org/packages/c8/6b/6600ac24725c7388255b2f5add93f91e58a5d7efaf4af244fdbcc11a541b/PyYAML-6.0.1-cp38-cp38-manylinux_2_17_x86_64.manylinux2014_x86_64.whl.metadata
  Using cached PyYAML-6.0.1-cp38-cp38-manylinux_2_17_x86_64.manylinux2014_x86_64.whl.metadata (2.1 kB)
Collecting tenacity<9.0,>=6.1.0 (from -r <https://ci-beam.apache.org/job/beam_PostCommit_Java_PVR_Spark_Batch/ws/src/sdks/java/container/license_scripts/requirement.txt> (line 21))
  Using cached tenacity-8.2.2-py3-none-any.whl (24 kB)
Collecting soupsieve>1.2 (from beautifulsoup4<5.0,>=4.9.0->-r <https://ci-beam.apache.org/job/beam_PostCommit_Java_PVR_Spark_Batch/ws/src/sdks/java/container/license_scripts/requirement.txt> (line 19))
  Using cached soupsieve-2.4.1-py3-none-any.whl (36 kB)
Using cached PyYAML-6.0.1-cp38-cp38-manylinux_2_17_x86_64.manylinux2014_x86_64.whl (736 kB)
Installing collected packages: tenacity, soupsieve, pyyaml, beautifulsoup4
Successfully installed beautifulsoup4-4.12.2 pyyaml-6.0.1 soupsieve-2.4.1 tenacity-8.2.2
Executing python <https://ci-beam.apache.org/job/beam_PostCommit_Java_PVR_Spark_Batch/ws/src/sdks/java/container/license_scripts/pull_licenses_java.py> --license_index=<https://ci-beam.apache.org/job/beam_PostCommit_Java_PVR_Spark_Batch/ws/src/sdks/java/container/build/reports/dependency-license/index.json>        --output_dir=<https://ci-beam.apache.org/job/beam_PostCommit_Java_PVR_Spark_Batch/ws/src/sdks/java/container/build/target/java_third_party_licenses>        --dep_url_yaml=<https://ci-beam.apache.org/job/beam_PostCommit_Java_PVR_Spark_Batch/ws/src/sdks/java/container/license_scripts/dep_urls_java.yaml>        --manual_license_path=<https://ci-beam.apache.org/job/beam_PostCommit_Java_PVR_Spark_Batch/ws/src/sdks/java/container/license_scripts/manual_licenses>
INFO:root:Pulling license for 126 dependencies using 16 threads.
INFO:root:Replaced local file URL with file://<https://ci-beam.apache.org/job/beam_PostCommit_Java_PVR_Spark_Batch/ws/src/sdks/java/container/license_scripts/manual_licenses/xz/COPYING> for xz-1.5
INFO:root:pull_licenses_java.py succeed. It took 1.436857 seconds with 16 threads.
Copying licenses from <https://ci-beam.apache.org/job/beam_PostCommit_Java_PVR_Spark_Batch/ws/src/sdks/java/container/build/target/java_third_party_licenses> to <https://ci-beam.apache.org/job/beam_PostCommit_Java_PVR_Spark_Batch/ws/src/sdks/java/container/build/target/third_party_licenses.>
Finished license_scripts.sh

> Task :release:go-licenses:java:dockerRun
+ rm -rf '/output/*'
+ go get github.com/apache/beam/sdks/v2/java/container
go: downloading github.com/apache/beam/sdks/v2 v2.49.0
go: downloading github.com/apache/beam v2.49.0+incompatible

> Task :sdks:java:container:java8:copyJavaThirdPartyLicenses

> Task :sdks:java:container:downloadCloudProfilerAgent
  % Total    % Received % Xferd  Average Speed   Time    Time     Time  Current
                                 Dload  Upload   Total   Spent    Left  Speed
  0     0    0     0    0     0      0      0 --:--:-- --:--:-- --:--:--     0version.txt
NOTICES
profiler_java_agent.so
100 4183k  100 4183k    0     0  22.8M      0 --:--:-- --:--:-- --:--:-- 22.8M

> Task :sdks:java:container:goPrepare UP-TO-DATE

> Task :release:go-licenses:java:dockerRun
go: downloading google.golang.org/grpc v1.56.1
go: downloading github.com/golang/protobuf v1.5.3
go: downloading google.golang.org/protobuf v1.31.0
go: downloading golang.org/x/sys v0.9.0
go: downloading golang.org/x/net v0.11.0
go: downloading google.golang.org/genproto/googleapis/rpc v0.0.0-20230530153820-e85fd2cbaebc
go: downloading google.golang.org/genproto v0.0.0-20230530153820-e85fd2cbaebc

> Task :sdks:java:container:goBuild
/home/jenkins/go/bin/go1.21.0 build -o ./build/target/linux_amd64/boot boot.go boot_test.go pathingjar.go pathingjar_test.go

> Task :sdks:java:container:java8:copySdkHarnessLauncher
Execution optimizations have been disabled for task ':sdks:java:container:java8:copySdkHarnessLauncher' to ensure correctness due to the following reasons:
  - Gradle detected a problem with the following location: '<https://ci-beam.apache.org/job/beam_PostCommit_Java_PVR_Spark_Batch/ws/src/sdks/java/container/build/target'.> Reason: Task ':sdks:java:container:java8:copySdkHarnessLauncher' uses this output of task ':sdks:java:container:pullLicenses' without declaring an explicit or implicit dependency. This can lead to incorrect results being produced, depending on what order the tasks are executed. Please refer to https://docs.gradle.org/7.6.2/userguide/validation_problems.html#implicit_dependency for more details about this problem.

> Task :release:go-licenses:java:dockerRun
go: downloading golang.org/x/text v0.10.0
go: added github.com/apache/beam/sdks/v2 v2.49.0
go: added github.com/golang/protobuf v1.5.3
go: added golang.org/x/net v0.11.0
go: added golang.org/x/sys v0.9.0
go: added golang.org/x/text v0.10.0
go: added google.golang.org/genproto/googleapis/rpc v0.0.0-20230530153820-e85fd2cbaebc
go: added google.golang.org/grpc v1.56.1
go: added google.golang.org/protobuf v1.31.0
+ go-licenses save github.com/apache/beam/sdks/v2/java/container --save_path=/output/licenses
W0811 10:21:07.893776      37 library.go:101] "golang.org/x/sys/unix" contains non-Go code that can't be inspected for further dependencies:
/go/pkg/mod/golang.org/x/sys@v0.9.0/unix/asm_linux_amd64.s
+ go-licenses csv github.com/apache/beam/sdks/v2/java/container
+ tee /output/licenses/list.csv
W0811 10:21:15.029711      80 library.go:101] "golang.org/x/sys/unix" contains non-Go code that can't be inspected for further dependencies:
/go/pkg/mod/golang.org/x/sys@v0.9.0/unix/asm_linux_amd64.s
github.com/apache/beam/sdks/v2/go,https://github.com/apache/beam/blob/sdks/v2.49.0/sdks/go/README.md,Apache-2.0
github.com/apache/beam/sdks/v2/java/container,https://github.com/apache/beam/blob/sdks/v2.49.0/sdks/LICENSE,Apache-2.0
github.com/golang/protobuf,https://github.com/golang/protobuf/blob/v1.5.3/LICENSE,BSD-3-Clause
golang.org/x/net,https://cs.opensource.google/go/x/net/+/v0.11.0:LICENSE,BSD-3-Clause
golang.org/x/sys/unix,https://cs.opensource.google/go/x/sys/+/v0.9.0:LICENSE,BSD-3-Clause
golang.org/x/text,https://cs.opensource.google/go/x/text/+/v0.10.0:LICENSE,BSD-3-Clause
google.golang.org/genproto/googleapis/rpc/status,https://github.com/googleapis/go-genproto/blob/e85fd2cbaebc/googleapis/rpc/LICENSE,Apache-2.0
google.golang.org/grpc,https://github.com/grpc/grpc-go/blob/v1.56.1/LICENSE,Apache-2.0
google.golang.org/protobuf,https://github.com/protocolbuffers/protobuf-go/blob/v1.31.0/LICENSE,BSD-3-Clause
+ chmod -R a+w /output/licenses

> Task :runners:spark:3:job-server:validatesPortableRunnerBatch
> Task :release:go-licenses:java:createLicenses
> Task :sdks:java:container:java8:copyGolangLicenses
> Task :sdks:java:container:java8:dockerPrepare

> Task :sdks:java:container:java8:docker
#1 [internal] load build definition from Dockerfile
#1 transferring dockerfile: 2.58kB done
#1 DONE 0.0s

#2 [internal] load .dockerignore
#2 transferring context: 2B done
#2 DONE 0.0s

#3 [internal] load metadata for docker.io/library/eclipse-temurin:8
#3 DONE 0.4s

#4 [ 1/16] FROM docker.io/library/eclipse-temurin:8@sha256:9a8b8f1cdec4c50818b948cdd55cf45bc6bc39fa569004afe8c1b86986c200fe
#4 resolve docker.io/library/eclipse-temurin:8@sha256:9a8b8f1cdec4c50818b948cdd55cf45bc6bc39fa569004afe8c1b86986c200fe 0.0s done
#4 CACHED

#5 [internal] load build context
#5 transferring context: 47.13MB 0.4s done
#5 DONE 0.4s

#6 [ 2/16] ADD target/slf4j-api.jar /opt/apache/beam/jars/
#6 DONE 1.1s

#7 [ 3/16] ADD target/slf4j-jdk14.jar /opt/apache/beam/jars/
#7 DONE 0.1s

#8 [ 4/16] ADD target/jcl-over-slf4j.jar /opt/apache/beam/jars/
#8 DONE 0.1s

#9 [ 5/16] ADD target/log4j-over-slf4j.jar /opt/apache/beam/jars/
#9 DONE 0.1s

#10 [ 6/16] ADD target/log4j-to-slf4j.jar /opt/apache/beam/jars/
#10 DONE 0.1s

#11 [ 7/16] ADD target/beam-sdks-java-harness.jar /opt/apache/beam/jars/
#11 DONE 0.1s

#12 [ 8/16] COPY target/jamm.jar target/open-module-agent*.jar /opt/apache/beam/jars/
#12 DONE 0.1s

#13 [ 9/16] COPY target/linux_amd64/boot /opt/apache/beam/
#13 DONE 0.2s

#14 [10/16] COPY target/LICENSE /opt/apache/beam/
#14 DONE 0.1s

#15 [11/16] COPY target/NOTICE /opt/apache/beam/
#15 DONE 0.1s

#16 [12/16] ADD target/third_party_licenses /opt/apache/beam/third_party_licenses/
#16 DONE 0.2s

#17 [13/16] COPY target/LICENSE target/options/* /opt/apache/beam/options/
#17 DONE 0.1s

#18 [14/16] COPY target/go-licenses/* /opt/apache/beam/third_party_licenses/golang/
#18 DONE 0.1s

#19 [15/16] RUN if [ "true" = "false" ] ; then     rm -rf /opt/apache/beam/third_party_licenses ;    fi
#19 DONE 0.6s

#20 [16/16] COPY target/profiler/* /opt/google_cloud_profiler/
#20 DONE 0.1s

#21 exporting to image
#21 exporting layers
#21 exporting layers 0.3s done
#21 writing image sha256:0c290d3c2ab0fad64094899886a5cdca471de3e8c1e2c2bdd067fd73a0314825 done
#21 naming to docker.io/apache/beam_java8_sdk:2.51.0.dev done
#21 DONE 0.3s

> Task :runners:spark:3:job-server:validatesPortableRunnerBatch

org.apache.beam.sdk.transforms.CombineTest$WindowingTests > testCombineGloballyAsSingletonView FAILED
    java.lang.RuntimeException at CombineTest.java:1359

org.apache.beam.sdk.transforms.CombineTest$WindowingTests > testSlidingWindowsCombine FAILED
    java.lang.RuntimeException at CombineTest.java:1164

org.apache.beam.sdk.transforms.CombineTest$WindowingTests > testWindowedCombineGloballyAsSingletonView FAILED
    java.lang.RuntimeException at CombineTest.java:1402
[shutdown-hook-0] INFO org.apache.spark.util.ShutdownHookManager - Shutdown hook called
[shutdown-hook-0] INFO org.apache.spark.util.ShutdownHookManager - Deleting directory /tmp/spark-ae842289-358a-48bb-9590-27b623a43f49
[shutdown-hook-0] INFO org.apache.spark.util.ShutdownHookManager - Shutdown hook called
[shutdown-hook-0] INFO org.apache.spark.util.ShutdownHookManager - Deleting directory /tmp/spark-3de5c252-d733-4ad0-be27-25890e588b98
[shutdown-hook-0] INFO org.apache.spark.util.ShutdownHookManager - Shutdown hook called
[shutdown-hook-0] INFO org.apache.spark.util.ShutdownHookManager - Deleting directory /tmp/spark-925a99f0-16df-402e-ace7-6c9aafdae0e6
[shutdown-hook-0] INFO org.apache.spark.util.ShutdownHookManager - Shutdown hook called
[shutdown-hook-0] INFO org.apache.spark.util.ShutdownHookManager - Deleting directory /tmp/spark-435fa727-2eb0-420e-91c4-099ed7040649

234 tests completed, 3 failed, 1 skipped

> Task :runners:spark:3:job-server:validatesPortableRunnerBatch FAILED
> Task :runners:spark:3:job-server:validatesPortableRunnerDocker
> Task :runners:spark:3:job-server:validatesPortableRunnerDocker FROM-CACHE

FAILURE: Build failed with an exception.

* What went wrong:
Execution failed for task ':runners:spark:3:job-server:validatesPortableRunnerBatch'.
> There were failing tests. See the report at: file://<https://ci-beam.apache.org/job/beam_PostCommit_Java_PVR_Spark_Batch/ws/src/runners/spark/3/job-server/build/reports/tests/validatesPortableRunnerBatch/index.html>

* Try:
> Run with --stacktrace option to get the stack trace.
> Run with --info or --debug option to get more log output.

* Get more help at https://help.gradle.org

Deprecated Gradle features were used in this build, making it incompatible with Gradle 8.0.

You can use '--warning-mode all' to show the individual deprecation warnings and determine if they come from your own scripts or plugins.

See https://docs.gradle.org/7.6.2/userguide/command_line_interface.html#sec:command_line_warnings

Execution optimizations have been disabled for 1 invalid unit(s) of work during this build to ensure correctness.
Please consult deprecation warnings for more details.

BUILD FAILED in 1h 43m 33s
118 actionable tasks: 72 executed, 42 from cache, 4 up-to-date

Publishing build scan...
https://ge.apache.org/s/wosj5jimsioe2

Build step 'Invoke Gradle script' changed build result to FAILURE
Build step 'Invoke Gradle script' marked build as failure

---------------------------------------------------------------------
To unsubscribe, e-mail: builds-unsubscribe@beam.apache.org
For additional commands, e-mail: builds-help@beam.apache.org


Build failed in Jenkins: beam_PostCommit_Java_PVR_Spark_Batch #2364

Posted by Apache Jenkins Server <je...@builds.apache.org>.
See <https://ci-beam.apache.org/job/beam_PostCommit_Java_PVR_Spark_Batch/2364/display/redirect>

Changes:


------------------------------------------
[...truncated 44.43 KB...]
#4 [1/5] FROM docker.io/library/golang:1.20-bullseye@sha256:74b09b3b6fa5aa542df8ef974cb745eb477be72f6fcf821517fb410aff532b00
#4 DONE 0.0s

#5 [internal] load build context
#5 transferring context: 1.96kB 0.0s done
#5 DONE 0.0s

#6 [2/5] WORKDIR /usr/src/app
#6 CACHED

#7 [3/5] COPY go.mod ./
#7 CACHED

#8 [4/5] RUN go install github.com/google/go-licenses@latest
#8 CACHED

#9 [5/5] COPY get-licenses.sh /opt/apache/beam/
#9 CACHED

#10 exporting to image
#10 exporting layers done
#10 writing image sha256:59e75f9349aba2e840542ad88b534c48ee3f33ad092f62bb866f972862606c77
#10 writing image sha256:59e75f9349aba2e840542ad88b534c48ee3f33ad092f62bb866f972862606c77 done
#10 naming to docker.io/library/golicenses-java done
#10 DONE 0.0s

> Task :sdks:java:container:pullLicenses
Collecting setuptools
  Using cached setuptools-68.0.0-py3-none-any.whl (804 kB)
Collecting wheel
  Using cached wheel-0.41.1-py3-none-any.whl (64 kB)
Installing collected packages: pip, setuptools, wheel
  Attempting uninstall: pip
    Found existing installation: pip 20.0.2
    Uninstalling pip-20.0.2:
      Successfully uninstalled pip-20.0.2
  Attempting uninstall: setuptools
    Found existing installation: setuptools 44.0.0
    Uninstalling setuptools-44.0.0:
      Successfully uninstalled setuptools-44.0.0
Successfully installed pip-23.2.1 setuptools-68.0.0 wheel-0.41.1
Collecting beautifulsoup4<5.0,>=4.9.0 (from -r <https://ci-beam.apache.org/job/beam_PostCommit_Java_PVR_Spark_Batch/ws/src/sdks/java/container/license_scripts/requirement.txt> (line 19))
  Using cached beautifulsoup4-4.12.2-py3-none-any.whl (142 kB)
Collecting pyyaml<7,>=6.0.1 (from -r <https://ci-beam.apache.org/job/beam_PostCommit_Java_PVR_Spark_Batch/ws/src/sdks/java/container/license_scripts/requirement.txt> (line 20))
  Obtaining dependency information for pyyaml<7,>=6.0.1 from https://files.pythonhosted.org/packages/c8/6b/6600ac24725c7388255b2f5add93f91e58a5d7efaf4af244fdbcc11a541b/PyYAML-6.0.1-cp38-cp38-manylinux_2_17_x86_64.manylinux2014_x86_64.whl.metadata
  Using cached PyYAML-6.0.1-cp38-cp38-manylinux_2_17_x86_64.manylinux2014_x86_64.whl.metadata (2.1 kB)
Collecting tenacity<9.0,>=6.1.0 (from -r <https://ci-beam.apache.org/job/beam_PostCommit_Java_PVR_Spark_Batch/ws/src/sdks/java/container/license_scripts/requirement.txt> (line 21))
  Using cached tenacity-8.2.2-py3-none-any.whl (24 kB)
Collecting soupsieve>1.2 (from beautifulsoup4<5.0,>=4.9.0->-r <https://ci-beam.apache.org/job/beam_PostCommit_Java_PVR_Spark_Batch/ws/src/sdks/java/container/license_scripts/requirement.txt> (line 19))
  Using cached soupsieve-2.4.1-py3-none-any.whl (36 kB)
Using cached PyYAML-6.0.1-cp38-cp38-manylinux_2_17_x86_64.manylinux2014_x86_64.whl (736 kB)
Installing collected packages: tenacity, soupsieve, pyyaml, beautifulsoup4
Successfully installed beautifulsoup4-4.12.2 pyyaml-6.0.1 soupsieve-2.4.1 tenacity-8.2.2
Executing python <https://ci-beam.apache.org/job/beam_PostCommit_Java_PVR_Spark_Batch/ws/src/sdks/java/container/license_scripts/pull_licenses_java.py> --license_index=<https://ci-beam.apache.org/job/beam_PostCommit_Java_PVR_Spark_Batch/ws/src/sdks/java/container/build/reports/dependency-license/index.json>        --output_dir=<https://ci-beam.apache.org/job/beam_PostCommit_Java_PVR_Spark_Batch/ws/src/sdks/java/container/build/target/java_third_party_licenses>        --dep_url_yaml=<https://ci-beam.apache.org/job/beam_PostCommit_Java_PVR_Spark_Batch/ws/src/sdks/java/container/license_scripts/dep_urls_java.yaml>        --manual_license_path=<https://ci-beam.apache.org/job/beam_PostCommit_Java_PVR_Spark_Batch/ws/src/sdks/java/container/license_scripts/manual_licenses>
INFO:root:Pulling license for 126 dependencies using 16 threads.
INFO:root:Replaced local file URL with file://<https://ci-beam.apache.org/job/beam_PostCommit_Java_PVR_Spark_Batch/ws/src/sdks/java/container/license_scripts/manual_licenses/xz/COPYING> for xz-1.5
INFO:root:pull_licenses_java.py succeed. It took 1.415393 seconds with 16 threads.
Copying licenses from <https://ci-beam.apache.org/job/beam_PostCommit_Java_PVR_Spark_Batch/ws/src/sdks/java/container/build/target/java_third_party_licenses> to <https://ci-beam.apache.org/job/beam_PostCommit_Java_PVR_Spark_Batch/ws/src/sdks/java/container/build/target/third_party_licenses.>
Finished license_scripts.sh

> Task :release:go-licenses:java:dockerRun
+ rm -rf '/output/*'
+ go get github.com/apache/beam/sdks/v2/java/container
go: downloading github.com/apache/beam/sdks/v2 v2.49.0
go: downloading github.com/apache/beam v2.49.0+incompatible

> Task :sdks:java:container:java8:copyJavaThirdPartyLicenses

> Task :sdks:java:container:downloadCloudProfilerAgent
  % Total    % Received % Xferd  Average Speed   Time    Time     Time  Current
                                 Dload  Upload   Total   Spent    Left  Speed
  0     0    0     0    0     0      0      0 --:--:-- --:--:-- --:--:--     0version.txt
NOTICES
profiler_java_agent.so
100 4183k  100 4183k    0     0  23.8M      0 --:--:-- --:--:-- --:--:-- 23.8M

> Task :sdks:java:container:goPrepare UP-TO-DATE

> Task :release:go-licenses:java:dockerRun
go: downloading google.golang.org/grpc v1.56.1
go: downloading github.com/golang/protobuf v1.5.3
go: downloading google.golang.org/protobuf v1.31.0
go: downloading golang.org/x/sys v0.9.0
go: downloading golang.org/x/net v0.11.0
go: downloading google.golang.org/genproto/googleapis/rpc v0.0.0-20230530153820-e85fd2cbaebc
go: downloading google.golang.org/genproto v0.0.0-20230530153820-e85fd2cbaebc
go: downloading golang.org/x/text v0.10.0

> Task :sdks:java:container:goBuild
/home/jenkins/go/bin/go1.21.0 build -o ./build/target/linux_amd64/boot boot.go boot_test.go pathingjar.go pathingjar_test.go

> Task :sdks:java:container:java8:copySdkHarnessLauncher
Execution optimizations have been disabled for task ':sdks:java:container:java8:copySdkHarnessLauncher' to ensure correctness due to the following reasons:
  - Gradle detected a problem with the following location: '<https://ci-beam.apache.org/job/beam_PostCommit_Java_PVR_Spark_Batch/ws/src/sdks/java/container/build/target'.> Reason: Task ':sdks:java:container:java8:copySdkHarnessLauncher' uses this output of task ':sdks:java:container:pullLicenses' without declaring an explicit or implicit dependency. This can lead to incorrect results being produced, depending on what order the tasks are executed. Please refer to https://docs.gradle.org/7.6.2/userguide/validation_problems.html#implicit_dependency for more details about this problem.

> Task :release:go-licenses:java:dockerRun
go: added github.com/apache/beam/sdks/v2 v2.49.0
go: added github.com/golang/protobuf v1.5.3
go: added golang.org/x/net v0.11.0
go: added golang.org/x/sys v0.9.0
go: added golang.org/x/text v0.10.0
go: added google.golang.org/genproto/googleapis/rpc v0.0.0-20230530153820-e85fd2cbaebc
go: added google.golang.org/grpc v1.56.1
go: added google.golang.org/protobuf v1.31.0
+ go-licenses save github.com/apache/beam/sdks/v2/java/container --save_path=/output/licenses
W0811 04:21:10.289584      40 library.go:101] "golang.org/x/sys/unix" contains non-Go code that can't be inspected for further dependencies:
/go/pkg/mod/golang.org/x/sys@v0.9.0/unix/asm_linux_amd64.s
+ go-licenses csv github.com/apache/beam/sdks/v2/java/container
+ tee /output/licenses/list.csv
W0811 04:21:17.187176      86 library.go:101] "golang.org/x/sys/unix" contains non-Go code that can't be inspected for further dependencies:
/go/pkg/mod/golang.org/x/sys@v0.9.0/unix/asm_linux_amd64.s
github.com/apache/beam/sdks/v2/go,https://github.com/apache/beam/blob/sdks/v2.49.0/sdks/go/README.md,Apache-2.0
github.com/apache/beam/sdks/v2/java/container,https://github.com/apache/beam/blob/sdks/v2.49.0/sdks/LICENSE,Apache-2.0
github.com/golang/protobuf,https://github.com/golang/protobuf/blob/v1.5.3/LICENSE,BSD-3-Clause
golang.org/x/net,https://cs.opensource.google/go/x/net/+/v0.11.0:LICENSE,BSD-3-Clause
golang.org/x/sys/unix,https://cs.opensource.google/go/x/sys/+/v0.9.0:LICENSE,BSD-3-Clause
golang.org/x/text,https://cs.opensource.google/go/x/text/+/v0.10.0:LICENSE,BSD-3-Clause
google.golang.org/genproto/googleapis/rpc/status,https://github.com/googleapis/go-genproto/blob/e85fd2cbaebc/googleapis/rpc/LICENSE,Apache-2.0
google.golang.org/grpc,https://github.com/grpc/grpc-go/blob/v1.56.1/LICENSE,Apache-2.0
google.golang.org/protobuf,https://github.com/protocolbuffers/protobuf-go/blob/v1.31.0/LICENSE,BSD-3-Clause
+ chmod -R a+w /output/licenses

> Task :runners:spark:3:job-server:validatesPortableRunnerBatch
> Task :release:go-licenses:java:createLicenses
> Task :sdks:java:container:java8:copyGolangLicenses
> Task :sdks:java:container:java8:dockerPrepare

> Task :sdks:java:container:java8:docker
#1 [internal] load build definition from Dockerfile
#1 transferring dockerfile: 2.58kB done
#1 DONE 0.0s

#2 [internal] load .dockerignore
#2 transferring context: 2B done
#2 DONE 0.0s

#3 [internal] load metadata for docker.io/library/eclipse-temurin:8
#3 DONE 0.4s

#4 [ 1/16] FROM docker.io/library/eclipse-temurin:8@sha256:9a8b8f1cdec4c50818b948cdd55cf45bc6bc39fa569004afe8c1b86986c200fe
#4 resolve docker.io/library/eclipse-temurin:8@sha256:9a8b8f1cdec4c50818b948cdd55cf45bc6bc39fa569004afe8c1b86986c200fe 0.0s done
#4 CACHED

#5 [internal] load build context
#5 transferring context: 47.13MB 0.7s done
#5 DONE 0.8s

#6 [ 2/16] ADD target/slf4j-api.jar /opt/apache/beam/jars/
#6 DONE 17.1s

#7 [ 3/16] ADD target/slf4j-jdk14.jar /opt/apache/beam/jars/
#7 DONE 2.1s

#8 [ 4/16] ADD target/jcl-over-slf4j.jar /opt/apache/beam/jars/
#8 DONE 3.4s

#9 [ 5/16] ADD target/log4j-over-slf4j.jar /opt/apache/beam/jars/
#9 DONE 3.2s

#10 [ 6/16] ADD target/log4j-to-slf4j.jar /opt/apache/beam/jars/
#10 DONE 0.9s

#11 [ 7/16] ADD target/beam-sdks-java-harness.jar /opt/apache/beam/jars/
#11 DONE 0.1s

#12 [ 8/16] COPY target/jamm.jar target/open-module-agent*.jar /opt/apache/beam/jars/
#12 DONE 0.1s

#13 [ 9/16] COPY target/linux_amd64/boot /opt/apache/beam/
#13 DONE 0.2s

#14 [10/16] COPY target/LICENSE /opt/apache/beam/
#14 DONE 0.1s

#15 [11/16] COPY target/NOTICE /opt/apache/beam/
#15 DONE 0.1s

#16 [12/16] ADD target/third_party_licenses /opt/apache/beam/third_party_licenses/
#16 DONE 0.2s

#17 [13/16] COPY target/LICENSE target/options/* /opt/apache/beam/options/
#17 DONE 0.1s

#18 [14/16] COPY target/go-licenses/* /opt/apache/beam/third_party_licenses/golang/
#18 DONE 0.1s

#19 [15/16] RUN if [ "true" = "false" ] ; then     rm -rf /opt/apache/beam/third_party_licenses ;    fi
#19 DONE 0.8s

#20 [16/16] COPY target/profiler/* /opt/google_cloud_profiler/
#20 DONE 0.1s

#21 exporting to image
#21 exporting layers
#21 exporting layers 0.3s done
#21 writing image sha256:aacfefe9286e55d4388a4b5b34be78dcaa766433d58eda4f9219d8c2f91bf87a done
#21 naming to docker.io/apache/beam_java8_sdk:2.51.0.dev done
#21 DONE 0.3s

> Task :runners:spark:3:job-server:validatesPortableRunnerBatch

org.apache.beam.sdk.transforms.CombineTest$WindowingTests > testSlidingWindowsCombine FAILED
    java.lang.RuntimeException at CombineTest.java:1164

org.apache.beam.sdk.transforms.ParDoTest$BasicTests > testPipelineOptionsParameter FAILED
    java.lang.RuntimeException at ParDoTest.java:646
[shutdown-hook-0] INFO org.apache.spark.util.ShutdownHookManager - Shutdown hook called
[shutdown-hook-0] INFO org.apache.spark.util.ShutdownHookManager - Deleting directory /tmp/spark-b3f4bb5b-e790-4f00-9a74-03a728e03699
[shutdown-hook-0] INFO org.apache.spark.util.ShutdownHookManager - Shutdown hook called
[shutdown-hook-0] INFO org.apache.spark.util.ShutdownHookManager - Deleting directory /tmp/spark-aca606dd-2ad1-4bca-bc50-5ef9c22d628a
[shutdown-hook-0] INFO org.apache.spark.util.ShutdownHookManager - Shutdown hook called
[shutdown-hook-0] INFO org.apache.spark.util.ShutdownHookManager - Deleting directory /tmp/spark-4adc600a-2938-4514-9311-ac791595464b
[shutdown-hook-0] INFO org.apache.spark.util.ShutdownHookManager - Shutdown hook called
[shutdown-hook-0] INFO org.apache.spark.util.ShutdownHookManager - Deleting directory /tmp/spark-1db9c8ea-74e8-409e-be34-196c1748a1eb

234 tests completed, 2 failed, 1 skipped

> Task :runners:spark:3:job-server:validatesPortableRunnerBatch FAILED
> Task :runners:spark:3:job-server:validatesPortableRunnerDocker FROM-CACHE

FAILURE: Build failed with an exception.

* What went wrong:
Execution failed for task ':runners:spark:3:job-server:validatesPortableRunnerBatch'.
> There were failing tests. See the report at: file://<https://ci-beam.apache.org/job/beam_PostCommit_Java_PVR_Spark_Batch/ws/src/runners/spark/3/job-server/build/reports/tests/validatesPortableRunnerBatch/index.html>

* Try:
> Run with --stacktrace option to get the stack trace.
> Run with --info or --debug option to get more log output.

* Get more help at https://help.gradle.org

Deprecated Gradle features were used in this build, making it incompatible with Gradle 8.0.

You can use '--warning-mode all' to show the individual deprecation warnings and determine if they come from your own scripts or plugins.

See https://docs.gradle.org/7.6.2/userguide/command_line_interface.html#sec:command_line_warnings

Execution optimizations have been disabled for 1 invalid unit(s) of work during this build to ensure correctness.
Please consult deprecation warnings for more details.

BUILD FAILED in 1h 40m 9s
118 actionable tasks: 72 executed, 42 from cache, 4 up-to-date

Publishing build scan...
https://ge.apache.org/s/tndrexdzjkd6s

Build step 'Invoke Gradle script' changed build result to FAILURE
Build step 'Invoke Gradle script' marked build as failure

---------------------------------------------------------------------
To unsubscribe, e-mail: builds-unsubscribe@beam.apache.org
For additional commands, e-mail: builds-help@beam.apache.org