You are viewing a plain text version of this content. The canonical link for it is here.
Posted to commits@flex.apache.org by fl...@gmail.com on 2013/09/17 16:47:17 UTC

Build failed in Jenkins: flex-sdk_mustella #311

See <http://localhost:8080/job/flex-sdk_mustella/311/changes>

Changes:

[jmclean] Update release notes

[jmclean] FLEX-33728 added access to imageDecodingPolicy

[jmclean] FLEX-33728 fixed so compiles and all supported version of flash and chache first answer

[jmclean] FLEX-33722 stop RTE when dragging a spark datagrid column

------------------------------------------
[...truncated 85871 lines...]
shells:
     [exec] next: pre_compile.sh 0
     [exec] next: pre_compile.sh 1
     [exec] next: pre_compile.sh 2
     [exec] done with pre compile step
     [java] exclude_filename: C:/jenkins_slave/workspace/flex-sdk_mustella/mustella/tests/ExcludeListWin.txt
     [java] os_version: ${os_version}
     [java] target_os_name: windows
     [java] device_name: ${device_name}
     [java] result_include: -includes=SendResultsToRunner
     [java] Choosing local runner bitmap save
     [java] Choosing local runner bitmap save
     [java] Choosing local runner bitmap save
     [java] Choosing local runner bitmap save
     [java] okey doke, going to compile C:\jenkins_slave\workspace\flex-sdk_mustella\mustella\tests\Managers\StyleManager\SparkStyles\SWFs\SparkStyles_Globals_mxml.mxml
     [java] okey doke, going to compile C:\jenkins_slave\workspace\flex-sdk_mustella\mustella\tests\itemRenderers\Halo\List\SWFs\List_itemRendererTests.mxml
     [java] okey doke, going to compile C:\jenkins_slave\workspace\flex-sdk_mustella\mustella\tests\containers\Accordion\SWFs\Accordion_InContainer_Spark.mxml
     [java] okey doke, going to compile C:\jenkins_slave\workspace\flex-sdk_mustella\mustella\tests\resources\ResourceManager\SWFs\ResourceManagerApp.mxml
     [java] Loading configuration file C:\jenkins_slave\workspace\flex-sdk_mustella\frameworks\flex-config.xml
     [java] Loading configuration file C:\jenkins_slave\workspace\flex-sdk_mustella\frameworks\flex-config.xml
     [java] Loading configuration file C:\jenkins_slave\workspace\flex-sdk_mustella\frameworks\flex-config.xml
     [java] Loading configuration file C:\jenkins_slave\workspace\flex-sdk_mustella\frameworks\flex-config.xml
     [java] C:\jenkins_slave\workspace\flex-sdk_mustella\mustella\tests\resources\ResourceManager\SWFs\ResourceManagerApp.swf (737934 bytes)
     [java] Choosing local runner bitmap save
     [java] okey doke, going to compile C:\jenkins_slave\workspace\flex-sdk_mustella\mustella\tests\gumbo\components\Application\SWFs\Application_Properties_App1.mxml
     [java] Loading configuration file C:\jenkins_slave\workspace\flex-sdk_mustella\frameworks\flex-config.xml
     [java] C:\jenkins_slave\workspace\flex-sdk_mustella\mustella\tests\itemRenderers\Halo\List\SWFs\List_itemRendererTests.swf (1185630 bytes)
     [java] nothing left to do
     [java] C:\jenkins_slave\workspace\flex-sdk_mustella\mustella\tests\containers\Accordion\SWFs\Accordion_InContainer_Spark.swf (1449154 bytes)
     [java] C:\jenkins_slave\workspace\flex-sdk_mustella\mustella\tests\Managers\StyleManager\SparkStyles\SWFs\SparkStyles_Globals_mxml.mxml(80): Warning: The CSS type selector 'spark.components.TextArea' was not processed, because the type was not used in the application.
     [java] 
     [java]         s|TextArea, s|Panel {
     [java] 
     [java] C:\jenkins_slave\workspace\flex-sdk_mustella\mustella\tests\Managers\StyleManager\SparkStyles\SWFs\SparkStyles_Globals_mxml.swf (2205119 bytes)
     [java] All done with the compile
     [java] leaving the compile, elapsed: 18
     [java] ...via exit
     [echo] compileswfs jreturn is 0
 [loadfile] C:\jenkins_slave\workspace\flex-sdk_mustella\mustella\local.properties doesn't exist

do_fail:

compileswfs:

getExcludes:

getExcludeIds:

populateExcludeTable:
     [echo] populate exclude, got this for db time: 2013/09/17 09:45:56

justrun:
 [loadfile] C:\jenkins_slave\workspace\flex-sdk_mustella\mustella\local.properties doesn't exist

delete_cache:
     [echo] delete cache: /Users/ApacheFlex/Library/Caches/Adobe/Flash Player/AssetCache
 [loadfile] C:\jenkins_slave\workspace\flex-sdk_mustella\mustella\local.properties doesn't exist

delete_cache:
     [echo] delete cache: /Users/ApacheFlex/AppData/Roaming/Adobe/Flash Player/AssetCache
   [delete] Deleting directory C:\Users\ApacheFlex\AppData\Roaming\Adobe\Flash Player\AssetCache\94ELK3V4
   [delete] Deleting directory C:\Users\ApacheFlex\AppData\Roaming\Adobe\Flash Player\AssetCache
 [loadfile] C:\jenkins_slave\workspace\flex-sdk_mustella\mustella\local.properties doesn't exist

delete_cache:
     [echo] delete cache: C:\Users\ApacheFlex/Application Data/Adobe/Flash Player/AssetCache
 [loadfile] C:\jenkins_slave\workspace\flex-sdk_mustella\mustella\local.properties doesn't exist

android_runner:

ios_runner:

qnx_runner:

desktop_runner:
     [echo] **** Willkommen auf Runner ****
     [java] starting results server
     [java] starting baseline server
     [java] test script count: 4
     [java] starting the baseline server: Tue Sep 17 09:46:53 ACT 2013
     [java] new test file: C:\jenkins_slave\workspace\flex-sdk_mustella\mustella\tests\Managers\StyleManager\SparkStyles\SWFs\SparkStyles_Globals_mxml.swf
     [java] ******** cmdArr before: 
     [java] 	C:\ApacheFlex\dependencies\FlashPlayer_Debug\flashplayer11_1r102_55_win_sa_debug_32bit.exe
     [java] 	C:\jenkins_slave\workspace\flex-sdk_mustella\mustella\tests\Managers\StyleManager\SparkStyles\SWFs\SparkStyles_Globals_mxml.swf
     [java] ******** moreParameters before: 
     [java] ******** cmdArr after: 
     [java] 	C:\ApacheFlex\dependencies\FlashPlayer_Debug\flashplayer11_1r102_55_win_sa_debug_32bit.exe
     [java] 	C:\jenkins_slave\workspace\flex-sdk_mustella\mustella\tests\Managers\StyleManager\SparkStyles\SWFs\SparkStyles_Globals_mxml.swf
     [java] getting directory from the swf file
     [java] derived directory: C:\jenkins_slave\workspace\flex-sdk_mustella\mustella\tests\Managers\StyleManager\SparkStyles\SWFs
     [java] Launching: 
     [java]  C:\ApacheFlex\dependencies\FlashPlayer_Debug\flashplayer11_1r102_55_win_sa_debug_32bit.exe C:\jenkins_slave\workspace\flex-sdk_mustella\mustella\tests\Managers\StyleManager\SparkStyles\SWFs\SparkStyles_Globals_mxml.swf Launching: C:\ApacheFlex\dependencies\FlashPlayer_Debug\flashplayer11_1r102_55_win_sa_debug_32bit.exe C:\jenkins_slave\workspace\flex-sdk_mustella\mustella\tests\Managers\StyleManager\SparkStyles\SWFs\SparkStyles_Globals_mxml.swf
     [java] USING directory: C:\jenkins_slave\workspace\flex-sdk_mustella\mustella\tests\Managers\StyleManager\SparkStyles\SWFs
     [java] time: 09:46:53.137
     [java] Wrote file: c:/jenkins_slave/workspace/flex-sdk_mustella/mustella/tests/Managers/StyleManager/SparkStyles/SWFs/../globalSelectors/baselines/GlobalStyles_MxmlOverride_focusColor.png.bad.png length: 2613
     [java] FAIL: Managers/StyleManager/SparkStyles/globalSelectors/GlobalStyles_mxmlOverride_tester GlobalStyles_MxmlOverride_focusColor
     [java] SCRIPTDONE! 09:46:57.054
     [java] GET /ScriptComplete?0 HTTP/1.1
     [java] Before Wait loop 09:46:57.054 waiting = 0
     [java] After Wait loop 09:46:57.054 waiting = 0
     [java] clobberProcess false
     [java] Total Results so far: 1
     [java] waited 2000
     [java] ClobberProcess, it was already null
     [java] Grab log, do parse = false
     [java] Grabbing the log from: C:\Users\ApacheFlex\AppData/Roaming\Macromedia/Flash Player/Logs/flashlog.txt to: C:\jenkins_slave\workspace\flex-sdk_mustella\mustella\tests\Managers\StyleManager\SparkStyles\SWFs\SparkStyles_Globals_mxml.log
     [java] new test file: C:\jenkins_slave\workspace\flex-sdk_mustella\mustella\tests\containers\Accordion\SWFs\Accordion_InContainer_Spark.swf
     [java] ******** cmdArr before: 
     [java] 	C:\ApacheFlex\dependencies\FlashPlayer_Debug\flashplayer11_1r102_55_win_sa_debug_32bit.exe
     [java] 	C:\jenkins_slave\workspace\flex-sdk_mustella\mustella\tests\containers\Accordion\SWFs\Accordion_InContainer_Spark.swf
     [java] ******** moreParameters before: 
     [java] ******** cmdArr after: 
     [java] 	C:\ApacheFlex\dependencies\FlashPlayer_Debug\flashplayer11_1r102_55_win_sa_debug_32bit.exe
     [java] 	C:\jenkins_slave\workspace\flex-sdk_mustella\mustella\tests\containers\Accordion\SWFs\Accordion_InContainer_Spark.swf
     [java] getting directory from the swf file
     [java] derived directory: C:\jenkins_slave\workspace\flex-sdk_mustella\mustella\tests\containers\Accordion\SWFs
     [java] Launching: 
     [java]  C:\ApacheFlex\dependencies\FlashPlayer_Debug\flashplayer11_1r102_55_win_sa_debug_32bit.exe C:\jenkins_slave\workspace\flex-sdk_mustella\mustella\tests\containers\Accordion\SWFs\Accordion_InContainer_Spark.swf Launching: C:\ApacheFlex\dependencies\FlashPlayer_Debug\flashplayer11_1r102_55_win_sa_debug_32bit.exe C:\jenkins_slave\workspace\flex-sdk_mustella\mustella\tests\containers\Accordion\SWFs\Accordion_InContainer_Spark.swf
     [java] USING directory: C:\jenkins_slave\workspace\flex-sdk_mustella\mustella\tests\containers\Accordion\SWFs
     [java] time: 09:46:59.397
     [java] SCRIPTDONE! 09:47:03.080
     [java] GET /ScriptComplete?0 HTTP/1.1
     [java] Before Wait loop 09:47:03.080 waiting = 0
     [java] After Wait loop 09:47:03.080 waiting = 0
     [java] clobberProcess false
     [java] Total Results so far: 2
     [java] Grab log, do parse = false
     [java] Grabbing the log from: C:\Users\ApacheFlex\AppData/Roaming\Macromedia/Flash Player/Logs/flashlog.txt to: C:\jenkins_slave\workspace\flex-sdk_mustella\mustella\tests\containers\Accordion\SWFs\Accordion_InContainer_Spark.log
     [java] waited 2000
     [java] ClobberProcess, it was already null
     [java] new test file: C:\jenkins_slave\workspace\flex-sdk_mustella\mustella\tests\itemRenderers\Halo\List\SWFs\List_itemRendererTests.swf
     [java] ******** cmdArr before: 
     [java] 	C:\ApacheFlex\dependencies\FlashPlayer_Debug\flashplayer11_1r102_55_win_sa_debug_32bit.exe
     [java] 	C:\jenkins_slave\workspace\flex-sdk_mustella\mustella\tests\itemRenderers\Halo\List\SWFs\List_itemRendererTests.swf
     [java] ******** moreParameters before: 
     [java] ******** cmdArr after: 
     [java] 	C:\ApacheFlex\dependencies\FlashPlayer_Debug\flashplayer11_1r102_55_win_sa_debug_32bit.exe
     [java] 	C:\jenkins_slave\workspace\flex-sdk_mustella\mustella\tests\itemRenderers\Halo\List\SWFs\List_itemRendererTests.swf
     [java] getting directory from the swf file
     [java] derived directory: C:\jenkins_slave\workspace\flex-sdk_mustella\mustella\tests\itemRenderers\Halo\List\SWFs
     [java] Launching: 
     [java]  C:\ApacheFlex\dependencies\FlashPlayer_Debug\flashplayer11_1r102_55_win_sa_debug_32bit.exe C:\jenkins_slave\workspace\flex-sdk_mustella\mustella\tests\itemRenderers\Halo\List\SWFs\List_itemRendererTests.swf Launching: C:\ApacheFlex\dependencies\FlashPlayer_Debug\flashplayer11_1r102_55_win_sa_debug_32bit.exe C:\jenkins_slave\workspace\flex-sdk_mustella\mustella\tests\itemRenderers\Halo\List\SWFs\List_itemRendererTests.swf
     [java] USING directory: C:\jenkins_slave\workspace\flex-sdk_mustella\mustella\tests\itemRenderers\Halo\List\SWFs
     [java] time: 09:47:05.416
     [java] SCRIPTDONE! 09:47:09.144
     [java] GET /ScriptComplete?0 HTTP/1.1
     [java] Before Wait loop 09:47:09.144 waiting = 0
     [java] After Wait loop 09:47:09.144 waiting = 0
     [java] clobberProcess false
     [java] Total Results so far: 3
     [java] waited 2000
     [java] ClobberProcess, it was already null
     [java] Grab log, do parse = false
     [java] Grabbing the log from: C:\Users\ApacheFlex\AppData/Roaming\Macromedia/Flash Player/Logs/flashlog.txt to: C:\jenkins_slave\workspace\flex-sdk_mustella\mustella\tests\itemRenderers\Halo\List\SWFs\List_itemRendererTests.log
     [java] new test file: C:\jenkins_slave\workspace\flex-sdk_mustella\mustella\tests\resources\ResourceManager\SWFs\ResourceManagerApp.swf
     [java] ******** cmdArr before: 
     [java] 	C:\ApacheFlex\dependencies\FlashPlayer_Debug\flashplayer11_1r102_55_win_sa_debug_32bit.exe
     [java] 	C:\jenkins_slave\workspace\flex-sdk_mustella\mustella\tests\resources\ResourceManager\SWFs\ResourceManagerApp.swf
     [java] ******** moreParameters before: 
     [java] ******** cmdArr after: 
     [java] 	C:\ApacheFlex\dependencies\FlashPlayer_Debug\flashplayer11_1r102_55_win_sa_debug_32bit.exe
     [java] 	C:\jenkins_slave\workspace\flex-sdk_mustella\mustella\tests\resources\ResourceManager\SWFs\ResourceManagerApp.swf
     [java] getting directory from the swf file
     [java] derived directory: C:\jenkins_slave\workspace\flex-sdk_mustella\mustella\tests\resources\ResourceManager\SWFs
     [java] Launching: 
     [java]  C:\ApacheFlex\dependencies\FlashPlayer_Debug\flashplayer11_1r102_55_win_sa_debug_32bit.exe C:\jenkins_slave\workspace\flex-sdk_mustella\mustella\tests\resources\ResourceManager\SWFs\ResourceManagerApp.swf Launching: C:\ApacheFlex\dependencies\FlashPlayer_Debug\flashplayer11_1r102_55_win_sa_debug_32bit.exe C:\jenkins_slave\workspace\flex-sdk_mustella\mustella\tests\resources\ResourceManager\SWFs\ResourceManagerApp.swf
     [java] USING directory: C:\jenkins_slave\workspace\flex-sdk_mustella\mustella\tests\resources\ResourceManager\SWFs
     [java] time: 09:47:11.463
     [java] SCRIPTDONE! 09:47:14.380
     [java] GET /ScriptComplete?0 HTTP/1.1
     [java] Before Wait loop 09:47:14.380 waiting = 0
     [java] After Wait loop 09:47:14.380 waiting = 0
     [java] clobberProcess false
     [java] Total Results so far: 4
     [java] Grab log, do parse = false
     [java] waited 2000
     [java] ClobberProcess, it was already null
     [java] Grabbing the log from: C:\Users\ApacheFlex\AppData/Roaming\Macromedia/Flash Player/Logs/flashlog.txt to: C:\jenkins_slave\workspace\flex-sdk_mustella\mustella\tests\resources\ResourceManager\SWFs\ResourceManagerApp.log
     [java] at the end of main
     [java] Shutting down the results server
     [java] shutting down the baseline server
     [java] done waiting for results...bye
     [java] =====================================================
     [java]     Passes: 3
     [java]     Fails: 1
     [java] =====================================================
     [java] 
     [java] =====================================================
     [java] =====================================================
     [java] 	Passed: 
     [java] =====================================================
     [java] containers/Accordion/Styles/Accordion_SkinStates_Basic_Spark Accordion_Styles_SkinStates_runtime_SWF_mouseDown_NonselectedTab Passed  
     [java] itemRenderers/Halo/List/test_scripts/List_itemRenderer DateFieldRenderer_Scrolling Passed  
     [java] resources/ResourceManager/Integration/ResourceManager_Integration_UIComponent_resourcesChanged ResourceManager_Integration_UIComponent_resourcesChanged_localeChain Passed  
     [java] =====================================================
     [java] 	Failed: 
     [java] =====================================================
     [java] Managers/StyleManager/SparkStyles/globalSelectors/GlobalStyles_mxmlOverride_tester GlobalStyles_MxmlOverride_focusColor Failed CompareBitmap(body:step 4)  compare returned[object BitmapData] 
     [java] 
     [java] 
     [java] =====================================================
     [java]     Passes: 3
     [java]     Fails: 1
     [java] =====================================================
     [java] 
     [java] 
     [java] Wrote summary to results.txt
     [java] Wrote failures to failures.txt

BUILD FAILED
C:\jenkins_slave\workspace\flex-sdk_mustella\mustella\build.xml:1538: The following error occurred while executing this line:
C:\jenkins_slave\workspace\flex-sdk_mustella\mustella\build.xml:1656: Java returned: 1

Total time: 1 minute 27 seconds



============ JENKINS MUSTELLA RUN REPORT ============

Date and time: 09-17-2013 14:47

Settings:
player.version = 11.1
air.version = 3.7
FLASHPLAYER_DEBUGGER = C:\ApacheFlex\dependencies\FlashPlayer_Debug\flashplayer11_1r102_55_win_sa_debug_32bit.exe
AIR_HOME = C:\ApacheFlex\dependencies\AdobeAIRSDK\3.7

Build: 
  type = main
  command = -timeout=60000
  set = -all

Log:
- Made Cygwin ignore carriage returns
- Cleaned up 'local.properties' files from previous runs
- Set FLASH_VERSION to '11.1' and AIR_VERSION to '3.7'
- Set AIR_HOME to 'C:\ApacheFlex\dependencies\AdobeAIRSDK\3.7'
- Set FLASHPLAYER_DEBUGGER to 'C:\ApacheFlex\dependencies\FlashPlayer_Debug\flashplayer11_1r102_55_win_sa_debug_32bit.exe'
- Ran 'clean', 'main' and 'other.locales' ant targets to prepare the SDK for testing
- Ran Mustella on the SDK with these parameters: '-timeout=60000 -all'
- Some tests failed: running '-failures'
- Some of tests failed, even after running '-failures'...


=====================================================



Build step 'Execute shell' marked build as failure

Jenkins build is back to normal : flex-sdk_mustella #312

Posted by fl...@gmail.com.
See <http://localhost:8080/job/flex-sdk_mustella/312/changes>


Re: Build failed in Jenkins: flex-sdk_mustella #311

Posted by Erik de Bruin <er...@ixsoftware.nl>.
> What would it take to have bad.png files stored somewhere so we don't have
> to use RDP to go look (and find they are not there because the next run
> has started)?

Time, mostly ;-) It's no problem to set this up, we can even provide
web access to Jenkins on the VM (like at builds@a.o.) and story the
'bad.png' files as 'artifacts'.

> Anyway, the focusColor test can fail is some other thing like an update
> warning on the machine takes focus away from the FP window.

Like me messing around on the VM... I'll try to be more 'hands-off' ;-)

EdB



-- 
Ix Multimedia Software

Jan Luykenstraat 27
3521 VB Utrecht

T. 06-51952295
I. www.ixsoftware.nl

Re: Build failed in Jenkins: flex-sdk_mustella #311

Posted by Erik de Bruin <er...@ixsoftware.nl>.
> What would it take to have bad.png files stored somewhere so we don't have
> to use RDP to go look (and find they are not there because the next run
> has started)?

Time, mostly ;-) It's no problem to set this up, we can even provide
web access to Jenkins on the VM (like at builds@a.o.) and story the
'bad.png' files as 'artifacts'.

> Anyway, the focusColor test can fail is some other thing like an update
> warning on the machine takes focus away from the FP window.

Like me messing around on the VM... I'll try to be more 'hands-off' ;-)

EdB



-- 
Ix Multimedia Software

Jan Luykenstraat 27
3521 VB Utrecht

T. 06-51952295
I. www.ixsoftware.nl

Re: Build failed in Jenkins: flex-sdk_mustella #311

Posted by Alex Harui <ah...@adobe.com>.
What would it take to have bad.png files stored somewhere so we don't have
to use RDP to go look (and find they are not there because the next run
has started)?

Anyway, the focusColor test can fail is some other thing like an update
warning on the machine takes focus away from the FP window.

-Alex

On 9/17/13 7:55 AM, "Erik de Bruin" <er...@ixsoftware.nl> wrote:

>"Managers/StyleManager/SparkStyles/globalSelectors/GlobalStyles_mxmlOverri
>de_tester
>GlobalStyles_MxmlOverride_focusColor Failed CompareBitmap(body:step 4)
> compare returned[object BitmapData]"
>
>Anyone have any idea why that may be failing? This is just the first
>run in which it fails, so nobody panic, but if anyone made change that
>may cause this, please re-check and re-test your code, just to be
>safe.
>
>Thanks,
>
>EdB
>
>
>
>On Tue, Sep 17, 2013 at 4:47 PM,  <fl...@gmail.com> wrote:
>> See <http://localhost:8080/job/flex-sdk_mustella/311/changes>
>>
>> Changes:
>>
>> [jmclean] Update release notes
>>
>> [jmclean] FLEX-33728 added access to imageDecodingPolicy
>>
>> [jmclean] FLEX-33728 fixed so compiles and all supported version of
>>flash and chache first answer
>>
>> [jmclean] FLEX-33722 stop RTE when dragging a spark datagrid column
>>
>> ------------------------------------------
>> [...truncated 85871 lines...]
>> shells:
>>      [exec] next: pre_compile.sh 0
>>      [exec] next: pre_compile.sh 1
>>      [exec] next: pre_compile.sh 2
>>      [exec] done with pre compile step
>>      [java] exclude_filename:
>>C:/jenkins_slave/workspace/flex-sdk_mustella/mustella/tests/ExcludeListWi
>>n.txt
>>      [java] os_version: ${os_version}
>>      [java] target_os_name: windows
>>      [java] device_name: ${device_name}
>>      [java] result_include: -includes=SendResultsToRunner
>>      [java] Choosing local runner bitmap save
>>      [java] Choosing local runner bitmap save
>>      [java] Choosing local runner bitmap save
>>      [java] Choosing local runner bitmap save
>>      [java] okey doke, going to compile
>>C:\jenkins_slave\workspace\flex-sdk_mustella\mustella\tests\Managers\Styl
>>eManager\SparkStyles\SWFs\SparkStyles_Globals_mxml.mxml
>>      [java] okey doke, going to compile
>>C:\jenkins_slave\workspace\flex-sdk_mustella\mustella\tests\itemRenderers
>>\Halo\List\SWFs\List_itemRendererTests.mxml
>>      [java] okey doke, going to compile
>>C:\jenkins_slave\workspace\flex-sdk_mustella\mustella\tests\containers\Ac
>>cordion\SWFs\Accordion_InContainer_Spark.mxml
>>      [java] okey doke, going to compile
>>C:\jenkins_slave\workspace\flex-sdk_mustella\mustella\tests\resources\Res
>>ourceManager\SWFs\ResourceManagerApp.mxml
>>      [java] Loading configuration file
>>C:\jenkins_slave\workspace\flex-sdk_mustella\frameworks\flex-config.xml
>>      [java] Loading configuration file
>>C:\jenkins_slave\workspace\flex-sdk_mustella\frameworks\flex-config.xml
>>      [java] Loading configuration file
>>C:\jenkins_slave\workspace\flex-sdk_mustella\frameworks\flex-config.xml
>>      [java] Loading configuration file
>>C:\jenkins_slave\workspace\flex-sdk_mustella\frameworks\flex-config.xml
>>      [java]
>>C:\jenkins_slave\workspace\flex-sdk_mustella\mustella\tests\resources\Res
>>ourceManager\SWFs\ResourceManagerApp.swf (737934 bytes)
>>      [java] Choosing local runner bitmap save
>>      [java] okey doke, going to compile
>>C:\jenkins_slave\workspace\flex-sdk_mustella\mustella\tests\gumbo\compone
>>nts\Application\SWFs\Application_Properties_App1.mxml
>>      [java] Loading configuration file
>>C:\jenkins_slave\workspace\flex-sdk_mustella\frameworks\flex-config.xml
>>      [java]
>>C:\jenkins_slave\workspace\flex-sdk_mustella\mustella\tests\itemRenderers
>>\Halo\List\SWFs\List_itemRendererTests.swf (1185630 bytes)
>>      [java] nothing left to do
>>      [java]
>>C:\jenkins_slave\workspace\flex-sdk_mustella\mustella\tests\containers\Ac
>>cordion\SWFs\Accordion_InContainer_Spark.swf (1449154 bytes)
>>      [java]
>>C:\jenkins_slave\workspace\flex-sdk_mustella\mustella\tests\Managers\Styl
>>eManager\SparkStyles\SWFs\SparkStyles_Globals_mxml.mxml(80): Warning:
>>The CSS type selector 'spark.components.TextArea' was not processed,
>>because the type was not used in the application.
>>      [java]
>>      [java]         s|TextArea, s|Panel {
>>      [java]
>>      [java]
>>C:\jenkins_slave\workspace\flex-sdk_mustella\mustella\tests\Managers\Styl
>>eManager\SparkStyles\SWFs\SparkStyles_Globals_mxml.swf (2205119 bytes)
>>      [java] All done with the compile
>>      [java] leaving the compile, elapsed: 18
>>      [java] ...via exit
>>      [echo] compileswfs jreturn is 0
>>  [loadfile]
>>C:\jenkins_slave\workspace\flex-sdk_mustella\mustella\local.properties
>>doesn't exist
>>
>> do_fail:
>>
>> compileswfs:
>>
>> getExcludes:
>>
>> getExcludeIds:
>>
>> populateExcludeTable:
>>      [echo] populate exclude, got this for db time: 2013/09/17 09:45:56
>>
>> justrun:
>>  [loadfile]
>>C:\jenkins_slave\workspace\flex-sdk_mustella\mustella\local.properties
>>doesn't exist
>>
>> delete_cache:
>>      [echo] delete cache: /Users/ApacheFlex/Library/Caches/Adobe/Flash
>>Player/AssetCache
>>  [loadfile]
>>C:\jenkins_slave\workspace\flex-sdk_mustella\mustella\local.properties
>>doesn't exist
>>
>> delete_cache:
>>      [echo] delete cache: /Users/ApacheFlex/AppData/Roaming/Adobe/Flash
>>Player/AssetCache
>>    [delete] Deleting directory
>>C:\Users\ApacheFlex\AppData\Roaming\Adobe\Flash
>>Player\AssetCache\94ELK3V4
>>    [delete] Deleting directory
>>C:\Users\ApacheFlex\AppData\Roaming\Adobe\Flash Player\AssetCache
>>  [loadfile]
>>C:\jenkins_slave\workspace\flex-sdk_mustella\mustella\local.properties
>>doesn't exist
>>
>> delete_cache:
>>      [echo] delete cache: C:\Users\ApacheFlex/Application
>>Data/Adobe/Flash Player/AssetCache
>>  [loadfile]
>>C:\jenkins_slave\workspace\flex-sdk_mustella\mustella\local.properties
>>doesn't exist
>>
>> android_runner:
>>
>> ios_runner:
>>
>> qnx_runner:
>>
>> desktop_runner:
>>      [echo] **** Willkommen auf Runner ****
>>      [java] starting results server
>>      [java] starting baseline server
>>      [java] test script count: 4
>>      [java] starting the baseline server: Tue Sep 17 09:46:53 ACT 2013
>>      [java] new test file:
>>C:\jenkins_slave\workspace\flex-sdk_mustella\mustella\tests\Managers\Styl
>>eManager\SparkStyles\SWFs\SparkStyles_Globals_mxml.swf
>>      [java] ******** cmdArr before:
>>      [java]
>>C:\ApacheFlex\dependencies\FlashPlayer_Debug\flashplayer11_1r102_55_win_s
>>a_debug_32bit.exe
>>      [java]
>>C:\jenkins_slave\workspace\flex-sdk_mustella\mustella\tests\Managers\Styl
>>eManager\SparkStyles\SWFs\SparkStyles_Globals_mxml.swf
>>      [java] ******** moreParameters before:
>>      [java] ******** cmdArr after:
>>      [java]
>>C:\ApacheFlex\dependencies\FlashPlayer_Debug\flashplayer11_1r102_55_win_s
>>a_debug_32bit.exe
>>      [java]
>>C:\jenkins_slave\workspace\flex-sdk_mustella\mustella\tests\Managers\Styl
>>eManager\SparkStyles\SWFs\SparkStyles_Globals_mxml.swf
>>      [java] getting directory from the swf file
>>      [java] derived directory:
>>C:\jenkins_slave\workspace\flex-sdk_mustella\mustella\tests\Managers\Styl
>>eManager\SparkStyles\SWFs
>>      [java] Launching:
>>      [java]
>>C:\ApacheFlex\dependencies\FlashPlayer_Debug\flashplayer11_1r102_55_win_s
>>a_debug_32bit.exe
>>C:\jenkins_slave\workspace\flex-sdk_mustella\mustella\tests\Managers\Styl
>>eManager\SparkStyles\SWFs\SparkStyles_Globals_mxml.swf Launching:
>>C:\ApacheFlex\dependencies\FlashPlayer_Debug\flashplayer11_1r102_55_win_s
>>a_debug_32bit.exe
>>C:\jenkins_slave\workspace\flex-sdk_mustella\mustella\tests\Managers\Styl
>>eManager\SparkStyles\SWFs\SparkStyles_Globals_mxml.swf
>>      [java] USING directory:
>>C:\jenkins_slave\workspace\flex-sdk_mustella\mustella\tests\Managers\Styl
>>eManager\SparkStyles\SWFs
>>      [java] time: 09:46:53.137
>>      [java] Wrote file:
>>c:/jenkins_slave/workspace/flex-sdk_mustella/mustella/tests/Managers/Styl
>>eManager/SparkStyles/SWFs/../globalSelectors/baselines/GlobalStyles_MxmlO
>>verride_focusColor.png.bad.png length: 2613
>>      [java] FAIL:
>>Managers/StyleManager/SparkStyles/globalSelectors/GlobalStyles_mxmlOverri
>>de_tester GlobalStyles_MxmlOverride_focusColor
>>      [java] SCRIPTDONE! 09:46:57.054
>>      [java] GET /ScriptComplete?0 HTTP/1.1
>>      [java] Before Wait loop 09:46:57.054 waiting = 0
>>      [java] After Wait loop 09:46:57.054 waiting = 0
>>      [java] clobberProcess false
>>      [java] Total Results so far: 1
>>      [java] waited 2000
>>      [java] ClobberProcess, it was already null
>>      [java] Grab log, do parse = false
>>      [java] Grabbing the log from:
>>C:\Users\ApacheFlex\AppData/Roaming\Macromedia/Flash
>>Player/Logs/flashlog.txt to:
>>C:\jenkins_slave\workspace\flex-sdk_mustella\mustella\tests\Managers\Styl
>>eManager\SparkStyles\SWFs\SparkStyles_Globals_mxml.log
>>      [java] new test file:
>>C:\jenkins_slave\workspace\flex-sdk_mustella\mustella\tests\containers\Ac
>>cordion\SWFs\Accordion_InContainer_Spark.swf
>>      [java] ******** cmdArr before:
>>      [java]
>>C:\ApacheFlex\dependencies\FlashPlayer_Debug\flashplayer11_1r102_55_win_s
>>a_debug_32bit.exe
>>      [java]
>>C:\jenkins_slave\workspace\flex-sdk_mustella\mustella\tests\containers\Ac
>>cordion\SWFs\Accordion_InContainer_Spark.swf
>>      [java] ******** moreParameters before:
>>      [java] ******** cmdArr after:
>>      [java]
>>C:\ApacheFlex\dependencies\FlashPlayer_Debug\flashplayer11_1r102_55_win_s
>>a_debug_32bit.exe
>>      [java]
>>C:\jenkins_slave\workspace\flex-sdk_mustella\mustella\tests\containers\Ac
>>cordion\SWFs\Accordion_InContainer_Spark.swf
>>      [java] getting directory from the swf file
>>      [java] derived directory:
>>C:\jenkins_slave\workspace\flex-sdk_mustella\mustella\tests\containers\Ac
>>cordion\SWFs
>>      [java] Launching:
>>      [java]
>>C:\ApacheFlex\dependencies\FlashPlayer_Debug\flashplayer11_1r102_55_win_s
>>a_debug_32bit.exe
>>C:\jenkins_slave\workspace\flex-sdk_mustella\mustella\tests\containers\Ac
>>cordion\SWFs\Accordion_InContainer_Spark.swf Launching:
>>C:\ApacheFlex\dependencies\FlashPlayer_Debug\flashplayer11_1r102_55_win_s
>>a_debug_32bit.exe
>>C:\jenkins_slave\workspace\flex-sdk_mustella\mustella\tests\containers\Ac
>>cordion\SWFs\Accordion_InContainer_Spark.swf
>>      [java] USING directory:
>>C:\jenkins_slave\workspace\flex-sdk_mustella\mustella\tests\containers\Ac
>>cordion\SWFs
>>      [java] time: 09:46:59.397
>>      [java] SCRIPTDONE! 09:47:03.080
>>      [java] GET /ScriptComplete?0 HTTP/1.1
>>      [java] Before Wait loop 09:47:03.080 waiting = 0
>>      [java] After Wait loop 09:47:03.080 waiting = 0
>>      [java] clobberProcess false
>>      [java] Total Results so far: 2
>>      [java] Grab log, do parse = false
>>      [java] Grabbing the log from:
>>C:\Users\ApacheFlex\AppData/Roaming\Macromedia/Flash
>>Player/Logs/flashlog.txt to:
>>C:\jenkins_slave\workspace\flex-sdk_mustella\mustella\tests\containers\Ac
>>cordion\SWFs\Accordion_InContainer_Spark.log
>>      [java] waited 2000
>>      [java] ClobberProcess, it was already null
>>      [java] new test file:
>>C:\jenkins_slave\workspace\flex-sdk_mustella\mustella\tests\itemRenderers
>>\Halo\List\SWFs\List_itemRendererTests.swf
>>      [java] ******** cmdArr before:
>>      [java]
>>C:\ApacheFlex\dependencies\FlashPlayer_Debug\flashplayer11_1r102_55_win_s
>>a_debug_32bit.exe
>>      [java]
>>C:\jenkins_slave\workspace\flex-sdk_mustella\mustella\tests\itemRenderers
>>\Halo\List\SWFs\List_itemRendererTests.swf
>>      [java] ******** moreParameters before:
>>      [java] ******** cmdArr after:
>>      [java]
>>C:\ApacheFlex\dependencies\FlashPlayer_Debug\flashplayer11_1r102_55_win_s
>>a_debug_32bit.exe
>>      [java]
>>C:\jenkins_slave\workspace\flex-sdk_mustella\mustella\tests\itemRenderers
>>\Halo\List\SWFs\List_itemRendererTests.swf
>>      [java] getting directory from the swf file
>>      [java] derived directory:
>>C:\jenkins_slave\workspace\flex-sdk_mustella\mustella\tests\itemRenderers
>>\Halo\List\SWFs
>>      [java] Launching:
>>      [java]
>>C:\ApacheFlex\dependencies\FlashPlayer_Debug\flashplayer11_1r102_55_win_s
>>a_debug_32bit.exe
>>C:\jenkins_slave\workspace\flex-sdk_mustella\mustella\tests\itemRenderers
>>\Halo\List\SWFs\List_itemRendererTests.swf Launching:
>>C:\ApacheFlex\dependencies\FlashPlayer_Debug\flashplayer11_1r102_55_win_s
>>a_debug_32bit.exe
>>C:\jenkins_slave\workspace\flex-sdk_mustella\mustella\tests\itemRenderers
>>\Halo\List\SWFs\List_itemRendererTests.swf
>>      [java] USING directory:
>>C:\jenkins_slave\workspace\flex-sdk_mustella\mustella\tests\itemRenderers
>>\Halo\List\SWFs
>>      [java] time: 09:47:05.416
>>      [java] SCRIPTDONE! 09:47:09.144
>>      [java] GET /ScriptComplete?0 HTTP/1.1
>>      [java] Before Wait loop 09:47:09.144 waiting = 0
>>      [java] After Wait loop 09:47:09.144 waiting = 0
>>      [java] clobberProcess false
>>      [java] Total Results so far: 3
>>      [java] waited 2000
>>      [java] ClobberProcess, it was already null
>>      [java] Grab log, do parse = false
>>      [java] Grabbing the log from:
>>C:\Users\ApacheFlex\AppData/Roaming\Macromedia/Flash
>>Player/Logs/flashlog.txt to:
>>C:\jenkins_slave\workspace\flex-sdk_mustella\mustella\tests\itemRenderers
>>\Halo\List\SWFs\List_itemRendererTests.log
>>      [java] new test file:
>>C:\jenkins_slave\workspace\flex-sdk_mustella\mustella\tests\resources\Res
>>ourceManager\SWFs\ResourceManagerApp.swf
>>      [java] ******** cmdArr before:
>>      [java]
>>C:\ApacheFlex\dependencies\FlashPlayer_Debug\flashplayer11_1r102_55_win_s
>>a_debug_32bit.exe
>>      [java]
>>C:\jenkins_slave\workspace\flex-sdk_mustella\mustella\tests\resources\Res
>>ourceManager\SWFs\ResourceManagerApp.swf
>>      [java] ******** moreParameters before:
>>      [java] ******** cmdArr after:
>>      [java]
>>C:\ApacheFlex\dependencies\FlashPlayer_Debug\flashplayer11_1r102_55_win_s
>>a_debug_32bit.exe
>>      [java]
>>C:\jenkins_slave\workspace\flex-sdk_mustella\mustella\tests\resources\Res
>>ourceManager\SWFs\ResourceManagerApp.swf
>>      [java] getting directory from the swf file
>>      [java] derived directory:
>>C:\jenkins_slave\workspace\flex-sdk_mustella\mustella\tests\resources\Res
>>ourceManager\SWFs
>>      [java] Launching:
>>      [java]
>>C:\ApacheFlex\dependencies\FlashPlayer_Debug\flashplayer11_1r102_55_win_s
>>a_debug_32bit.exe
>>C:\jenkins_slave\workspace\flex-sdk_mustella\mustella\tests\resources\Res
>>ourceManager\SWFs\ResourceManagerApp.swf Launching:
>>C:\ApacheFlex\dependencies\FlashPlayer_Debug\flashplayer11_1r102_55_win_s
>>a_debug_32bit.exe
>>C:\jenkins_slave\workspace\flex-sdk_mustella\mustella\tests\resources\Res
>>ourceManager\SWFs\ResourceManagerApp.swf
>>      [java] USING directory:
>>C:\jenkins_slave\workspace\flex-sdk_mustella\mustella\tests\resources\Res
>>ourceManager\SWFs
>>      [java] time: 09:47:11.463
>>      [java] SCRIPTDONE! 09:47:14.380
>>      [java] GET /ScriptComplete?0 HTTP/1.1
>>      [java] Before Wait loop 09:47:14.380 waiting = 0
>>      [java] After Wait loop 09:47:14.380 waiting = 0
>>      [java] clobberProcess false
>>      [java] Total Results so far: 4
>>      [java] Grab log, do parse = false
>>      [java] waited 2000
>>      [java] ClobberProcess, it was already null
>>      [java] Grabbing the log from:
>>C:\Users\ApacheFlex\AppData/Roaming\Macromedia/Flash
>>Player/Logs/flashlog.txt to:
>>C:\jenkins_slave\workspace\flex-sdk_mustella\mustella\tests\resources\Res
>>ourceManager\SWFs\ResourceManagerApp.log
>>      [java] at the end of main
>>      [java] Shutting down the results server
>>      [java] shutting down the baseline server
>>      [java] done waiting for results...bye
>>      [java] =====================================================
>>      [java]     Passes: 3
>>      [java]     Fails: 1
>>      [java] =====================================================
>>      [java]
>>      [java] =====================================================
>>      [java] =====================================================
>>      [java]     Passed:
>>      [java] =====================================================
>>      [java]
>>containers/Accordion/Styles/Accordion_SkinStates_Basic_Spark
>>Accordion_Styles_SkinStates_runtime_SWF_mouseDown_NonselectedTab Passed
>>      [java] itemRenderers/Halo/List/test_scripts/List_itemRenderer
>>DateFieldRenderer_Scrolling Passed
>>      [java]
>>resources/ResourceManager/Integration/ResourceManager_Integration_UICompo
>>nent_resourcesChanged
>>ResourceManager_Integration_UIComponent_resourcesChanged_localeChain
>>Passed
>>      [java] =====================================================
>>      [java]     Failed:
>>      [java] =====================================================
>>      [java]
>>Managers/StyleManager/SparkStyles/globalSelectors/GlobalStyles_mxmlOverri
>>de_tester GlobalStyles_MxmlOverride_focusColor Failed
>>CompareBitmap(body:step 4)  compare returned[object BitmapData]
>>      [java]
>>      [java]
>>      [java] =====================================================
>>      [java]     Passes: 3
>>      [java]     Fails: 1
>>      [java] =====================================================
>>      [java]
>>      [java]
>>      [java] Wrote summary to results.txt
>>      [java] Wrote failures to failures.txt
>>
>> BUILD FAILED
>> C:\jenkins_slave\workspace\flex-sdk_mustella\mustella\build.xml:1538:
>>The following error occurred while executing this line:
>> C:\jenkins_slave\workspace\flex-sdk_mustella\mustella\build.xml:1656:
>>Java returned: 1
>>
>> Total time: 1 minute 27 seconds
>>
>>
>>
>> ============ JENKINS MUSTELLA RUN REPORT ============
>>
>> Date and time: 09-17-2013 14:47
>>
>> Settings:
>> player.version = 11.1
>> air.version = 3.7
>> FLASHPLAYER_DEBUGGER =
>>C:\ApacheFlex\dependencies\FlashPlayer_Debug\flashplayer11_1r102_55_win_s
>>a_debug_32bit.exe
>> AIR_HOME = C:\ApacheFlex\dependencies\AdobeAIRSDK\3.7
>>
>> Build:
>>   type = main
>>   command = -timeout=60000
>>   set = -all
>>
>> Log:
>> - Made Cygwin ignore carriage returns
>> - Cleaned up 'local.properties' files from previous runs
>> - Set FLASH_VERSION to '11.1' and AIR_VERSION to '3.7'
>> - Set AIR_HOME to 'C:\ApacheFlex\dependencies\AdobeAIRSDK\3.7'
>> - Set FLASHPLAYER_DEBUGGER to
>>'C:\ApacheFlex\dependencies\FlashPlayer_Debug\flashplayer11_1r102_55_win_
>>sa_debug_32bit.exe'
>> - Ran 'clean', 'main' and 'other.locales' ant targets to prepare the
>>SDK for testing
>> - Ran Mustella on the SDK with these parameters: '-timeout=60000 -all'
>> - Some tests failed: running '-failures'
>> - Some of tests failed, even after running '-failures'...
>>
>>
>> =====================================================
>>
>>
>>
>> Build step 'Execute shell' marked build as failure
>
>
>
>--
>Ix Multimedia Software
>
>Jan Luykenstraat 27
>3521 VB Utrecht
>
>T. 06-51952295
>I. www.ixsoftware.nl


Re: Build failed in Jenkins: flex-sdk_mustella #311

Posted by Alex Harui <ah...@adobe.com>.
What would it take to have bad.png files stored somewhere so we don't have
to use RDP to go look (and find they are not there because the next run
has started)?

Anyway, the focusColor test can fail is some other thing like an update
warning on the machine takes focus away from the FP window.

-Alex

On 9/17/13 7:55 AM, "Erik de Bruin" <er...@ixsoftware.nl> wrote:

>"Managers/StyleManager/SparkStyles/globalSelectors/GlobalStyles_mxmlOverri
>de_tester
>GlobalStyles_MxmlOverride_focusColor Failed CompareBitmap(body:step 4)
> compare returned[object BitmapData]"
>
>Anyone have any idea why that may be failing? This is just the first
>run in which it fails, so nobody panic, but if anyone made change that
>may cause this, please re-check and re-test your code, just to be
>safe.
>
>Thanks,
>
>EdB
>
>
>
>On Tue, Sep 17, 2013 at 4:47 PM,  <fl...@gmail.com> wrote:
>> See <http://localhost:8080/job/flex-sdk_mustella/311/changes>
>>
>> Changes:
>>
>> [jmclean] Update release notes
>>
>> [jmclean] FLEX-33728 added access to imageDecodingPolicy
>>
>> [jmclean] FLEX-33728 fixed so compiles and all supported version of
>>flash and chache first answer
>>
>> [jmclean] FLEX-33722 stop RTE when dragging a spark datagrid column
>>
>> ------------------------------------------
>> [...truncated 85871 lines...]
>> shells:
>>      [exec] next: pre_compile.sh 0
>>      [exec] next: pre_compile.sh 1
>>      [exec] next: pre_compile.sh 2
>>      [exec] done with pre compile step
>>      [java] exclude_filename:
>>C:/jenkins_slave/workspace/flex-sdk_mustella/mustella/tests/ExcludeListWi
>>n.txt
>>      [java] os_version: ${os_version}
>>      [java] target_os_name: windows
>>      [java] device_name: ${device_name}
>>      [java] result_include: -includes=SendResultsToRunner
>>      [java] Choosing local runner bitmap save
>>      [java] Choosing local runner bitmap save
>>      [java] Choosing local runner bitmap save
>>      [java] Choosing local runner bitmap save
>>      [java] okey doke, going to compile
>>C:\jenkins_slave\workspace\flex-sdk_mustella\mustella\tests\Managers\Styl
>>eManager\SparkStyles\SWFs\SparkStyles_Globals_mxml.mxml
>>      [java] okey doke, going to compile
>>C:\jenkins_slave\workspace\flex-sdk_mustella\mustella\tests\itemRenderers
>>\Halo\List\SWFs\List_itemRendererTests.mxml
>>      [java] okey doke, going to compile
>>C:\jenkins_slave\workspace\flex-sdk_mustella\mustella\tests\containers\Ac
>>cordion\SWFs\Accordion_InContainer_Spark.mxml
>>      [java] okey doke, going to compile
>>C:\jenkins_slave\workspace\flex-sdk_mustella\mustella\tests\resources\Res
>>ourceManager\SWFs\ResourceManagerApp.mxml
>>      [java] Loading configuration file
>>C:\jenkins_slave\workspace\flex-sdk_mustella\frameworks\flex-config.xml
>>      [java] Loading configuration file
>>C:\jenkins_slave\workspace\flex-sdk_mustella\frameworks\flex-config.xml
>>      [java] Loading configuration file
>>C:\jenkins_slave\workspace\flex-sdk_mustella\frameworks\flex-config.xml
>>      [java] Loading configuration file
>>C:\jenkins_slave\workspace\flex-sdk_mustella\frameworks\flex-config.xml
>>      [java]
>>C:\jenkins_slave\workspace\flex-sdk_mustella\mustella\tests\resources\Res
>>ourceManager\SWFs\ResourceManagerApp.swf (737934 bytes)
>>      [java] Choosing local runner bitmap save
>>      [java] okey doke, going to compile
>>C:\jenkins_slave\workspace\flex-sdk_mustella\mustella\tests\gumbo\compone
>>nts\Application\SWFs\Application_Properties_App1.mxml
>>      [java] Loading configuration file
>>C:\jenkins_slave\workspace\flex-sdk_mustella\frameworks\flex-config.xml
>>      [java]
>>C:\jenkins_slave\workspace\flex-sdk_mustella\mustella\tests\itemRenderers
>>\Halo\List\SWFs\List_itemRendererTests.swf (1185630 bytes)
>>      [java] nothing left to do
>>      [java]
>>C:\jenkins_slave\workspace\flex-sdk_mustella\mustella\tests\containers\Ac
>>cordion\SWFs\Accordion_InContainer_Spark.swf (1449154 bytes)
>>      [java]
>>C:\jenkins_slave\workspace\flex-sdk_mustella\mustella\tests\Managers\Styl
>>eManager\SparkStyles\SWFs\SparkStyles_Globals_mxml.mxml(80): Warning:
>>The CSS type selector 'spark.components.TextArea' was not processed,
>>because the type was not used in the application.
>>      [java]
>>      [java]         s|TextArea, s|Panel {
>>      [java]
>>      [java]
>>C:\jenkins_slave\workspace\flex-sdk_mustella\mustella\tests\Managers\Styl
>>eManager\SparkStyles\SWFs\SparkStyles_Globals_mxml.swf (2205119 bytes)
>>      [java] All done with the compile
>>      [java] leaving the compile, elapsed: 18
>>      [java] ...via exit
>>      [echo] compileswfs jreturn is 0
>>  [loadfile]
>>C:\jenkins_slave\workspace\flex-sdk_mustella\mustella\local.properties
>>doesn't exist
>>
>> do_fail:
>>
>> compileswfs:
>>
>> getExcludes:
>>
>> getExcludeIds:
>>
>> populateExcludeTable:
>>      [echo] populate exclude, got this for db time: 2013/09/17 09:45:56
>>
>> justrun:
>>  [loadfile]
>>C:\jenkins_slave\workspace\flex-sdk_mustella\mustella\local.properties
>>doesn't exist
>>
>> delete_cache:
>>      [echo] delete cache: /Users/ApacheFlex/Library/Caches/Adobe/Flash
>>Player/AssetCache
>>  [loadfile]
>>C:\jenkins_slave\workspace\flex-sdk_mustella\mustella\local.properties
>>doesn't exist
>>
>> delete_cache:
>>      [echo] delete cache: /Users/ApacheFlex/AppData/Roaming/Adobe/Flash
>>Player/AssetCache
>>    [delete] Deleting directory
>>C:\Users\ApacheFlex\AppData\Roaming\Adobe\Flash
>>Player\AssetCache\94ELK3V4
>>    [delete] Deleting directory
>>C:\Users\ApacheFlex\AppData\Roaming\Adobe\Flash Player\AssetCache
>>  [loadfile]
>>C:\jenkins_slave\workspace\flex-sdk_mustella\mustella\local.properties
>>doesn't exist
>>
>> delete_cache:
>>      [echo] delete cache: C:\Users\ApacheFlex/Application
>>Data/Adobe/Flash Player/AssetCache
>>  [loadfile]
>>C:\jenkins_slave\workspace\flex-sdk_mustella\mustella\local.properties
>>doesn't exist
>>
>> android_runner:
>>
>> ios_runner:
>>
>> qnx_runner:
>>
>> desktop_runner:
>>      [echo] **** Willkommen auf Runner ****
>>      [java] starting results server
>>      [java] starting baseline server
>>      [java] test script count: 4
>>      [java] starting the baseline server: Tue Sep 17 09:46:53 ACT 2013
>>      [java] new test file:
>>C:\jenkins_slave\workspace\flex-sdk_mustella\mustella\tests\Managers\Styl
>>eManager\SparkStyles\SWFs\SparkStyles_Globals_mxml.swf
>>      [java] ******** cmdArr before:
>>      [java]
>>C:\ApacheFlex\dependencies\FlashPlayer_Debug\flashplayer11_1r102_55_win_s
>>a_debug_32bit.exe
>>      [java]
>>C:\jenkins_slave\workspace\flex-sdk_mustella\mustella\tests\Managers\Styl
>>eManager\SparkStyles\SWFs\SparkStyles_Globals_mxml.swf
>>      [java] ******** moreParameters before:
>>      [java] ******** cmdArr after:
>>      [java]
>>C:\ApacheFlex\dependencies\FlashPlayer_Debug\flashplayer11_1r102_55_win_s
>>a_debug_32bit.exe
>>      [java]
>>C:\jenkins_slave\workspace\flex-sdk_mustella\mustella\tests\Managers\Styl
>>eManager\SparkStyles\SWFs\SparkStyles_Globals_mxml.swf
>>      [java] getting directory from the swf file
>>      [java] derived directory:
>>C:\jenkins_slave\workspace\flex-sdk_mustella\mustella\tests\Managers\Styl
>>eManager\SparkStyles\SWFs
>>      [java] Launching:
>>      [java]
>>C:\ApacheFlex\dependencies\FlashPlayer_Debug\flashplayer11_1r102_55_win_s
>>a_debug_32bit.exe
>>C:\jenkins_slave\workspace\flex-sdk_mustella\mustella\tests\Managers\Styl
>>eManager\SparkStyles\SWFs\SparkStyles_Globals_mxml.swf Launching:
>>C:\ApacheFlex\dependencies\FlashPlayer_Debug\flashplayer11_1r102_55_win_s
>>a_debug_32bit.exe
>>C:\jenkins_slave\workspace\flex-sdk_mustella\mustella\tests\Managers\Styl
>>eManager\SparkStyles\SWFs\SparkStyles_Globals_mxml.swf
>>      [java] USING directory:
>>C:\jenkins_slave\workspace\flex-sdk_mustella\mustella\tests\Managers\Styl
>>eManager\SparkStyles\SWFs
>>      [java] time: 09:46:53.137
>>      [java] Wrote file:
>>c:/jenkins_slave/workspace/flex-sdk_mustella/mustella/tests/Managers/Styl
>>eManager/SparkStyles/SWFs/../globalSelectors/baselines/GlobalStyles_MxmlO
>>verride_focusColor.png.bad.png length: 2613
>>      [java] FAIL:
>>Managers/StyleManager/SparkStyles/globalSelectors/GlobalStyles_mxmlOverri
>>de_tester GlobalStyles_MxmlOverride_focusColor
>>      [java] SCRIPTDONE! 09:46:57.054
>>      [java] GET /ScriptComplete?0 HTTP/1.1
>>      [java] Before Wait loop 09:46:57.054 waiting = 0
>>      [java] After Wait loop 09:46:57.054 waiting = 0
>>      [java] clobberProcess false
>>      [java] Total Results so far: 1
>>      [java] waited 2000
>>      [java] ClobberProcess, it was already null
>>      [java] Grab log, do parse = false
>>      [java] Grabbing the log from:
>>C:\Users\ApacheFlex\AppData/Roaming\Macromedia/Flash
>>Player/Logs/flashlog.txt to:
>>C:\jenkins_slave\workspace\flex-sdk_mustella\mustella\tests\Managers\Styl
>>eManager\SparkStyles\SWFs\SparkStyles_Globals_mxml.log
>>      [java] new test file:
>>C:\jenkins_slave\workspace\flex-sdk_mustella\mustella\tests\containers\Ac
>>cordion\SWFs\Accordion_InContainer_Spark.swf
>>      [java] ******** cmdArr before:
>>      [java]
>>C:\ApacheFlex\dependencies\FlashPlayer_Debug\flashplayer11_1r102_55_win_s
>>a_debug_32bit.exe
>>      [java]
>>C:\jenkins_slave\workspace\flex-sdk_mustella\mustella\tests\containers\Ac
>>cordion\SWFs\Accordion_InContainer_Spark.swf
>>      [java] ******** moreParameters before:
>>      [java] ******** cmdArr after:
>>      [java]
>>C:\ApacheFlex\dependencies\FlashPlayer_Debug\flashplayer11_1r102_55_win_s
>>a_debug_32bit.exe
>>      [java]
>>C:\jenkins_slave\workspace\flex-sdk_mustella\mustella\tests\containers\Ac
>>cordion\SWFs\Accordion_InContainer_Spark.swf
>>      [java] getting directory from the swf file
>>      [java] derived directory:
>>C:\jenkins_slave\workspace\flex-sdk_mustella\mustella\tests\containers\Ac
>>cordion\SWFs
>>      [java] Launching:
>>      [java]
>>C:\ApacheFlex\dependencies\FlashPlayer_Debug\flashplayer11_1r102_55_win_s
>>a_debug_32bit.exe
>>C:\jenkins_slave\workspace\flex-sdk_mustella\mustella\tests\containers\Ac
>>cordion\SWFs\Accordion_InContainer_Spark.swf Launching:
>>C:\ApacheFlex\dependencies\FlashPlayer_Debug\flashplayer11_1r102_55_win_s
>>a_debug_32bit.exe
>>C:\jenkins_slave\workspace\flex-sdk_mustella\mustella\tests\containers\Ac
>>cordion\SWFs\Accordion_InContainer_Spark.swf
>>      [java] USING directory:
>>C:\jenkins_slave\workspace\flex-sdk_mustella\mustella\tests\containers\Ac
>>cordion\SWFs
>>      [java] time: 09:46:59.397
>>      [java] SCRIPTDONE! 09:47:03.080
>>      [java] GET /ScriptComplete?0 HTTP/1.1
>>      [java] Before Wait loop 09:47:03.080 waiting = 0
>>      [java] After Wait loop 09:47:03.080 waiting = 0
>>      [java] clobberProcess false
>>      [java] Total Results so far: 2
>>      [java] Grab log, do parse = false
>>      [java] Grabbing the log from:
>>C:\Users\ApacheFlex\AppData/Roaming\Macromedia/Flash
>>Player/Logs/flashlog.txt to:
>>C:\jenkins_slave\workspace\flex-sdk_mustella\mustella\tests\containers\Ac
>>cordion\SWFs\Accordion_InContainer_Spark.log
>>      [java] waited 2000
>>      [java] ClobberProcess, it was already null
>>      [java] new test file:
>>C:\jenkins_slave\workspace\flex-sdk_mustella\mustella\tests\itemRenderers
>>\Halo\List\SWFs\List_itemRendererTests.swf
>>      [java] ******** cmdArr before:
>>      [java]
>>C:\ApacheFlex\dependencies\FlashPlayer_Debug\flashplayer11_1r102_55_win_s
>>a_debug_32bit.exe
>>      [java]
>>C:\jenkins_slave\workspace\flex-sdk_mustella\mustella\tests\itemRenderers
>>\Halo\List\SWFs\List_itemRendererTests.swf
>>      [java] ******** moreParameters before:
>>      [java] ******** cmdArr after:
>>      [java]
>>C:\ApacheFlex\dependencies\FlashPlayer_Debug\flashplayer11_1r102_55_win_s
>>a_debug_32bit.exe
>>      [java]
>>C:\jenkins_slave\workspace\flex-sdk_mustella\mustella\tests\itemRenderers
>>\Halo\List\SWFs\List_itemRendererTests.swf
>>      [java] getting directory from the swf file
>>      [java] derived directory:
>>C:\jenkins_slave\workspace\flex-sdk_mustella\mustella\tests\itemRenderers
>>\Halo\List\SWFs
>>      [java] Launching:
>>      [java]
>>C:\ApacheFlex\dependencies\FlashPlayer_Debug\flashplayer11_1r102_55_win_s
>>a_debug_32bit.exe
>>C:\jenkins_slave\workspace\flex-sdk_mustella\mustella\tests\itemRenderers
>>\Halo\List\SWFs\List_itemRendererTests.swf Launching:
>>C:\ApacheFlex\dependencies\FlashPlayer_Debug\flashplayer11_1r102_55_win_s
>>a_debug_32bit.exe
>>C:\jenkins_slave\workspace\flex-sdk_mustella\mustella\tests\itemRenderers
>>\Halo\List\SWFs\List_itemRendererTests.swf
>>      [java] USING directory:
>>C:\jenkins_slave\workspace\flex-sdk_mustella\mustella\tests\itemRenderers
>>\Halo\List\SWFs
>>      [java] time: 09:47:05.416
>>      [java] SCRIPTDONE! 09:47:09.144
>>      [java] GET /ScriptComplete?0 HTTP/1.1
>>      [java] Before Wait loop 09:47:09.144 waiting = 0
>>      [java] After Wait loop 09:47:09.144 waiting = 0
>>      [java] clobberProcess false
>>      [java] Total Results so far: 3
>>      [java] waited 2000
>>      [java] ClobberProcess, it was already null
>>      [java] Grab log, do parse = false
>>      [java] Grabbing the log from:
>>C:\Users\ApacheFlex\AppData/Roaming\Macromedia/Flash
>>Player/Logs/flashlog.txt to:
>>C:\jenkins_slave\workspace\flex-sdk_mustella\mustella\tests\itemRenderers
>>\Halo\List\SWFs\List_itemRendererTests.log
>>      [java] new test file:
>>C:\jenkins_slave\workspace\flex-sdk_mustella\mustella\tests\resources\Res
>>ourceManager\SWFs\ResourceManagerApp.swf
>>      [java] ******** cmdArr before:
>>      [java]
>>C:\ApacheFlex\dependencies\FlashPlayer_Debug\flashplayer11_1r102_55_win_s
>>a_debug_32bit.exe
>>      [java]
>>C:\jenkins_slave\workspace\flex-sdk_mustella\mustella\tests\resources\Res
>>ourceManager\SWFs\ResourceManagerApp.swf
>>      [java] ******** moreParameters before:
>>      [java] ******** cmdArr after:
>>      [java]
>>C:\ApacheFlex\dependencies\FlashPlayer_Debug\flashplayer11_1r102_55_win_s
>>a_debug_32bit.exe
>>      [java]
>>C:\jenkins_slave\workspace\flex-sdk_mustella\mustella\tests\resources\Res
>>ourceManager\SWFs\ResourceManagerApp.swf
>>      [java] getting directory from the swf file
>>      [java] derived directory:
>>C:\jenkins_slave\workspace\flex-sdk_mustella\mustella\tests\resources\Res
>>ourceManager\SWFs
>>      [java] Launching:
>>      [java]
>>C:\ApacheFlex\dependencies\FlashPlayer_Debug\flashplayer11_1r102_55_win_s
>>a_debug_32bit.exe
>>C:\jenkins_slave\workspace\flex-sdk_mustella\mustella\tests\resources\Res
>>ourceManager\SWFs\ResourceManagerApp.swf Launching:
>>C:\ApacheFlex\dependencies\FlashPlayer_Debug\flashplayer11_1r102_55_win_s
>>a_debug_32bit.exe
>>C:\jenkins_slave\workspace\flex-sdk_mustella\mustella\tests\resources\Res
>>ourceManager\SWFs\ResourceManagerApp.swf
>>      [java] USING directory:
>>C:\jenkins_slave\workspace\flex-sdk_mustella\mustella\tests\resources\Res
>>ourceManager\SWFs
>>      [java] time: 09:47:11.463
>>      [java] SCRIPTDONE! 09:47:14.380
>>      [java] GET /ScriptComplete?0 HTTP/1.1
>>      [java] Before Wait loop 09:47:14.380 waiting = 0
>>      [java] After Wait loop 09:47:14.380 waiting = 0
>>      [java] clobberProcess false
>>      [java] Total Results so far: 4
>>      [java] Grab log, do parse = false
>>      [java] waited 2000
>>      [java] ClobberProcess, it was already null
>>      [java] Grabbing the log from:
>>C:\Users\ApacheFlex\AppData/Roaming\Macromedia/Flash
>>Player/Logs/flashlog.txt to:
>>C:\jenkins_slave\workspace\flex-sdk_mustella\mustella\tests\resources\Res
>>ourceManager\SWFs\ResourceManagerApp.log
>>      [java] at the end of main
>>      [java] Shutting down the results server
>>      [java] shutting down the baseline server
>>      [java] done waiting for results...bye
>>      [java] =====================================================
>>      [java]     Passes: 3
>>      [java]     Fails: 1
>>      [java] =====================================================
>>      [java]
>>      [java] =====================================================
>>      [java] =====================================================
>>      [java]     Passed:
>>      [java] =====================================================
>>      [java]
>>containers/Accordion/Styles/Accordion_SkinStates_Basic_Spark
>>Accordion_Styles_SkinStates_runtime_SWF_mouseDown_NonselectedTab Passed
>>      [java] itemRenderers/Halo/List/test_scripts/List_itemRenderer
>>DateFieldRenderer_Scrolling Passed
>>      [java]
>>resources/ResourceManager/Integration/ResourceManager_Integration_UICompo
>>nent_resourcesChanged
>>ResourceManager_Integration_UIComponent_resourcesChanged_localeChain
>>Passed
>>      [java] =====================================================
>>      [java]     Failed:
>>      [java] =====================================================
>>      [java]
>>Managers/StyleManager/SparkStyles/globalSelectors/GlobalStyles_mxmlOverri
>>de_tester GlobalStyles_MxmlOverride_focusColor Failed
>>CompareBitmap(body:step 4)  compare returned[object BitmapData]
>>      [java]
>>      [java]
>>      [java] =====================================================
>>      [java]     Passes: 3
>>      [java]     Fails: 1
>>      [java] =====================================================
>>      [java]
>>      [java]
>>      [java] Wrote summary to results.txt
>>      [java] Wrote failures to failures.txt
>>
>> BUILD FAILED
>> C:\jenkins_slave\workspace\flex-sdk_mustella\mustella\build.xml:1538:
>>The following error occurred while executing this line:
>> C:\jenkins_slave\workspace\flex-sdk_mustella\mustella\build.xml:1656:
>>Java returned: 1
>>
>> Total time: 1 minute 27 seconds
>>
>>
>>
>> ============ JENKINS MUSTELLA RUN REPORT ============
>>
>> Date and time: 09-17-2013 14:47
>>
>> Settings:
>> player.version = 11.1
>> air.version = 3.7
>> FLASHPLAYER_DEBUGGER =
>>C:\ApacheFlex\dependencies\FlashPlayer_Debug\flashplayer11_1r102_55_win_s
>>a_debug_32bit.exe
>> AIR_HOME = C:\ApacheFlex\dependencies\AdobeAIRSDK\3.7
>>
>> Build:
>>   type = main
>>   command = -timeout=60000
>>   set = -all
>>
>> Log:
>> - Made Cygwin ignore carriage returns
>> - Cleaned up 'local.properties' files from previous runs
>> - Set FLASH_VERSION to '11.1' and AIR_VERSION to '3.7'
>> - Set AIR_HOME to 'C:\ApacheFlex\dependencies\AdobeAIRSDK\3.7'
>> - Set FLASHPLAYER_DEBUGGER to
>>'C:\ApacheFlex\dependencies\FlashPlayer_Debug\flashplayer11_1r102_55_win_
>>sa_debug_32bit.exe'
>> - Ran 'clean', 'main' and 'other.locales' ant targets to prepare the
>>SDK for testing
>> - Ran Mustella on the SDK with these parameters: '-timeout=60000 -all'
>> - Some tests failed: running '-failures'
>> - Some of tests failed, even after running '-failures'...
>>
>>
>> =====================================================
>>
>>
>>
>> Build step 'Execute shell' marked build as failure
>
>
>
>--
>Ix Multimedia Software
>
>Jan Luykenstraat 27
>3521 VB Utrecht
>
>T. 06-51952295
>I. www.ixsoftware.nl


Re: Build failed in Jenkins: flex-sdk_mustella #311

Posted by Erik de Bruin <er...@ixsoftware.nl>.
"Managers/StyleManager/SparkStyles/globalSelectors/GlobalStyles_mxmlOverride_tester
GlobalStyles_MxmlOverride_focusColor Failed CompareBitmap(body:step 4)
 compare returned[object BitmapData]"

Anyone have any idea why that may be failing? This is just the first
run in which it fails, so nobody panic, but if anyone made change that
may cause this, please re-check and re-test your code, just to be
safe.

Thanks,

EdB



On Tue, Sep 17, 2013 at 4:47 PM,  <fl...@gmail.com> wrote:
> See <http://localhost:8080/job/flex-sdk_mustella/311/changes>
>
> Changes:
>
> [jmclean] Update release notes
>
> [jmclean] FLEX-33728 added access to imageDecodingPolicy
>
> [jmclean] FLEX-33728 fixed so compiles and all supported version of flash and chache first answer
>
> [jmclean] FLEX-33722 stop RTE when dragging a spark datagrid column
>
> ------------------------------------------
> [...truncated 85871 lines...]
> shells:
>      [exec] next: pre_compile.sh 0
>      [exec] next: pre_compile.sh 1
>      [exec] next: pre_compile.sh 2
>      [exec] done with pre compile step
>      [java] exclude_filename: C:/jenkins_slave/workspace/flex-sdk_mustella/mustella/tests/ExcludeListWin.txt
>      [java] os_version: ${os_version}
>      [java] target_os_name: windows
>      [java] device_name: ${device_name}
>      [java] result_include: -includes=SendResultsToRunner
>      [java] Choosing local runner bitmap save
>      [java] Choosing local runner bitmap save
>      [java] Choosing local runner bitmap save
>      [java] Choosing local runner bitmap save
>      [java] okey doke, going to compile C:\jenkins_slave\workspace\flex-sdk_mustella\mustella\tests\Managers\StyleManager\SparkStyles\SWFs\SparkStyles_Globals_mxml.mxml
>      [java] okey doke, going to compile C:\jenkins_slave\workspace\flex-sdk_mustella\mustella\tests\itemRenderers\Halo\List\SWFs\List_itemRendererTests.mxml
>      [java] okey doke, going to compile C:\jenkins_slave\workspace\flex-sdk_mustella\mustella\tests\containers\Accordion\SWFs\Accordion_InContainer_Spark.mxml
>      [java] okey doke, going to compile C:\jenkins_slave\workspace\flex-sdk_mustella\mustella\tests\resources\ResourceManager\SWFs\ResourceManagerApp.mxml
>      [java] Loading configuration file C:\jenkins_slave\workspace\flex-sdk_mustella\frameworks\flex-config.xml
>      [java] Loading configuration file C:\jenkins_slave\workspace\flex-sdk_mustella\frameworks\flex-config.xml
>      [java] Loading configuration file C:\jenkins_slave\workspace\flex-sdk_mustella\frameworks\flex-config.xml
>      [java] Loading configuration file C:\jenkins_slave\workspace\flex-sdk_mustella\frameworks\flex-config.xml
>      [java] C:\jenkins_slave\workspace\flex-sdk_mustella\mustella\tests\resources\ResourceManager\SWFs\ResourceManagerApp.swf (737934 bytes)
>      [java] Choosing local runner bitmap save
>      [java] okey doke, going to compile C:\jenkins_slave\workspace\flex-sdk_mustella\mustella\tests\gumbo\components\Application\SWFs\Application_Properties_App1.mxml
>      [java] Loading configuration file C:\jenkins_slave\workspace\flex-sdk_mustella\frameworks\flex-config.xml
>      [java] C:\jenkins_slave\workspace\flex-sdk_mustella\mustella\tests\itemRenderers\Halo\List\SWFs\List_itemRendererTests.swf (1185630 bytes)
>      [java] nothing left to do
>      [java] C:\jenkins_slave\workspace\flex-sdk_mustella\mustella\tests\containers\Accordion\SWFs\Accordion_InContainer_Spark.swf (1449154 bytes)
>      [java] C:\jenkins_slave\workspace\flex-sdk_mustella\mustella\tests\Managers\StyleManager\SparkStyles\SWFs\SparkStyles_Globals_mxml.mxml(80): Warning: The CSS type selector 'spark.components.TextArea' was not processed, because the type was not used in the application.
>      [java]
>      [java]         s|TextArea, s|Panel {
>      [java]
>      [java] C:\jenkins_slave\workspace\flex-sdk_mustella\mustella\tests\Managers\StyleManager\SparkStyles\SWFs\SparkStyles_Globals_mxml.swf (2205119 bytes)
>      [java] All done with the compile
>      [java] leaving the compile, elapsed: 18
>      [java] ...via exit
>      [echo] compileswfs jreturn is 0
>  [loadfile] C:\jenkins_slave\workspace\flex-sdk_mustella\mustella\local.properties doesn't exist
>
> do_fail:
>
> compileswfs:
>
> getExcludes:
>
> getExcludeIds:
>
> populateExcludeTable:
>      [echo] populate exclude, got this for db time: 2013/09/17 09:45:56
>
> justrun:
>  [loadfile] C:\jenkins_slave\workspace\flex-sdk_mustella\mustella\local.properties doesn't exist
>
> delete_cache:
>      [echo] delete cache: /Users/ApacheFlex/Library/Caches/Adobe/Flash Player/AssetCache
>  [loadfile] C:\jenkins_slave\workspace\flex-sdk_mustella\mustella\local.properties doesn't exist
>
> delete_cache:
>      [echo] delete cache: /Users/ApacheFlex/AppData/Roaming/Adobe/Flash Player/AssetCache
>    [delete] Deleting directory C:\Users\ApacheFlex\AppData\Roaming\Adobe\Flash Player\AssetCache\94ELK3V4
>    [delete] Deleting directory C:\Users\ApacheFlex\AppData\Roaming\Adobe\Flash Player\AssetCache
>  [loadfile] C:\jenkins_slave\workspace\flex-sdk_mustella\mustella\local.properties doesn't exist
>
> delete_cache:
>      [echo] delete cache: C:\Users\ApacheFlex/Application Data/Adobe/Flash Player/AssetCache
>  [loadfile] C:\jenkins_slave\workspace\flex-sdk_mustella\mustella\local.properties doesn't exist
>
> android_runner:
>
> ios_runner:
>
> qnx_runner:
>
> desktop_runner:
>      [echo] **** Willkommen auf Runner ****
>      [java] starting results server
>      [java] starting baseline server
>      [java] test script count: 4
>      [java] starting the baseline server: Tue Sep 17 09:46:53 ACT 2013
>      [java] new test file: C:\jenkins_slave\workspace\flex-sdk_mustella\mustella\tests\Managers\StyleManager\SparkStyles\SWFs\SparkStyles_Globals_mxml.swf
>      [java] ******** cmdArr before:
>      [java]     C:\ApacheFlex\dependencies\FlashPlayer_Debug\flashplayer11_1r102_55_win_sa_debug_32bit.exe
>      [java]     C:\jenkins_slave\workspace\flex-sdk_mustella\mustella\tests\Managers\StyleManager\SparkStyles\SWFs\SparkStyles_Globals_mxml.swf
>      [java] ******** moreParameters before:
>      [java] ******** cmdArr after:
>      [java]     C:\ApacheFlex\dependencies\FlashPlayer_Debug\flashplayer11_1r102_55_win_sa_debug_32bit.exe
>      [java]     C:\jenkins_slave\workspace\flex-sdk_mustella\mustella\tests\Managers\StyleManager\SparkStyles\SWFs\SparkStyles_Globals_mxml.swf
>      [java] getting directory from the swf file
>      [java] derived directory: C:\jenkins_slave\workspace\flex-sdk_mustella\mustella\tests\Managers\StyleManager\SparkStyles\SWFs
>      [java] Launching:
>      [java]  C:\ApacheFlex\dependencies\FlashPlayer_Debug\flashplayer11_1r102_55_win_sa_debug_32bit.exe C:\jenkins_slave\workspace\flex-sdk_mustella\mustella\tests\Managers\StyleManager\SparkStyles\SWFs\SparkStyles_Globals_mxml.swf Launching: C:\ApacheFlex\dependencies\FlashPlayer_Debug\flashplayer11_1r102_55_win_sa_debug_32bit.exe C:\jenkins_slave\workspace\flex-sdk_mustella\mustella\tests\Managers\StyleManager\SparkStyles\SWFs\SparkStyles_Globals_mxml.swf
>      [java] USING directory: C:\jenkins_slave\workspace\flex-sdk_mustella\mustella\tests\Managers\StyleManager\SparkStyles\SWFs
>      [java] time: 09:46:53.137
>      [java] Wrote file: c:/jenkins_slave/workspace/flex-sdk_mustella/mustella/tests/Managers/StyleManager/SparkStyles/SWFs/../globalSelectors/baselines/GlobalStyles_MxmlOverride_focusColor.png.bad.png length: 2613
>      [java] FAIL: Managers/StyleManager/SparkStyles/globalSelectors/GlobalStyles_mxmlOverride_tester GlobalStyles_MxmlOverride_focusColor
>      [java] SCRIPTDONE! 09:46:57.054
>      [java] GET /ScriptComplete?0 HTTP/1.1
>      [java] Before Wait loop 09:46:57.054 waiting = 0
>      [java] After Wait loop 09:46:57.054 waiting = 0
>      [java] clobberProcess false
>      [java] Total Results so far: 1
>      [java] waited 2000
>      [java] ClobberProcess, it was already null
>      [java] Grab log, do parse = false
>      [java] Grabbing the log from: C:\Users\ApacheFlex\AppData/Roaming\Macromedia/Flash Player/Logs/flashlog.txt to: C:\jenkins_slave\workspace\flex-sdk_mustella\mustella\tests\Managers\StyleManager\SparkStyles\SWFs\SparkStyles_Globals_mxml.log
>      [java] new test file: C:\jenkins_slave\workspace\flex-sdk_mustella\mustella\tests\containers\Accordion\SWFs\Accordion_InContainer_Spark.swf
>      [java] ******** cmdArr before:
>      [java]     C:\ApacheFlex\dependencies\FlashPlayer_Debug\flashplayer11_1r102_55_win_sa_debug_32bit.exe
>      [java]     C:\jenkins_slave\workspace\flex-sdk_mustella\mustella\tests\containers\Accordion\SWFs\Accordion_InContainer_Spark.swf
>      [java] ******** moreParameters before:
>      [java] ******** cmdArr after:
>      [java]     C:\ApacheFlex\dependencies\FlashPlayer_Debug\flashplayer11_1r102_55_win_sa_debug_32bit.exe
>      [java]     C:\jenkins_slave\workspace\flex-sdk_mustella\mustella\tests\containers\Accordion\SWFs\Accordion_InContainer_Spark.swf
>      [java] getting directory from the swf file
>      [java] derived directory: C:\jenkins_slave\workspace\flex-sdk_mustella\mustella\tests\containers\Accordion\SWFs
>      [java] Launching:
>      [java]  C:\ApacheFlex\dependencies\FlashPlayer_Debug\flashplayer11_1r102_55_win_sa_debug_32bit.exe C:\jenkins_slave\workspace\flex-sdk_mustella\mustella\tests\containers\Accordion\SWFs\Accordion_InContainer_Spark.swf Launching: C:\ApacheFlex\dependencies\FlashPlayer_Debug\flashplayer11_1r102_55_win_sa_debug_32bit.exe C:\jenkins_slave\workspace\flex-sdk_mustella\mustella\tests\containers\Accordion\SWFs\Accordion_InContainer_Spark.swf
>      [java] USING directory: C:\jenkins_slave\workspace\flex-sdk_mustella\mustella\tests\containers\Accordion\SWFs
>      [java] time: 09:46:59.397
>      [java] SCRIPTDONE! 09:47:03.080
>      [java] GET /ScriptComplete?0 HTTP/1.1
>      [java] Before Wait loop 09:47:03.080 waiting = 0
>      [java] After Wait loop 09:47:03.080 waiting = 0
>      [java] clobberProcess false
>      [java] Total Results so far: 2
>      [java] Grab log, do parse = false
>      [java] Grabbing the log from: C:\Users\ApacheFlex\AppData/Roaming\Macromedia/Flash Player/Logs/flashlog.txt to: C:\jenkins_slave\workspace\flex-sdk_mustella\mustella\tests\containers\Accordion\SWFs\Accordion_InContainer_Spark.log
>      [java] waited 2000
>      [java] ClobberProcess, it was already null
>      [java] new test file: C:\jenkins_slave\workspace\flex-sdk_mustella\mustella\tests\itemRenderers\Halo\List\SWFs\List_itemRendererTests.swf
>      [java] ******** cmdArr before:
>      [java]     C:\ApacheFlex\dependencies\FlashPlayer_Debug\flashplayer11_1r102_55_win_sa_debug_32bit.exe
>      [java]     C:\jenkins_slave\workspace\flex-sdk_mustella\mustella\tests\itemRenderers\Halo\List\SWFs\List_itemRendererTests.swf
>      [java] ******** moreParameters before:
>      [java] ******** cmdArr after:
>      [java]     C:\ApacheFlex\dependencies\FlashPlayer_Debug\flashplayer11_1r102_55_win_sa_debug_32bit.exe
>      [java]     C:\jenkins_slave\workspace\flex-sdk_mustella\mustella\tests\itemRenderers\Halo\List\SWFs\List_itemRendererTests.swf
>      [java] getting directory from the swf file
>      [java] derived directory: C:\jenkins_slave\workspace\flex-sdk_mustella\mustella\tests\itemRenderers\Halo\List\SWFs
>      [java] Launching:
>      [java]  C:\ApacheFlex\dependencies\FlashPlayer_Debug\flashplayer11_1r102_55_win_sa_debug_32bit.exe C:\jenkins_slave\workspace\flex-sdk_mustella\mustella\tests\itemRenderers\Halo\List\SWFs\List_itemRendererTests.swf Launching: C:\ApacheFlex\dependencies\FlashPlayer_Debug\flashplayer11_1r102_55_win_sa_debug_32bit.exe C:\jenkins_slave\workspace\flex-sdk_mustella\mustella\tests\itemRenderers\Halo\List\SWFs\List_itemRendererTests.swf
>      [java] USING directory: C:\jenkins_slave\workspace\flex-sdk_mustella\mustella\tests\itemRenderers\Halo\List\SWFs
>      [java] time: 09:47:05.416
>      [java] SCRIPTDONE! 09:47:09.144
>      [java] GET /ScriptComplete?0 HTTP/1.1
>      [java] Before Wait loop 09:47:09.144 waiting = 0
>      [java] After Wait loop 09:47:09.144 waiting = 0
>      [java] clobberProcess false
>      [java] Total Results so far: 3
>      [java] waited 2000
>      [java] ClobberProcess, it was already null
>      [java] Grab log, do parse = false
>      [java] Grabbing the log from: C:\Users\ApacheFlex\AppData/Roaming\Macromedia/Flash Player/Logs/flashlog.txt to: C:\jenkins_slave\workspace\flex-sdk_mustella\mustella\tests\itemRenderers\Halo\List\SWFs\List_itemRendererTests.log
>      [java] new test file: C:\jenkins_slave\workspace\flex-sdk_mustella\mustella\tests\resources\ResourceManager\SWFs\ResourceManagerApp.swf
>      [java] ******** cmdArr before:
>      [java]     C:\ApacheFlex\dependencies\FlashPlayer_Debug\flashplayer11_1r102_55_win_sa_debug_32bit.exe
>      [java]     C:\jenkins_slave\workspace\flex-sdk_mustella\mustella\tests\resources\ResourceManager\SWFs\ResourceManagerApp.swf
>      [java] ******** moreParameters before:
>      [java] ******** cmdArr after:
>      [java]     C:\ApacheFlex\dependencies\FlashPlayer_Debug\flashplayer11_1r102_55_win_sa_debug_32bit.exe
>      [java]     C:\jenkins_slave\workspace\flex-sdk_mustella\mustella\tests\resources\ResourceManager\SWFs\ResourceManagerApp.swf
>      [java] getting directory from the swf file
>      [java] derived directory: C:\jenkins_slave\workspace\flex-sdk_mustella\mustella\tests\resources\ResourceManager\SWFs
>      [java] Launching:
>      [java]  C:\ApacheFlex\dependencies\FlashPlayer_Debug\flashplayer11_1r102_55_win_sa_debug_32bit.exe C:\jenkins_slave\workspace\flex-sdk_mustella\mustella\tests\resources\ResourceManager\SWFs\ResourceManagerApp.swf Launching: C:\ApacheFlex\dependencies\FlashPlayer_Debug\flashplayer11_1r102_55_win_sa_debug_32bit.exe C:\jenkins_slave\workspace\flex-sdk_mustella\mustella\tests\resources\ResourceManager\SWFs\ResourceManagerApp.swf
>      [java] USING directory: C:\jenkins_slave\workspace\flex-sdk_mustella\mustella\tests\resources\ResourceManager\SWFs
>      [java] time: 09:47:11.463
>      [java] SCRIPTDONE! 09:47:14.380
>      [java] GET /ScriptComplete?0 HTTP/1.1
>      [java] Before Wait loop 09:47:14.380 waiting = 0
>      [java] After Wait loop 09:47:14.380 waiting = 0
>      [java] clobberProcess false
>      [java] Total Results so far: 4
>      [java] Grab log, do parse = false
>      [java] waited 2000
>      [java] ClobberProcess, it was already null
>      [java] Grabbing the log from: C:\Users\ApacheFlex\AppData/Roaming\Macromedia/Flash Player/Logs/flashlog.txt to: C:\jenkins_slave\workspace\flex-sdk_mustella\mustella\tests\resources\ResourceManager\SWFs\ResourceManagerApp.log
>      [java] at the end of main
>      [java] Shutting down the results server
>      [java] shutting down the baseline server
>      [java] done waiting for results...bye
>      [java] =====================================================
>      [java]     Passes: 3
>      [java]     Fails: 1
>      [java] =====================================================
>      [java]
>      [java] =====================================================
>      [java] =====================================================
>      [java]     Passed:
>      [java] =====================================================
>      [java] containers/Accordion/Styles/Accordion_SkinStates_Basic_Spark Accordion_Styles_SkinStates_runtime_SWF_mouseDown_NonselectedTab Passed
>      [java] itemRenderers/Halo/List/test_scripts/List_itemRenderer DateFieldRenderer_Scrolling Passed
>      [java] resources/ResourceManager/Integration/ResourceManager_Integration_UIComponent_resourcesChanged ResourceManager_Integration_UIComponent_resourcesChanged_localeChain Passed
>      [java] =====================================================
>      [java]     Failed:
>      [java] =====================================================
>      [java] Managers/StyleManager/SparkStyles/globalSelectors/GlobalStyles_mxmlOverride_tester GlobalStyles_MxmlOverride_focusColor Failed CompareBitmap(body:step 4)  compare returned[object BitmapData]
>      [java]
>      [java]
>      [java] =====================================================
>      [java]     Passes: 3
>      [java]     Fails: 1
>      [java] =====================================================
>      [java]
>      [java]
>      [java] Wrote summary to results.txt
>      [java] Wrote failures to failures.txt
>
> BUILD FAILED
> C:\jenkins_slave\workspace\flex-sdk_mustella\mustella\build.xml:1538: The following error occurred while executing this line:
> C:\jenkins_slave\workspace\flex-sdk_mustella\mustella\build.xml:1656: Java returned: 1
>
> Total time: 1 minute 27 seconds
>
>
>
> ============ JENKINS MUSTELLA RUN REPORT ============
>
> Date and time: 09-17-2013 14:47
>
> Settings:
> player.version = 11.1
> air.version = 3.7
> FLASHPLAYER_DEBUGGER = C:\ApacheFlex\dependencies\FlashPlayer_Debug\flashplayer11_1r102_55_win_sa_debug_32bit.exe
> AIR_HOME = C:\ApacheFlex\dependencies\AdobeAIRSDK\3.7
>
> Build:
>   type = main
>   command = -timeout=60000
>   set = -all
>
> Log:
> - Made Cygwin ignore carriage returns
> - Cleaned up 'local.properties' files from previous runs
> - Set FLASH_VERSION to '11.1' and AIR_VERSION to '3.7'
> - Set AIR_HOME to 'C:\ApacheFlex\dependencies\AdobeAIRSDK\3.7'
> - Set FLASHPLAYER_DEBUGGER to 'C:\ApacheFlex\dependencies\FlashPlayer_Debug\flashplayer11_1r102_55_win_sa_debug_32bit.exe'
> - Ran 'clean', 'main' and 'other.locales' ant targets to prepare the SDK for testing
> - Ran Mustella on the SDK with these parameters: '-timeout=60000 -all'
> - Some tests failed: running '-failures'
> - Some of tests failed, even after running '-failures'...
>
>
> =====================================================
>
>
>
> Build step 'Execute shell' marked build as failure



-- 
Ix Multimedia Software

Jan Luykenstraat 27
3521 VB Utrecht

T. 06-51952295
I. www.ixsoftware.nl

Re: Build failed in Jenkins: flex-sdk_mustella #311

Posted by Erik de Bruin <er...@ixsoftware.nl>.
"Managers/StyleManager/SparkStyles/globalSelectors/GlobalStyles_mxmlOverride_tester
GlobalStyles_MxmlOverride_focusColor Failed CompareBitmap(body:step 4)
 compare returned[object BitmapData]"

Anyone have any idea why that may be failing? This is just the first
run in which it fails, so nobody panic, but if anyone made change that
may cause this, please re-check and re-test your code, just to be
safe.

Thanks,

EdB



On Tue, Sep 17, 2013 at 4:47 PM,  <fl...@gmail.com> wrote:
> See <http://localhost:8080/job/flex-sdk_mustella/311/changes>
>
> Changes:
>
> [jmclean] Update release notes
>
> [jmclean] FLEX-33728 added access to imageDecodingPolicy
>
> [jmclean] FLEX-33728 fixed so compiles and all supported version of flash and chache first answer
>
> [jmclean] FLEX-33722 stop RTE when dragging a spark datagrid column
>
> ------------------------------------------
> [...truncated 85871 lines...]
> shells:
>      [exec] next: pre_compile.sh 0
>      [exec] next: pre_compile.sh 1
>      [exec] next: pre_compile.sh 2
>      [exec] done with pre compile step
>      [java] exclude_filename: C:/jenkins_slave/workspace/flex-sdk_mustella/mustella/tests/ExcludeListWin.txt
>      [java] os_version: ${os_version}
>      [java] target_os_name: windows
>      [java] device_name: ${device_name}
>      [java] result_include: -includes=SendResultsToRunner
>      [java] Choosing local runner bitmap save
>      [java] Choosing local runner bitmap save
>      [java] Choosing local runner bitmap save
>      [java] Choosing local runner bitmap save
>      [java] okey doke, going to compile C:\jenkins_slave\workspace\flex-sdk_mustella\mustella\tests\Managers\StyleManager\SparkStyles\SWFs\SparkStyles_Globals_mxml.mxml
>      [java] okey doke, going to compile C:\jenkins_slave\workspace\flex-sdk_mustella\mustella\tests\itemRenderers\Halo\List\SWFs\List_itemRendererTests.mxml
>      [java] okey doke, going to compile C:\jenkins_slave\workspace\flex-sdk_mustella\mustella\tests\containers\Accordion\SWFs\Accordion_InContainer_Spark.mxml
>      [java] okey doke, going to compile C:\jenkins_slave\workspace\flex-sdk_mustella\mustella\tests\resources\ResourceManager\SWFs\ResourceManagerApp.mxml
>      [java] Loading configuration file C:\jenkins_slave\workspace\flex-sdk_mustella\frameworks\flex-config.xml
>      [java] Loading configuration file C:\jenkins_slave\workspace\flex-sdk_mustella\frameworks\flex-config.xml
>      [java] Loading configuration file C:\jenkins_slave\workspace\flex-sdk_mustella\frameworks\flex-config.xml
>      [java] Loading configuration file C:\jenkins_slave\workspace\flex-sdk_mustella\frameworks\flex-config.xml
>      [java] C:\jenkins_slave\workspace\flex-sdk_mustella\mustella\tests\resources\ResourceManager\SWFs\ResourceManagerApp.swf (737934 bytes)
>      [java] Choosing local runner bitmap save
>      [java] okey doke, going to compile C:\jenkins_slave\workspace\flex-sdk_mustella\mustella\tests\gumbo\components\Application\SWFs\Application_Properties_App1.mxml
>      [java] Loading configuration file C:\jenkins_slave\workspace\flex-sdk_mustella\frameworks\flex-config.xml
>      [java] C:\jenkins_slave\workspace\flex-sdk_mustella\mustella\tests\itemRenderers\Halo\List\SWFs\List_itemRendererTests.swf (1185630 bytes)
>      [java] nothing left to do
>      [java] C:\jenkins_slave\workspace\flex-sdk_mustella\mustella\tests\containers\Accordion\SWFs\Accordion_InContainer_Spark.swf (1449154 bytes)
>      [java] C:\jenkins_slave\workspace\flex-sdk_mustella\mustella\tests\Managers\StyleManager\SparkStyles\SWFs\SparkStyles_Globals_mxml.mxml(80): Warning: The CSS type selector 'spark.components.TextArea' was not processed, because the type was not used in the application.
>      [java]
>      [java]         s|TextArea, s|Panel {
>      [java]
>      [java] C:\jenkins_slave\workspace\flex-sdk_mustella\mustella\tests\Managers\StyleManager\SparkStyles\SWFs\SparkStyles_Globals_mxml.swf (2205119 bytes)
>      [java] All done with the compile
>      [java] leaving the compile, elapsed: 18
>      [java] ...via exit
>      [echo] compileswfs jreturn is 0
>  [loadfile] C:\jenkins_slave\workspace\flex-sdk_mustella\mustella\local.properties doesn't exist
>
> do_fail:
>
> compileswfs:
>
> getExcludes:
>
> getExcludeIds:
>
> populateExcludeTable:
>      [echo] populate exclude, got this for db time: 2013/09/17 09:45:56
>
> justrun:
>  [loadfile] C:\jenkins_slave\workspace\flex-sdk_mustella\mustella\local.properties doesn't exist
>
> delete_cache:
>      [echo] delete cache: /Users/ApacheFlex/Library/Caches/Adobe/Flash Player/AssetCache
>  [loadfile] C:\jenkins_slave\workspace\flex-sdk_mustella\mustella\local.properties doesn't exist
>
> delete_cache:
>      [echo] delete cache: /Users/ApacheFlex/AppData/Roaming/Adobe/Flash Player/AssetCache
>    [delete] Deleting directory C:\Users\ApacheFlex\AppData\Roaming\Adobe\Flash Player\AssetCache\94ELK3V4
>    [delete] Deleting directory C:\Users\ApacheFlex\AppData\Roaming\Adobe\Flash Player\AssetCache
>  [loadfile] C:\jenkins_slave\workspace\flex-sdk_mustella\mustella\local.properties doesn't exist
>
> delete_cache:
>      [echo] delete cache: C:\Users\ApacheFlex/Application Data/Adobe/Flash Player/AssetCache
>  [loadfile] C:\jenkins_slave\workspace\flex-sdk_mustella\mustella\local.properties doesn't exist
>
> android_runner:
>
> ios_runner:
>
> qnx_runner:
>
> desktop_runner:
>      [echo] **** Willkommen auf Runner ****
>      [java] starting results server
>      [java] starting baseline server
>      [java] test script count: 4
>      [java] starting the baseline server: Tue Sep 17 09:46:53 ACT 2013
>      [java] new test file: C:\jenkins_slave\workspace\flex-sdk_mustella\mustella\tests\Managers\StyleManager\SparkStyles\SWFs\SparkStyles_Globals_mxml.swf
>      [java] ******** cmdArr before:
>      [java]     C:\ApacheFlex\dependencies\FlashPlayer_Debug\flashplayer11_1r102_55_win_sa_debug_32bit.exe
>      [java]     C:\jenkins_slave\workspace\flex-sdk_mustella\mustella\tests\Managers\StyleManager\SparkStyles\SWFs\SparkStyles_Globals_mxml.swf
>      [java] ******** moreParameters before:
>      [java] ******** cmdArr after:
>      [java]     C:\ApacheFlex\dependencies\FlashPlayer_Debug\flashplayer11_1r102_55_win_sa_debug_32bit.exe
>      [java]     C:\jenkins_slave\workspace\flex-sdk_mustella\mustella\tests\Managers\StyleManager\SparkStyles\SWFs\SparkStyles_Globals_mxml.swf
>      [java] getting directory from the swf file
>      [java] derived directory: C:\jenkins_slave\workspace\flex-sdk_mustella\mustella\tests\Managers\StyleManager\SparkStyles\SWFs
>      [java] Launching:
>      [java]  C:\ApacheFlex\dependencies\FlashPlayer_Debug\flashplayer11_1r102_55_win_sa_debug_32bit.exe C:\jenkins_slave\workspace\flex-sdk_mustella\mustella\tests\Managers\StyleManager\SparkStyles\SWFs\SparkStyles_Globals_mxml.swf Launching: C:\ApacheFlex\dependencies\FlashPlayer_Debug\flashplayer11_1r102_55_win_sa_debug_32bit.exe C:\jenkins_slave\workspace\flex-sdk_mustella\mustella\tests\Managers\StyleManager\SparkStyles\SWFs\SparkStyles_Globals_mxml.swf
>      [java] USING directory: C:\jenkins_slave\workspace\flex-sdk_mustella\mustella\tests\Managers\StyleManager\SparkStyles\SWFs
>      [java] time: 09:46:53.137
>      [java] Wrote file: c:/jenkins_slave/workspace/flex-sdk_mustella/mustella/tests/Managers/StyleManager/SparkStyles/SWFs/../globalSelectors/baselines/GlobalStyles_MxmlOverride_focusColor.png.bad.png length: 2613
>      [java] FAIL: Managers/StyleManager/SparkStyles/globalSelectors/GlobalStyles_mxmlOverride_tester GlobalStyles_MxmlOverride_focusColor
>      [java] SCRIPTDONE! 09:46:57.054
>      [java] GET /ScriptComplete?0 HTTP/1.1
>      [java] Before Wait loop 09:46:57.054 waiting = 0
>      [java] After Wait loop 09:46:57.054 waiting = 0
>      [java] clobberProcess false
>      [java] Total Results so far: 1
>      [java] waited 2000
>      [java] ClobberProcess, it was already null
>      [java] Grab log, do parse = false
>      [java] Grabbing the log from: C:\Users\ApacheFlex\AppData/Roaming\Macromedia/Flash Player/Logs/flashlog.txt to: C:\jenkins_slave\workspace\flex-sdk_mustella\mustella\tests\Managers\StyleManager\SparkStyles\SWFs\SparkStyles_Globals_mxml.log
>      [java] new test file: C:\jenkins_slave\workspace\flex-sdk_mustella\mustella\tests\containers\Accordion\SWFs\Accordion_InContainer_Spark.swf
>      [java] ******** cmdArr before:
>      [java]     C:\ApacheFlex\dependencies\FlashPlayer_Debug\flashplayer11_1r102_55_win_sa_debug_32bit.exe
>      [java]     C:\jenkins_slave\workspace\flex-sdk_mustella\mustella\tests\containers\Accordion\SWFs\Accordion_InContainer_Spark.swf
>      [java] ******** moreParameters before:
>      [java] ******** cmdArr after:
>      [java]     C:\ApacheFlex\dependencies\FlashPlayer_Debug\flashplayer11_1r102_55_win_sa_debug_32bit.exe
>      [java]     C:\jenkins_slave\workspace\flex-sdk_mustella\mustella\tests\containers\Accordion\SWFs\Accordion_InContainer_Spark.swf
>      [java] getting directory from the swf file
>      [java] derived directory: C:\jenkins_slave\workspace\flex-sdk_mustella\mustella\tests\containers\Accordion\SWFs
>      [java] Launching:
>      [java]  C:\ApacheFlex\dependencies\FlashPlayer_Debug\flashplayer11_1r102_55_win_sa_debug_32bit.exe C:\jenkins_slave\workspace\flex-sdk_mustella\mustella\tests\containers\Accordion\SWFs\Accordion_InContainer_Spark.swf Launching: C:\ApacheFlex\dependencies\FlashPlayer_Debug\flashplayer11_1r102_55_win_sa_debug_32bit.exe C:\jenkins_slave\workspace\flex-sdk_mustella\mustella\tests\containers\Accordion\SWFs\Accordion_InContainer_Spark.swf
>      [java] USING directory: C:\jenkins_slave\workspace\flex-sdk_mustella\mustella\tests\containers\Accordion\SWFs
>      [java] time: 09:46:59.397
>      [java] SCRIPTDONE! 09:47:03.080
>      [java] GET /ScriptComplete?0 HTTP/1.1
>      [java] Before Wait loop 09:47:03.080 waiting = 0
>      [java] After Wait loop 09:47:03.080 waiting = 0
>      [java] clobberProcess false
>      [java] Total Results so far: 2
>      [java] Grab log, do parse = false
>      [java] Grabbing the log from: C:\Users\ApacheFlex\AppData/Roaming\Macromedia/Flash Player/Logs/flashlog.txt to: C:\jenkins_slave\workspace\flex-sdk_mustella\mustella\tests\containers\Accordion\SWFs\Accordion_InContainer_Spark.log
>      [java] waited 2000
>      [java] ClobberProcess, it was already null
>      [java] new test file: C:\jenkins_slave\workspace\flex-sdk_mustella\mustella\tests\itemRenderers\Halo\List\SWFs\List_itemRendererTests.swf
>      [java] ******** cmdArr before:
>      [java]     C:\ApacheFlex\dependencies\FlashPlayer_Debug\flashplayer11_1r102_55_win_sa_debug_32bit.exe
>      [java]     C:\jenkins_slave\workspace\flex-sdk_mustella\mustella\tests\itemRenderers\Halo\List\SWFs\List_itemRendererTests.swf
>      [java] ******** moreParameters before:
>      [java] ******** cmdArr after:
>      [java]     C:\ApacheFlex\dependencies\FlashPlayer_Debug\flashplayer11_1r102_55_win_sa_debug_32bit.exe
>      [java]     C:\jenkins_slave\workspace\flex-sdk_mustella\mustella\tests\itemRenderers\Halo\List\SWFs\List_itemRendererTests.swf
>      [java] getting directory from the swf file
>      [java] derived directory: C:\jenkins_slave\workspace\flex-sdk_mustella\mustella\tests\itemRenderers\Halo\List\SWFs
>      [java] Launching:
>      [java]  C:\ApacheFlex\dependencies\FlashPlayer_Debug\flashplayer11_1r102_55_win_sa_debug_32bit.exe C:\jenkins_slave\workspace\flex-sdk_mustella\mustella\tests\itemRenderers\Halo\List\SWFs\List_itemRendererTests.swf Launching: C:\ApacheFlex\dependencies\FlashPlayer_Debug\flashplayer11_1r102_55_win_sa_debug_32bit.exe C:\jenkins_slave\workspace\flex-sdk_mustella\mustella\tests\itemRenderers\Halo\List\SWFs\List_itemRendererTests.swf
>      [java] USING directory: C:\jenkins_slave\workspace\flex-sdk_mustella\mustella\tests\itemRenderers\Halo\List\SWFs
>      [java] time: 09:47:05.416
>      [java] SCRIPTDONE! 09:47:09.144
>      [java] GET /ScriptComplete?0 HTTP/1.1
>      [java] Before Wait loop 09:47:09.144 waiting = 0
>      [java] After Wait loop 09:47:09.144 waiting = 0
>      [java] clobberProcess false
>      [java] Total Results so far: 3
>      [java] waited 2000
>      [java] ClobberProcess, it was already null
>      [java] Grab log, do parse = false
>      [java] Grabbing the log from: C:\Users\ApacheFlex\AppData/Roaming\Macromedia/Flash Player/Logs/flashlog.txt to: C:\jenkins_slave\workspace\flex-sdk_mustella\mustella\tests\itemRenderers\Halo\List\SWFs\List_itemRendererTests.log
>      [java] new test file: C:\jenkins_slave\workspace\flex-sdk_mustella\mustella\tests\resources\ResourceManager\SWFs\ResourceManagerApp.swf
>      [java] ******** cmdArr before:
>      [java]     C:\ApacheFlex\dependencies\FlashPlayer_Debug\flashplayer11_1r102_55_win_sa_debug_32bit.exe
>      [java]     C:\jenkins_slave\workspace\flex-sdk_mustella\mustella\tests\resources\ResourceManager\SWFs\ResourceManagerApp.swf
>      [java] ******** moreParameters before:
>      [java] ******** cmdArr after:
>      [java]     C:\ApacheFlex\dependencies\FlashPlayer_Debug\flashplayer11_1r102_55_win_sa_debug_32bit.exe
>      [java]     C:\jenkins_slave\workspace\flex-sdk_mustella\mustella\tests\resources\ResourceManager\SWFs\ResourceManagerApp.swf
>      [java] getting directory from the swf file
>      [java] derived directory: C:\jenkins_slave\workspace\flex-sdk_mustella\mustella\tests\resources\ResourceManager\SWFs
>      [java] Launching:
>      [java]  C:\ApacheFlex\dependencies\FlashPlayer_Debug\flashplayer11_1r102_55_win_sa_debug_32bit.exe C:\jenkins_slave\workspace\flex-sdk_mustella\mustella\tests\resources\ResourceManager\SWFs\ResourceManagerApp.swf Launching: C:\ApacheFlex\dependencies\FlashPlayer_Debug\flashplayer11_1r102_55_win_sa_debug_32bit.exe C:\jenkins_slave\workspace\flex-sdk_mustella\mustella\tests\resources\ResourceManager\SWFs\ResourceManagerApp.swf
>      [java] USING directory: C:\jenkins_slave\workspace\flex-sdk_mustella\mustella\tests\resources\ResourceManager\SWFs
>      [java] time: 09:47:11.463
>      [java] SCRIPTDONE! 09:47:14.380
>      [java] GET /ScriptComplete?0 HTTP/1.1
>      [java] Before Wait loop 09:47:14.380 waiting = 0
>      [java] After Wait loop 09:47:14.380 waiting = 0
>      [java] clobberProcess false
>      [java] Total Results so far: 4
>      [java] Grab log, do parse = false
>      [java] waited 2000
>      [java] ClobberProcess, it was already null
>      [java] Grabbing the log from: C:\Users\ApacheFlex\AppData/Roaming\Macromedia/Flash Player/Logs/flashlog.txt to: C:\jenkins_slave\workspace\flex-sdk_mustella\mustella\tests\resources\ResourceManager\SWFs\ResourceManagerApp.log
>      [java] at the end of main
>      [java] Shutting down the results server
>      [java] shutting down the baseline server
>      [java] done waiting for results...bye
>      [java] =====================================================
>      [java]     Passes: 3
>      [java]     Fails: 1
>      [java] =====================================================
>      [java]
>      [java] =====================================================
>      [java] =====================================================
>      [java]     Passed:
>      [java] =====================================================
>      [java] containers/Accordion/Styles/Accordion_SkinStates_Basic_Spark Accordion_Styles_SkinStates_runtime_SWF_mouseDown_NonselectedTab Passed
>      [java] itemRenderers/Halo/List/test_scripts/List_itemRenderer DateFieldRenderer_Scrolling Passed
>      [java] resources/ResourceManager/Integration/ResourceManager_Integration_UIComponent_resourcesChanged ResourceManager_Integration_UIComponent_resourcesChanged_localeChain Passed
>      [java] =====================================================
>      [java]     Failed:
>      [java] =====================================================
>      [java] Managers/StyleManager/SparkStyles/globalSelectors/GlobalStyles_mxmlOverride_tester GlobalStyles_MxmlOverride_focusColor Failed CompareBitmap(body:step 4)  compare returned[object BitmapData]
>      [java]
>      [java]
>      [java] =====================================================
>      [java]     Passes: 3
>      [java]     Fails: 1
>      [java] =====================================================
>      [java]
>      [java]
>      [java] Wrote summary to results.txt
>      [java] Wrote failures to failures.txt
>
> BUILD FAILED
> C:\jenkins_slave\workspace\flex-sdk_mustella\mustella\build.xml:1538: The following error occurred while executing this line:
> C:\jenkins_slave\workspace\flex-sdk_mustella\mustella\build.xml:1656: Java returned: 1
>
> Total time: 1 minute 27 seconds
>
>
>
> ============ JENKINS MUSTELLA RUN REPORT ============
>
> Date and time: 09-17-2013 14:47
>
> Settings:
> player.version = 11.1
> air.version = 3.7
> FLASHPLAYER_DEBUGGER = C:\ApacheFlex\dependencies\FlashPlayer_Debug\flashplayer11_1r102_55_win_sa_debug_32bit.exe
> AIR_HOME = C:\ApacheFlex\dependencies\AdobeAIRSDK\3.7
>
> Build:
>   type = main
>   command = -timeout=60000
>   set = -all
>
> Log:
> - Made Cygwin ignore carriage returns
> - Cleaned up 'local.properties' files from previous runs
> - Set FLASH_VERSION to '11.1' and AIR_VERSION to '3.7'
> - Set AIR_HOME to 'C:\ApacheFlex\dependencies\AdobeAIRSDK\3.7'
> - Set FLASHPLAYER_DEBUGGER to 'C:\ApacheFlex\dependencies\FlashPlayer_Debug\flashplayer11_1r102_55_win_sa_debug_32bit.exe'
> - Ran 'clean', 'main' and 'other.locales' ant targets to prepare the SDK for testing
> - Ran Mustella on the SDK with these parameters: '-timeout=60000 -all'
> - Some tests failed: running '-failures'
> - Some of tests failed, even after running '-failures'...
>
>
> =====================================================
>
>
>
> Build step 'Execute shell' marked build as failure



-- 
Ix Multimedia Software

Jan Luykenstraat 27
3521 VB Utrecht

T. 06-51952295
I. www.ixsoftware.nl