You are viewing a plain text version of this content. The canonical link for it is here.
Posted to notifications@maven.apache.org by Apache Jenkins Server <je...@builds.apache.org> on 2018/07/09 21:17:37 UTC
Build failed in Jenkins: Maven TLP » maven-ant-plugin » master #5
See https://builds.apache.org/job/maven-box/job/maven-ant-plugin/job/master/5/
No changes.
No tests ran.
Build log:
Branch indexing
Obtained Jenkinsfile from 06dd38857ffda693a34a48b2781535b1bf7e6ab7
Running in Durability level: MAX_SURVIVABILITY
Loading library jenkins-env@master
Attempting to resolve master from remote references...
> git --version # timeout=10
> git ls-remote -h https://gitbox.apache.org/repos/asf/maven-jenkins-env.git # timeout=10
Found match: refs/heads/master revision c7625b1aa84b6dd6c2d7f9872e19046718b26f6b
> git rev-parse --is-inside-work-tree # timeout=10
Fetching changes from the remote Git repository
> git config remote.origin.url https://gitbox.apache.org/repos/asf/maven-jenkins-env.git # timeout=10
Fetching without tags
Fetching upstream changes from https://gitbox.apache.org/repos/asf/maven-jenkins-env.git
> git --version # timeout=10
> git fetch --no-tags --progress https://gitbox.apache.org/repos/asf/maven-jenkins-env.git +refs/heads/*:refs/remotes/origin/*
Checking out Revision c7625b1aa84b6dd6c2d7f9872e19046718b26f6b (master)
> git config core.sparsecheckout # timeout=10
> git checkout -f c7625b1aa84b6dd6c2d7f9872e19046718b26f6b
Commit message: "Try to fix it."
> git rev-list --no-walk c7625b1aa84b6dd6c2d7f9872e19046718b26f6b # timeout=10
Loading library jenkins-lib@master
Attempting to resolve master from remote references...
> git --version # timeout=10
> git ls-remote -h https://gitbox.apache.org/repos/asf/maven-jenkins-lib.git # timeout=10
Found match: refs/heads/master revision 8c7a5535a63e567b533627e0eb9876799ccd8364
> git rev-parse --is-inside-work-tree # timeout=10
Fetching changes from the remote Git repository
> git config remote.origin.url https://gitbox.apache.org/repos/asf/maven-jenkins-lib.git # timeout=10
Fetching without tags
Fetching upstream changes from https://gitbox.apache.org/repos/asf/maven-jenkins-lib.git
> git --version # timeout=10
> git fetch --no-tags --progress https://gitbox.apache.org/repos/asf/maven-jenkins-lib.git +refs/heads/*:refs/remotes/origin/*
Checking out Revision 8c7a5535a63e567b533627e0eb9876799ccd8364 (master)
> git config core.sparsecheckout # timeout=10
> git checkout -f 8c7a5535a63e567b533627e0eb9876799ccd8364
Commit message: "Disable site plan, doesn't work with multimodules"
> git rev-list --no-walk 8c7a5535a63e567b533627e0eb9876799ccd8364 # timeout=10
[Pipeline] properties
[Pipeline] echo
OS: linux JDK: 7 Maven: 3.x.x => Label: ubuntu JDK: JDK 1.7 (latest) Maven: Maven 3.5.2
[Pipeline] echo
OS: linux JDK: 8 Maven: 3.x.x => Label: ubuntu JDK: JDK 1.8 (latest) Maven: Maven 3.5.2
[Pipeline] echo
OS: linux JDK: 9 Maven: 3.x.x => Label: ubuntu JDK: JDK 1.9 (latest) Maven: Maven 3.5.2
[Pipeline] echo
OS: linux JDK: 10 Maven: 3.x.x => Label: ubuntu JDK: JDK 10 (latest) Maven: Maven 3.5.2
[Pipeline] echo
OS: windows JDK: 7 Maven: 3.x.x => Label: Windows JDK: JDK 1.7 (latest) Maven: Maven 3.5.0 (Windows)
[Pipeline] echo
OS: windows JDK: 8 Maven: 3.x.x => Label: Windows JDK: JDK 1.8 (latest) Maven: Maven 3.5.0 (Windows)
[Pipeline] echo
OS: windows JDK: 9 Maven: 3.x.x => Label: Windows JDK: JDK 1.9 (latest) Maven: Maven 3.5.0 (Windows)
[Pipeline] echo
OS: windows JDK: 10 Maven: 3.x.x => Label: Windows JDK: JDK 10 (latest) Maven: Maven 3.5.0 (Windows)
[Pipeline] parallel
[Pipeline] [linux-jdk7] { (Branch: linux-jdk7)
[Pipeline] [linux-jdk8] { (Branch: linux-jdk8)
[Pipeline] [linux-jdk9] { (Branch: linux-jdk9)
[Pipeline] [linux-jdk10] { (Branch: linux-jdk10)
[Pipeline] [windows-jdk7] { (Branch: windows-jdk7)
[Pipeline] [windows-jdk8] { (Branch: windows-jdk8)
[Pipeline] [windows-jdk9] { (Branch: windows-jdk9)
[Pipeline] [windows-jdk10] { (Branch: windows-jdk10)
[Pipeline] [linux-jdk7] node
[Pipeline] [linux-jdk8] node
[Pipeline] [linux-jdk9] node
[Pipeline] [linux-jdk10] node
[Pipeline] [windows-jdk7] node
[Pipeline] [windows-jdk8] node
[Pipeline] [windows-jdk9] node
[Pipeline] [windows-jdk10] node
[linux-jdk7] Still waiting to schedule task
[linux-jdk7] Waiting for next available executor on ubuntu
[linux-jdk8] Still waiting to schedule task
[linux-jdk8] Waiting for next available executor on ubuntu
[linux-jdk9] Still waiting to schedule task
[linux-jdk9] Waiting for next available executor on ubuntu
[linux-jdk10] Still waiting to schedule task
[linux-jdk10] Waiting for next available executor on ubuntu
[windows-jdk7] Still waiting to schedule task
[windows-jdk7] Waiting for next available executor on Windows
[windows-jdk8] Still waiting to schedule task
[windows-jdk8] Waiting for next available executor on Windows
[windows-jdk9] Still waiting to schedule task
[windows-jdk9] Waiting for next available executor on Windows
[windows-jdk10] Still waiting to schedule task
[windows-jdk10] Waiting for next available executor on Windows
[windows-jdk7] Running on windows-2012-1 in f:\jenkins\jenkins-slave\workspace\box_maven-ant-plugin_master-N743QKOWXTZ36LZCK2YK3A6N4ZY3UG7X5RV3MH7PEH646A2IMDHA
[Pipeline] [windows-jdk7] {
[Pipeline] [windows-jdk7] stage
[Pipeline] [windows-jdk7] { (Checkout windows-jdk7)
[Pipeline] [windows-jdk7] dir
[windows-jdk7] Running in f:\jenkins\jenkins-slave\workspace\box_maven-ant-plugin_master-N743QKOWXTZ36LZCK2YK3A6N4ZY3UG7X5RV3MH7PEH646A2IMDHA\m
[Pipeline] [windows-jdk7] {
[Pipeline] [windows-jdk7] checkout
[windows-jdk7] Cloning the remote Git repository
[windows-jdk7] Cloning with configured refspecs honoured and without tags
[windows-jdk7] Cloning repository https://gitbox.apache.org/repos/asf/maven-ant-plugin.git
[windows-jdk7] > git init f:\jenkins\jenkins-slave\workspace\box_maven-ant-plugin_master-N743QKOWXTZ36LZCK2YK3A6N4ZY3UG7X5RV3MH7PEH646A2IMDHA\m # timeout=10
[windows-jdk7] ERROR: Error cloning remote repo 'origin'
[windows-jdk7] hudson.plugins.git.GitException: Could not init f:\jenkins\jenkins-slave\workspace\box_maven-ant-plugin_master-N743QKOWXTZ36LZCK2YK3A6N4ZY3UG7X5RV3MH7PEH646A2IMDHA\m
[windows-jdk7] at org.jenkinsci.plugins.gitclient.CliGitAPIImpl$5.execute(CliGitAPIImpl.java:772)
[windows-jdk7] at org.jenkinsci.plugins.gitclient.CliGitAPIImpl$2.execute(CliGitAPIImpl.java:564)
[windows-jdk7] at org.jenkinsci.plugins.gitclient.RemoteGitImpl$CommandInvocationHandler$1.call(RemoteGitImpl.java:153)
[windows-jdk7] at org.jenkinsci.plugins.gitclient.RemoteGitImpl$CommandInvocationHandler$1.call(RemoteGitImpl.java:146)
[windows-jdk7] at hudson.remoting.UserRequest.perform(UserRequest.java:153)
[windows-jdk7] at hudson.remoting.UserRequest.perform(UserRequest.java:50)
[windows-jdk7] at hudson.remoting.Request$2.run(Request.java:336)
[windows-jdk7] at hudson.remoting.InterceptingExecutorService$1.call(InterceptingExecutorService.java:68)
[windows-jdk7] at java.util.concurrent.FutureTask.run(Unknown Source)
[windows-jdk7] at java.util.concurrent.ThreadPoolExecutor.runWorker(Unknown Source)
[windows-jdk7] at java.util.concurrent.ThreadPoolExecutor$Worker.run(Unknown Source)
[windows-jdk7] at hudson.remoting.Engine$1$1.run(Engine.java:94)
[windows-jdk7] at java.lang.Thread.run(Unknown Source)
[windows-jdk7] Suppressed: hudson.remoting.Channel$CallSiteStackTrace: Remote call to JNLP4-connect connection from 37.48.69.226/37.48.69.226:61243
[windows-jdk7] at hudson.remoting.Channel.attachCallSiteStackTrace(Channel.java:1741)
[windows-jdk7] at hudson.remoting.UserResponse.retrieve(UserRequest.java:389)
[windows-jdk7] at hudson.remoting.Channel.call(Channel.java:955)
[windows-jdk7] at org.jenkinsci.plugins.gitclient.RemoteGitImpl$CommandInvocationHandler.execute(RemoteGitImpl.java:146)
[windows-jdk7] at sun.reflect.GeneratedMethodAccessor1289.invoke(Unknown Source)
[windows-jdk7] at sun.reflect.DelegatingMethodAccessorImpl.invoke(DelegatingMethodAccessorImpl.java:43)
[windows-jdk7] at java.lang.reflect.Method.invoke(Method.java:498)
[windows-jdk7] at org.jenkinsci.plugins.gitclient.RemoteGitImpl$CommandInvocationHandler.invoke(RemoteGitImpl.java:132)
[windows-jdk7] at com.sun.proxy.$Proxy149.execute(Unknown Source)
[windows-jdk7] at hudson.plugins.git.GitSCM.retrieveChanges(GitSCM.java:1146)
[windows-jdk7] at hudson.plugins.git.GitSCM.checkout(GitSCM.java:1186)
[windows-jdk7] at org.jenkinsci.plugins.workflow.steps.scm.SCMStep.checkout(SCMStep.java:113)
[windows-jdk7] at org.jenkinsci.plugins.workflow.steps.scm.SCMStep$StepExecutionImpl.run(SCMStep.java:85)
[windows-jdk7] at org.jenkinsci.plugins.workflow.steps.scm.SCMStep$StepExecutionImpl.run(SCMStep.java:75)
[windows-jdk7] at org.jenkinsci.plugins.workflow.steps.AbstractSynchronousNonBlockingStepExecution$1$1.call(AbstractSynchronousNonBlockingStepExecution.java:47)
[windows-jdk7] at hudson.security.ACL.impersonate(ACL.java:290)
[windows-jdk7] at org.jenkinsci.plugins.workflow.steps.AbstractSynchronousNonBlockingStepExecution$1.run(AbstractSynchronousNonBlockingStepExecution.java:44)
[windows-jdk7] at java.util.concurrent.Executors$RunnableAdapter.call(Executors.java:511)
[windows-jdk7] at java.util.concurrent.FutureTask.run(FutureTask.java:266)
[windows-jdk7] at java.util.concurrent.ThreadPoolExecutor.runWorker(ThreadPoolExecutor.java:1149)
[windows-jdk7] at java.util.concurrent.ThreadPoolExecutor$Worker.run(ThreadPoolExecutor.java:624)
[windows-jdk7] at java.lang.Thread.run(Thread.java:748)
[windows-jdk7] Caused by: hudson.plugins.git.GitException: Command "git init f:\jenkins\jenkins-slave\workspace\box_maven-ant-plugin_master-N743QKOWXTZ36LZCK2YK3A6N4ZY3UG7X5RV3MH7PEH646A2IMDHA\m" returned status code 128:
[windows-jdk7] stdout:
[windows-jdk7] stderr: error: copy-fd: write returned: No space left on device
[windows-jdk7] fatal: cannot copy 'C:\Program Files\Git\mingw64/share/git-core/templates/hooks/commit-msg.sample' to 'f:/jenkins/jenkins-slave/workspace/box_maven-ant-plugin_master-N743QKOWXTZ36LZCK2YK3A6N4ZY3UG7X5RV3MH7PEH646A2IMDHA/m/.git/hooks/commit-msg.sample': No space left on device
[windows-jdk7]
[windows-jdk7] at org.jenkinsci.plugins.gitclient.CliGitAPIImpl.launchCommandIn(CliGitAPIImpl.java:2002)
[windows-jdk7] at org.jenkinsci.plugins.gitclient.CliGitAPIImpl.launchCommandIn(CliGitAPIImpl.java:1970)
[windows-jdk7] at org.jenkinsci.plugins.gitclient.CliGitAPIImpl.launchCommandIn(CliGitAPIImpl.java:1966)
[windows-jdk7] at org.jenkinsci.plugins.gitclient.CliGitAPIImpl.launchCommand(CliGitAPIImpl.java:1597)
[windows-jdk7] at org.jenkinsci.plugins.gitclient.CliGitAPIImpl$5.execute(CliGitAPIImpl.java:770)
[windows-jdk7] ... 12 more
[Pipeline] [windows-jdk7] }
[Pipeline] [windows-jdk7] // dir
[Pipeline] [windows-jdk7] echo
[windows-jdk7] [FAIL FAST] This is the first failure and likely root cause
[Pipeline] [windows-jdk7] }
[Pipeline] [windows-jdk7] // stage
[Pipeline] [windows-jdk7] }
[Pipeline] [windows-jdk7] // node
[Pipeline] [windows-jdk7] }
[windows-jdk7] Failed in branch windows-jdk7
[Pipeline] [linux-jdk7] // node
[Pipeline] [linux-jdk8] // node
[Pipeline] [linux-jdk9] // node
[Pipeline] [linux-jdk10] // node
[Pipeline] [windows-jdk8] // node
[Pipeline] [windows-jdk9] // node
[Pipeline] [windows-jdk10] // node
[Pipeline] [linux-jdk7] }
[linux-jdk7] Failed in branch linux-jdk7
[Pipeline] [linux-jdk8] }
[linux-jdk8] Failed in branch linux-jdk8
[Pipeline] [linux-jdk9] }
[linux-jdk9] Failed in branch linux-jdk9
[Pipeline] [linux-jdk10] }
[linux-jdk10] Failed in branch linux-jdk10
[Pipeline] [windows-jdk8] }
[windows-jdk8] Failed in branch windows-jdk8
[Pipeline] [windows-jdk9] }
[windows-jdk9] Failed in branch windows-jdk9
[Pipeline] [windows-jdk10] }
[windows-jdk10] Failed in branch windows-jdk10
[Pipeline] // parallel
[Pipeline] echo
***** FAST FAILURE *****
Fast failure triggered by windows-jdk7
***** FAST FAILURE *****
[Pipeline] stage
[Pipeline] { (Notifications)
[Pipeline] echo
Build result: FAILURE
[Pipeline] jiraIssueSelector
Build succeeded in Jenkins: Maven TLP » maven-ant-plugin » master #8
Posted by Apache Jenkins Server <je...@builds.apache.org>.
See https://builds.apache.org/job/maven-box/job/maven-ant-plugin/job/master/8/
Changes:
* INFRA-16749, INFRA-16768 - Followup cleanup under all circumstances.
* INFRA-16749, INFRA-16768 - Followup cleanup under all circumstances.
* ubunut-eu2 is back online.
All tests passed
Build failed in Jenkins: Maven TLP » maven-ant-plugin » master #7
Posted by Apache Jenkins Server <je...@builds.apache.org>.
See https://builds.apache.org/job/maven-box/job/maven-ant-plugin/job/master/7/
Changes:
* Add jenkinsEnv#nodeSelection to globally finetune node selection
* Try another expression
* INFRA-16749, INFRA-16768 - Trying to keep workspace clean
* INFRA-16749, INFRA-16768 - Followup
* INFRA-16749, INFRA-16768 - Followup temporarily failFast = false.
* Used the wrong comment style.
* Exclude ubuntu-eu2 due to lack of disk space
* Apply jenkinsEnv.nodeSelection
* Upgrade maven-plugins parent Switch to asfMavenTlpPlgnBuild
* Upgrade maven-plugins parent Switch to asfMavenTlpPlgnBuild
* Upgrade maven-plugins parent Switch to asfMavenTlpPlgnBuild
* Upgrade maven-plugins parent Switch to asfMavenTlpPlgnBuild
* Upgrade maven-plugins parent Switch to asfMavenTlpPlgnBuild
* Upgrade maven-plugins parent Switch to asfMavenTlpPlgnBuild
* Upgrade maven-plugins parent Switch to asfMavenTlpPlgnBuild
* Upgrade maven-plugins parent Switch to asfMavenTlpPlgnBuild
All tests passed
Build log:
[...truncated 3.68 MB...]
[windows-jdk10-m3.5.x_build] [INFO] Downloaded: https://repo.maven.apache.org/maven2/org/apache/maven/maven-parent/16/maven-parent-16.pom (23 kB at 2.9 MB/s)
[windows-jdk10-m3.5.x_build] [INFO] Downloading: https://repo.maven.apache.org/maven2/org/apache/maven/doxia/doxia-sink-api/1.0/doxia-sink-api-1.0.pom
[windows-jdk10-m3.5.x_build] [INFO] Downloaded: https://repo.maven.apache.org/maven2/org/apache/maven/doxia/doxia-sink-api/1.0/doxia-sink-api-1.0.pom (1.4 kB at 231 kB/s)
[windows-jdk10-m3.5.x_build] [INFO] Downloading: https://repo.maven.apache.org/maven2/org/apache/maven/doxia/doxia/1.0/doxia-1.0.pom
[windows-jdk10-m3.5.x_build] [INFO] Downloaded: https://repo.maven.apache.org/maven2/org/apache/maven/doxia/doxia/1.0/doxia-1.0.pom (9.6 kB at 508 kB/s)
[windows-jdk10-m3.5.x_build] [INFO] Downloading: https://repo.maven.apache.org/maven2/org/apache/maven/maven-parent/10/maven-parent-10.pom
[windows-jdk10-m3.5.x_build] [INFO] Downloaded: https://repo.maven.apache.org/maven2/org/apache/maven/maven-parent/10/maven-parent-10.pom (32 kB at 1.5 MB/s)
[windows-jdk10-m3.5.x_build] [INFO] Downloading: https://repo.maven.apache.org/maven2/org/codehaus/plexus/plexus-utils/3.0.21/plexus-utils-3.0.21.pom
[windows-jdk10-m3.5.x_build] [INFO] Downloaded: https://repo.maven.apache.org/maven2/org/codehaus/plexus/plexus-utils/3.0.21/plexus-utils-3.0.21.pom (3.8 kB at 141 kB/s)
[windows-jdk10-m3.5.x_build] [INFO] Downloading: https://repo.maven.apache.org/maven2/org/apache/rat/apache-rat-api/0.12/apache-rat-api-0.12.jar
[windows-jdk10-m3.5.x_build] [INFO] Downloading: https://repo.maven.apache.org/maven2/commons-collections/commons-collections/3.2.2/commons-collections-3.2.2.jar
[windows-jdk10-m3.5.x_build] [INFO] Downloading: https://repo.maven.apache.org/maven2/commons-lang/commons-lang/2.6/commons-lang-2.6.jar
[windows-jdk10-m3.5.x_build] [INFO] Downloading: https://repo.maven.apache.org/maven2/commons-io/commons-io/2.2/commons-io-2.2.jar
[windows-jdk10-m3.5.x_build] [INFO] Downloading: https://repo.maven.apache.org/maven2/org/apache/rat/apache-rat-core/0.12/apache-rat-core-0.12.jar
[windows-jdk10-m3.5.x_build] [INFO] Downloaded: https://repo.maven.apache.org/maven2/org/apache/rat/apache-rat-api/0.12/apache-rat-api-0.12.jar (11 kB at 231 kB/s)
[windows-jdk10-m3.5.x_build] [INFO] Downloading: https://repo.maven.apache.org/maven2/org/apache/commons/commons-compress/1.10/commons-compress-1.10.jar
[windows-jdk10-m3.5.x_build] [INFO] Downloaded: https://repo.maven.apache.org/maven2/commons-lang/commons-lang/2.6/commons-lang-2.6.jar (284 kB at 5.8 MB/s)
[windows-jdk10-m3.5.x_build] [INFO] Downloading: https://repo.maven.apache.org/maven2/classworlds/classworlds/1.1-alpha-2/classworlds-1.1-alpha-2.jar
[windows-jdk10-m3.5.x_build] [INFO] Downloaded: https://repo.maven.apache.org/maven2/commons-io/commons-io/2.2/commons-io-2.2.jar (174 kB at 2.8 MB/s)
[windows-jdk10-m3.5.x_build] [INFO] Downloading: https://repo.maven.apache.org/maven2/org/apache/maven/doxia/doxia-core/1.6/doxia-core-1.6.jar
[windows-jdk10-m3.5.x_build] [INFO] Downloaded: https://repo.maven.apache.org/maven2/org/apache/rat/apache-rat-core/0.12/apache-rat-core-0.12.jar (122 kB at 1.9 MB/s)
[windows-jdk10-m3.5.x_build] [INFO] Downloading: https://repo.maven.apache.org/maven2/org/apache/maven/doxia/doxia-logging-api/1.6/doxia-logging-api-1.6.jar
[windows-jdk10-m3.5.x_build] [INFO] Downloaded: https://repo.maven.apache.org/maven2/classworlds/classworlds/1.1-alpha-2/classworlds-1.1-alpha-2.jar (38 kB at 521 kB/s)
[windows-jdk10-m3.5.x_build] [INFO] Downloading: https://repo.maven.apache.org/maven2/org/apache/httpcomponents/httpclient/4.0.2/httpclient-4.0.2.jar
[windows-jdk10-m3.5.x_build] [INFO] Downloaded: https://repo.maven.apache.org/maven2/commons-collections/commons-collections/3.2.2/commons-collections-3.2.2.jar (588 kB at 8.1 MB/s)
[windows-jdk10-m3.5.x_build] [INFO] Downloading: https://repo.maven.apache.org/maven2/commons-logging/commons-logging/1.1.1/commons-logging-1.1.1.jar
[windows-jdk10-m3.5.x_build] [INFO] Downloaded: https://repo.maven.apache.org/maven2/org/apache/commons/commons-compress/1.10/commons-compress-1.10.jar (409 kB at 5.1 MB/s)
[windows-jdk10-m3.5.x_build] [INFO] Downloading: https://repo.maven.apache.org/maven2/commons-codec/commons-codec/1.3/commons-codec-1.3.jar
[windows-jdk10-m3.5.x_build] [INFO] Downloaded: https://repo.maven.apache.org/maven2/org/apache/maven/doxia/doxia-logging-api/1.6/doxia-logging-api-1.6.jar (11 kB at 135 kB/s)
[windows-jdk10-m3.5.x_build] [INFO] Downloading: https://repo.maven.apache.org/maven2/org/apache/httpcomponents/httpcore/4.0.1/httpcore-4.0.1.jar
[windows-jdk10-m3.5.x_build] [INFO] Downloaded: https://repo.maven.apache.org/maven2/org/apache/maven/doxia/doxia-core/1.6/doxia-core-1.6.jar (162 kB at 1.9 MB/s)
[windows-jdk10-m3.5.x_build] [INFO] Downloading: https://repo.maven.apache.org/maven2/xmlunit/xmlunit/1.5/xmlunit-1.5.jar
[windows-jdk10-m3.5.x_build] [INFO] Downloaded: https://repo.maven.apache.org/maven2/commons-codec/commons-codec/1.3/commons-codec-1.3.jar (47 kB at 198 kB/s)
[windows-jdk10-m3.5.x_build] [INFO] Downloading: https://repo.maven.apache.org/maven2/org/apache/maven/doxia/doxia-decoration-model/1.6/doxia-decoration-model-1.6.jar
[windows-jdk10-m3.5.x_build] [INFO] Downloaded: https://repo.maven.apache.org/maven2/org/apache/httpcomponents/httpclient/4.0.2/httpclient-4.0.2.jar (293 kB at 1.2 MB/s)
[windows-jdk10-m3.5.x_build] [INFO] Downloading: https://repo.maven.apache.org/maven2/org/apache/maven/doxia/doxia-sink-api/1.6/doxia-sink-api-1.6.jar
[windows-jdk10-m3.5.x_build] [INFO] Downloaded: https://repo.maven.apache.org/maven2/org/apache/httpcomponents/httpcore/4.0.1/httpcore-4.0.1.jar (173 kB at 686 kB/s)
[windows-jdk10-m3.5.x_build] [INFO] Downloading: https://repo.maven.apache.org/maven2/org/apache/maven/doxia/doxia-site-renderer/1.6/doxia-site-renderer-1.6.jar
[windows-jdk10-m3.5.x_build] [INFO] Downloaded: https://repo.maven.apache.org/maven2/xmlunit/xmlunit/1.5/xmlunit-1.5.jar (98 kB at 386 kB/s)
[windows-jdk10-m3.5.x_build] [INFO] Downloading: https://repo.maven.apache.org/maven2/org/apache/maven/doxia/doxia-module-xhtml/1.6/doxia-module-xhtml-1.6.jar
[windows-jdk10-m3.5.x_build] [INFO] Downloaded: https://repo.maven.apache.org/maven2/commons-logging/commons-logging/1.1.1/commons-logging-1.1.1.jar (61 kB at 239 kB/s)
[windows-jdk10-m3.5.x_build] [INFO] Downloading: https://repo.maven.apache.org/maven2/org/apache/maven/doxia/doxia-module-fml/1.6/doxia-module-fml-1.6.jar
[windows-jdk10-m3.5.x_build] [INFO] Downloaded: https://repo.maven.apache.org/maven2/org/apache/maven/doxia/doxia-sink-api/1.6/doxia-sink-api-1.6.jar (11 kB at 44 kB/s)
[windows-jdk10-m3.5.x_build] [INFO] Downloading: https://repo.maven.apache.org/maven2/org/codehaus/plexus/plexus-i18n/1.0-beta-7/plexus-i18n-1.0-beta-7.jar
[windows-jdk10-m3.5.x_build] [INFO] Downloaded: https://repo.maven.apache.org/maven2/org/apache/maven/doxia/doxia-decoration-model/1.6/doxia-decoration-model-1.6.jar (57 kB at 222 kB/s)
[windows-jdk10-m3.5.x_build] [INFO] Downloading: https://repo.maven.apache.org/maven2/org/codehaus/plexus/plexus-velocity/1.1.7/plexus-velocity-1.1.7.jar
[windows-jdk10-m3.5.x_build] [INFO] Downloaded: https://repo.maven.apache.org/maven2/org/codehaus/plexus/plexus-i18n/1.0-beta-7/plexus-i18n-1.0-beta-7.jar (11 kB at 40 kB/s)
[windows-jdk10-m3.5.x_build] [INFO] Downloading: https://repo.maven.apache.org/maven2/org/apache/velocity/velocity/1.5/velocity-1.5.jar
[windows-jdk10-m3.5.x_build] [INFO] Downloaded: https://repo.maven.apache.org/maven2/org/apache/maven/doxia/doxia-module-xhtml/1.6/doxia-module-xhtml-1.6.jar (16 kB at 57 kB/s)
[windows-jdk10-m3.5.x_build] [INFO] Downloading: https://repo.maven.apache.org/maven2/oro/oro/2.0.8/oro-2.0.8.jar
[windows-jdk10-m3.5.x_build] [INFO] Downloading: https://repo.maven.apache.org/maven2/org/apache/velocity/velocity-tools/2.0/velocity-tools-2.0.jar
[windows-jdk10-m3.5.x_build] [INFO] Downloading: https://repo.maven.apache.org/maven2/commons-beanutils/commons-beanutils/1.7.0/commons-beanutils-1.7.0.jar
[windows-jdk10-m3.5.x_build] [INFO] Downloading: https://repo.maven.apache.org/maven2/commons-digester/commons-digester/1.8/commons-digester-1.8.jar
[windows-jdk10-m3.5.x_build] [INFO] Downloaded: https://repo.maven.apache.org/maven2/org/apache/maven/doxia/doxia-site-renderer/1.6/doxia-site-renderer-1.6.jar (56 kB at 196 kB/s)
[windows-jdk10-m3.5.x_build] [INFO] Downloading: https://repo.maven.apache.org/maven2/commons-chain/commons-chain/1.1/commons-chain-1.1.jar
[windows-jdk10-m3.5.x_build] [INFO] Downloading: https://repo.maven.apache.org/maven2/commons-validator/commons-validator/1.3.1/commons-validator-1.3.1.jar
[windows-jdk10-m3.5.x_build] [INFO] Downloading: https://repo.maven.apache.org/maven2/dom4j/dom4j/1.1/dom4j-1.1.jar
[windows-jdk10-m3.5.x_build] [INFO] Downloading: https://repo.maven.apache.org/maven2/sslext/sslext/1.2-0/sslext-1.2-0.jar
[windows-jdk10-m3.5.x_build] [INFO] Downloading: https://repo.maven.apache.org/maven2/org/apache/struts/struts-core/1.3.8/struts-core-1.3.8.jar
[windows-jdk10-m3.5.x_build] [INFO] Downloading: https://repo.maven.apache.org/maven2/antlr/antlr/2.7.2/antlr-2.7.2.jar
[windows-jdk10-m3.5.x_build] [INFO] Downloading: https://repo.maven.apache.org/maven2/org/apache/struts/struts-taglib/1.3.8/struts-taglib-1.3.8.jar
[windows-jdk10-m3.5.x_build] [INFO] Downloading: https://repo.maven.apache.org/maven2/org/apache/struts/struts-tiles/1.3.8/struts-tiles-1.3.8.jar
[windows-jdk10-m3.5.x_build] [INFO] Downloading: https://repo.maven.apache.org/maven2/org/apache/maven/reporting/maven-reporting-api/3.0/maven-reporting-api-3.0.jar
[windows-jdk10-m3.5.x_build] [INFO] Downloading: https://repo.maven.apache.org/maven2/org/codehaus/plexus/plexus-utils/3.0.21/plexus-utils-3.0.21.jar
[windows-jdk10-m3.5.x_build] [INFO] ------------------------------------------------------------------------
[windows-jdk10-m3.5.x_build] [INFO] BUILD FAILURE
[windows-jdk10-m3.5.x_build] [INFO] ------------------------------------------------------------------------
[windows-jdk10-m3.5.x_build] [INFO] Total time: 11.687 s
[windows-jdk10-m3.5.x_build] [INFO] Finished at: 2018-07-19T12:04:13Z
[windows-jdk10-m3.5.x_build] [INFO] Final Memory: 17M/67M
[windows-jdk10-m3.5.x_build] [INFO] ------------------------------------------------------------------------
[windows-jdk10-m3.5.x_build] [INFO] [jenkins-event-spy] Generated F:\jenkins\jenkins-slave\workspace\box_maven-ant-plugin_master-N743QKOWXTZ36LZCK2YK3A6N4ZY3UG7X5RV3MH7PEH646A2IMDHA@2@tmp\withMavenf80e6314\maven-spy-20180719-120401-8141119803870019304157.log
[windows-jdk10-m3.5.x_build] [ERROR] Failed to execute goal org.apache.rat:apache-rat-plugin:0.12:check (rat-check) on project maven-ant-plugin: Execution rat-check of goal org.apache.rat:apache-rat-plugin:0.12:check failed: Plugin org.apache.rat:apache-rat-plugin:0.12 or one of its dependencies could not be resolved: The following artifacts could not be resolved: org.apache.maven.doxia:doxia-module-fml:jar:1.6, org.codehaus.plexus:plexus-velocity:jar:1.1.7, org.apache.velocity:velocity:jar:1.5, oro:oro:jar:2.0.8, org.apache.velocity:velocity-tools:jar:2.0, commons-beanutils:commons-beanutils:jar:1.7.0, commons-digester:commons-digester:jar:1.8, commons-chain:commons-chain:jar:1.1, commons-validator:commons-validator:jar:1.3.1, dom4j:dom4j:jar:1.1, sslext:sslext:jar:1.2-0, org.apache.struts:struts-core:jar:1.3.8, antlr:antlr:jar:2.7.2, org.apache.struts:struts-taglib:jar:1.3.8, org.apache.struts:struts-tiles:jar:1.3.8, org.apache.maven.reporting:maven-reporting-api:jar:3.0, org.codehaus.plexus:plexus-utils:jar:3.0.21: Could not transfer artifact org.apache.maven.doxia:doxia-module-fml:jar:1.6 from/to central (https://repo.maven.apache.org/maven2): GET request of: org/apache/maven/doxia/doxia-module-fml/1.6/doxia-module-fml-1.6.jar from central failed: There is not enough space on the disk -> [Help 1]
[windows-jdk10-m3.5.x_build] [ERROR]
[windows-jdk10-m3.5.x_build] [ERROR] To see the full stack trace of the errors, re-run Maven with the -e switch.
[windows-jdk10-m3.5.x_build] [ERROR] Re-run Maven using the -X switch to enable full debug logging.
[windows-jdk10-m3.5.x_build] [ERROR]
[windows-jdk10-m3.5.x_build] [ERROR] For more information about the errors and possible solutions, please read the following articles:
[windows-jdk10-m3.5.x_build] [ERROR] [Help 1] http://cwiki.apache.org/confluence/display/MAVEN/PluginResolutionException
[Pipeline] [windows-jdk10-m3.5.x_build] }
[Pipeline] [windows-jdk10-m3.5.x_build] // dir
[Pipeline] [windows-jdk10-m3.5.x_build] }
[windows-jdk10-m3.5.x_build] ERROR: [withMaven] WARNING Exception parsing the logs generated by the Jenkins Maven Event Spy f:\jenkins\jenkins-slave\workspace\box_maven-ant-plugin_master-N743QKOWXTZ36LZCK2YK3A6N4ZY3UG7X5RV3MH7PEH646A2IMDHA@2@tmp\withMavenf80e6314\maven-spy-20180719-120401-8141119803870019304157.log, ignore file. Please report a bug associated for the component 'pipeline-maven-plugin' at https://issues.jenkins-ci.org
[windows-jdk10-m3.5.x_build] ERROR: org.xml.sax.SAXParseException; lineNumber: 416; columnNumber: 62; The element type "addDefaultLicenseMatchers" must be terminated by the matching end-tag "</addDefaultLicenseMatchers>".
[Pipeline] [windows-jdk10-m3.5.x_build] // withMaven
[Pipeline] [windows-jdk10-m3.5.x_build] cleanWs
[windows-jdk10-m3.5.x_build] [WS-CLEANUP] Deleting project workspace...[WS-CLEANUP] done
[Pipeline] [windows-jdk10-m3.5.x_build] }
[Pipeline] [windows-jdk10-m3.5.x_build] // stage
[Pipeline] [windows-jdk10-m3.5.x_build] }
[Pipeline] [windows-jdk10-m3.5.x_build] // node
[Pipeline] [windows-jdk10-m3.5.x_build] }
[windows-jdk10-m3.5.x_build] Failed in branch windows-jdk10-m3.5.x_build
[windows-jdk8-m3.5.x_build] [INFO] javadoc-it\pom.xml ............................... SUCCESS (9.2 s)
[windows-jdk8-m3.5.x_build] [INFO] Building: plugin-it\pom.xml
[windows-jdk8-m3.5.x_build] [INFO] run post-build script verify.bsh
[windows-jdk8-m3.5.x_build] [INFO] plugin-it\pom.xml ................................ SUCCESS (7.0 s)
[windows-jdk8-m3.5.x_build] [INFO] Building: plugin-mngt-config\pom.xml
[windows-jdk8-m3.5.x_build] [INFO] run post-build script verify.bsh
[windows-jdk8-m3.5.x_build] [INFO] plugin-mngt-config\pom.xml ....................... SUCCESS (5.7 s)
[windows-jdk8-m3.5.x_build] [INFO] Building: plugin-mngt-config-only\pom.xml
[windows-jdk8-m3.5.x_build] [INFO] run post-build script verify.bsh
[windows-jdk8-m3.5.x_build] [INFO] plugin-mngt-config-only\pom.xml .................. SUCCESS (4.5 s)
[windows-jdk8-m3.5.x_build] [INFO] Building: relative-path-it\pom.xml
[windows-jdk8-m3.5.x_build] [INFO] run post-build script verify.bsh
[windows-jdk8-m3.5.x_build] [INFO] relative-path-it\pom.xml ......................... SUCCESS (4.8 s)
[windows-jdk8-m3.5.x_build] [INFO] Building: single-test-it\pom.xml
[windows-jdk8-m3.5.x_build] [INFO] run post-build script verify.bsh
[windows-jdk8-m3.5.x_build] [INFO] single-test-it\pom.xml ........................... SUCCESS (8.0 s)
[windows-jdk8-m3.5.x_build] [INFO] Building: skip-missing-junit-it\pom.xml
[windows-jdk8-m3.5.x_build] [INFO] run post-build script verify.bsh
[windows-jdk8-m3.5.x_build] [INFO] skip-missing-junit-it\pom.xml .................... SUCCESS (4.8 s)
[windows-jdk8-m3.5.x_build] [INFO] Building: skip-test-compilation-it\pom.xml
[windows-jdk8-m3.5.x_build] [INFO] run post-build script verify.bsh
[windows-jdk8-m3.5.x_build] [INFO] skip-test-compilation-it\pom.xml ................. SUCCESS (4.9 s)
[windows-jdk8-m3.5.x_build] [INFO] Building: skip-test-execution-it\pom.xml
[windows-jdk8-m3.5.x_build] [INFO] run post-build script verify.bsh
[windows-jdk8-m3.5.x_build] [INFO] skip-test-execution-it\pom.xml ................... SUCCESS (4.6 s)
[windows-jdk8-m3.5.x_build] [INFO] Building: system-scope-dep\pom.xml
[windows-jdk8-m3.5.x_build] [INFO] system-scope-dep\pom.xml ......................... SUCCESS (5.1 s)
[windows-jdk8-m3.5.x_build] [INFO] Building: test-custom-selector-it\pom.xml
[windows-jdk8-m3.5.x_build] [INFO] run post-build script verify.bsh
[windows-jdk8-m3.5.x_build] [INFO] test-custom-selector-it\pom.xml .................. SUCCESS (7.6 s)
[windows-jdk8-m3.5.x_build] [INFO] Building: test-default-selector-it\pom.xml
[windows-jdk8-m3.5.x_build] [INFO] run post-build script verify.bsh
[windows-jdk8-m3.5.x_build] [INFO] test-default-selector-it\pom.xml ................. SUCCESS (8.1 s)
[windows-jdk8-m3.5.x_build] [INFO] Building: webapp-it\pom.xml
[windows-jdk8-m3.5.x_build] [INFO] run post-build script verify.bsh
[windows-jdk8-m3.5.x_build] [INFO] webapp-it\pom.xml ................................ SUCCESS (7.9 s)
[windows-jdk8-m3.5.x_build] [INFO]
[windows-jdk8-m3.5.x_build] [INFO] --- maven-checkstyle-plugin:3.0.0:check (checkstyle-check) @ maven-ant-plugin ---
[windows-jdk8-m3.5.x_build] [INFO] Downloading: https://repo.maven.apache.org/maven2/org/apache/maven/shared/maven-shared-resources/2/maven-shared-resources-2.pom
[windows-jdk8-m3.5.x_build] [INFO] Downloaded: https://repo.maven.apache.org/maven2/org/apache/maven/shared/maven-shared-resources/2/maven-shared-resources-2.pom (3.0 kB at 328 kB/s)
[windows-jdk8-m3.5.x_build] [INFO] Downloading: https://repo.maven.apache.org/maven2/org/codehaus/plexus/plexus-utils/3.0.10/plexus-utils-3.0.10.pom
[windows-jdk8-m3.5.x_build] [INFO] Downloaded: https://repo.maven.apache.org/maven2/org/codehaus/plexus/plexus-utils/3.0.10/plexus-utils-3.0.10.pom (3.1 kB at 449 kB/s)
[windows-jdk8-m3.5.x_build] [INFO] Downloading: https://repo.maven.apache.org/maven2/org/codehaus/plexus/plexus/3.3/plexus-3.3.pom
[windows-jdk8-m3.5.x_build] [INFO] Downloaded: https://repo.maven.apache.org/maven2/org/codehaus/plexus/plexus/3.3/plexus-3.3.pom (20 kB at 2.5 MB/s)
[windows-jdk8-m3.5.x_build] [INFO] Downloading: https://repo.maven.apache.org/maven2/org/apache/maven/doxia/doxia-integration-tools/1.6/doxia-integration-tools-1.6.pom
[windows-jdk8-m3.5.x_build] [INFO] Downloaded: https://repo.maven.apache.org/maven2/org/apache/maven/doxia/doxia-integration-tools/1.6/doxia-integration-tools-1.6.pom (7.0 kB at 773 kB/s)
[windows-jdk8-m3.5.x_build] [INFO] Downloading: https://repo.maven.apache.org/maven2/org/apache/maven/doxia/doxia-tools/3/doxia-tools-3.pom
[windows-jdk8-m3.5.x_build] [INFO] Downloaded: https://repo.maven.apache.org/maven2/org/apache/maven/doxia/doxia-tools/3/doxia-tools-3.pom (9.9 kB at 1.2 MB/s)
[windows-jdk8-m3.5.x_build] [INFO] Downloading: https://repo.maven.apache.org/maven2/org/codehaus/plexus/plexus-resources/1.1.0/plexus-resources-1.1.0.pom
[windows-jdk8-m3.5.x_build] [INFO] Downloaded: https://repo.maven.apache.org/maven2/org/codehaus/plexus/plexus-resources/1.1.0/plexus-resources-1.1.0.pom (3.2 kB at 353 kB/s)
[windows-jdk8-m3.5.x_build] [INFO] Downloading: https://repo.maven.apache.org/maven2/com/puppycrawl/tools/checkstyle/6.18/checkstyle-6.18.pom
[windows-jdk8-m3.5.x_build] [INFO] Downloaded: https://repo.maven.apache.org/maven2/com/puppycrawl/tools/checkstyle/6.18/checkstyle-6.18.pom (71 kB at 4.2 MB/s)
[windows-jdk8-m3.5.x_build] [INFO] Downloading: https://repo.maven.apache.org/maven2/antlr/antlr/2.7.7/antlr-2.7.7.pom
[windows-jdk8-m3.5.x_build] [INFO] Downloaded: https://repo.maven.apache.org/maven2/antlr/antlr/2.7.7/antlr-2.7.7.pom (632 B at 90 kB/s)
[windows-jdk8-m3.5.x_build] [INFO] Downloading: https://repo.maven.apache.org/maven2/org/antlr/antlr4-runtime/4.5.3/antlr4-runtime-4.5.3.pom
[windows-jdk8-m3.5.x_build] [INFO] Downloaded: https://repo.maven.apache.org/maven2/org/antlr/antlr4-runtime/4.5.3/antlr4-runtime-4.5.3.pom (2.3 kB at 289 kB/s)
[windows-jdk8-m3.5.x_build] [INFO] Downloading: https://repo.maven.apache.org/maven2/org/antlr/antlr4-master/4.5.3/antlr4-master-4.5.3.pom
[windows-jdk8-m3.5.x_build] [INFO] Downloaded: https://repo.maven.apache.org/maven2/org/antlr/antlr4-master/4.5.3/antlr4-master-4.5.3.pom (3.7 kB at 409 kB/s)
[windows-jdk8-m3.5.x_build] [INFO] Downloading: https://repo.maven.apache.org/maven2/commons-beanutils/commons-beanutils/1.9.2/commons-beanutils-1.9.2.pom
[windows-jdk8-m3.5.x_build] [INFO] Downloaded: https://repo.maven.apache.org/maven2/commons-beanutils/commons-beanutils/1.9.2/commons-beanutils-1.9.2.pom (14 kB at 1.8 MB/s)
[windows-jdk8-m3.5.x_build] [INFO] Downloading: https://repo.maven.apache.org/maven2/org/apache/commons/commons-parent/33/commons-parent-33.pom
[windows-jdk8-m3.5.x_build] [INFO] Downloaded: https://repo.maven.apache.org/maven2/org/apache/commons/commons-parent/33/commons-parent-33.pom (53 kB at 4.8 MB/s)
[windows-jdk8-m3.5.x_build] [INFO] Downloading: https://repo.maven.apache.org/maven2/commons-cli/commons-cli/1.3.1/commons-cli-1.3.1.pom
[windows-jdk8-m3.5.x_build] [INFO] Downloaded: https://repo.maven.apache.org/maven2/commons-cli/commons-cli/1.3.1/commons-cli-1.3.1.pom (10 kB at 1.5 MB/s)
[windows-jdk8-m3.5.x_build] [INFO] Downloading: https://repo.maven.apache.org/maven2/com/google/guava/guava/19.0/guava-19.0.pom
[windows-jdk8-m3.5.x_build] [INFO] Downloaded: https://repo.maven.apache.org/maven2/com/google/guava/guava/19.0/guava-19.0.pom (6.8 kB at 849 kB/s)
[windows-jdk8-m3.5.x_build] [INFO] Downloading: https://repo.maven.apache.org/maven2/com/google/guava/guava-parent/19.0/guava-parent-19.0.pom
[windows-jdk8-m3.5.x_build] [INFO] Downloaded: https://repo.maven.apache.org/maven2/com/google/guava/guava-parent/19.0/guava-parent-19.0.pom (9.9 kB at 1.4 MB/s)
[windows-jdk8-m3.5.x_build] [INFO] Downloading: https://repo.maven.apache.org/maven2/org/sonatype/oss/oss-parent/7/oss-parent-7.pom
[windows-jdk8-m3.5.x_build] [INFO] Downloaded: https://repo.maven.apache.org/maven2/org/sonatype/oss/oss-parent/7/oss-parent-7.pom (4.8 kB at 804 kB/s)
[windows-jdk8-m3.5.x_build] [INFO] Downloading: https://repo.maven.apache.org/maven2/org/apache/maven/shared/maven-shared-resources/2/maven-shared-resources-2.jar
[windows-jdk8-m3.5.x_build] [INFO] Downloading: https://repo.maven.apache.org/maven2/commons-digester/commons-digester/1.6/commons-digester-1.6.jar
[windows-jdk8-m3.5.x_build] [INFO] Downloading: https://repo.maven.apache.org/maven2/org/apache/maven/doxia/doxia-core/1.2/doxia-core-1.2.jar
[windows-jdk8-m3.5.x_build] [INFO] Downloading: https://repo.maven.apache.org/maven2/org/apache/maven/doxia/doxia-integration-tools/1.6/doxia-integration-tools-1.6.jar
[windows-jdk8-m3.5.x_build] [INFO] Downloading: https://repo.maven.apache.org/maven2/commons-logging/commons-logging/1.0.4/commons-logging-1.0.4.jar
[windows-jdk8-m3.5.x_build] [INFO] Downloaded: https://repo.maven.apache.org/maven2/commons-digester/commons-digester/1.6/commons-digester-1.6.jar (168 kB at 5.3 MB/s)
[windows-jdk8-m3.5.x_build] [INFO] Downloading: https://repo.maven.apache.org/maven2/commons-io/commons-io/1.4/commons-io-1.4.jar
[windows-jdk8-m3.5.x_build] [INFO] Downloaded: https://repo.maven.apache.org/maven2/org/apache/maven/doxia/doxia-core/1.2/doxia-core-1.2.jar (154 kB at 4.8 MB/s)
[windows-jdk8-m3.5.x_build] [INFO] Downloading: https://repo.maven.apache.org/maven2/org/codehaus/plexus/plexus-resources/1.1.0/plexus-resources-1.1.0.jar
[windows-jdk8-m3.5.x_build] [INFO] Downloaded: https://repo.maven.apache.org/maven2/commons-logging/commons-logging/1.0.4/commons-logging-1.0.4.jar (38 kB at 1.1 MB/s)
[windows-jdk8-m3.5.x_build] [INFO] Downloading: https://repo.maven.apache.org/maven2/com/puppycrawl/tools/checkstyle/6.18/checkstyle-6.18.jar
[windows-jdk8-m3.5.x_build] [INFO] Downloaded: https://repo.maven.apache.org/maven2/org/apache/maven/shared/maven-shared-resources/2/maven-shared-resources-2.jar (13 kB at 344 kB/s)
[windows-jdk8-m3.5.x_build] [INFO] Downloading: https://repo.maven.apache.org/maven2/antlr/antlr/2.7.7/antlr-2.7.7.jar
[windows-jdk8-m3.5.x_build] [INFO] Downloaded: https://repo.maven.apache.org/maven2/org/apache/maven/doxia/doxia-integration-tools/1.6/doxia-integration-tools-1.6.jar (45 kB at 1.1 MB/s)
[windows-jdk8-m3.5.x_build] [INFO] Downloading: https://repo.maven.apache.org/maven2/org/antlr/antlr4-runtime/4.5.3/antlr4-runtime-4.5.3.jar
[windows-jdk8-m3.5.x_build] [INFO] Downloaded: https://repo.maven.apache.org/maven2/org/codehaus/plexus/plexus-resources/1.1.0/plexus-resources-1.1.0.jar (23 kB at 422 kB/s)
[windows-jdk8-m3.5.x_build] [INFO] Downloading: https://repo.maven.apache.org/maven2/commons-beanutils/commons-beanutils/1.9.2/commons-beanutils-1.9.2.jar
[windows-jdk8-m3.5.x_build] [INFO] Downloaded: https://repo.maven.apache.org/maven2/commons-io/commons-io/1.4/commons-io-1.4.jar (109 kB at 1.7 MB/s)
[windows-jdk8-m3.5.x_build] [INFO] Downloading: https://repo.maven.apache.org/maven2/commons-cli/commons-cli/1.3.1/commons-cli-1.3.1.jar
[windows-jdk8-m3.5.x_build] [INFO] Downloaded: https://repo.maven.apache.org/maven2/commons-beanutils/commons-beanutils/1.9.2/commons-beanutils-1.9.2.jar (234 kB at 2.7 MB/s)
[windows-jdk8-m3.5.x_build] [INFO] Downloading: https://repo.maven.apache.org/maven2/com/google/guava/guava/19.0/guava-19.0.jar
[windows-jdk8-m3.5.x_build] [INFO] Downloaded: https://repo.maven.apache.org/maven2/org/antlr/antlr4-runtime/4.5.3/antlr4-runtime-4.5.3.jar (302 kB at 3.4 MB/s)
[windows-jdk8-m3.5.x_build] [INFO] Downloading: https://repo.maven.apache.org/maven2/commons-lang/commons-lang/2.1/commons-lang-2.1.jar
[windows-jdk8-m3.5.x_build] [INFO] Downloaded: https://repo.maven.apache.org/maven2/antlr/antlr/2.7.7/antlr-2.7.7.jar (445 kB at 4.8 MB/s)
[windows-jdk8-m3.5.x_build] [INFO] Downloaded: https://repo.maven.apache.org/maven2/commons-cli/commons-cli/1.3.1/commons-cli-1.3.1.jar (53 kB at 465 kB/s)
[windows-jdk8-m3.5.x_build] [INFO] Downloaded: https://repo.maven.apache.org/maven2/commons-lang/commons-lang/2.1/commons-lang-2.1.jar (208 kB at 1.8 MB/s)
[windows-jdk8-m3.5.x_build] [INFO] Downloaded: https://repo.maven.apache.org/maven2/com/puppycrawl/tools/checkstyle/6.18/checkstyle-6.18.jar (1.2 MB at 8.7 MB/s)
[windows-jdk8-m3.5.x_build] [INFO] Downloaded: https://repo.maven.apache.org/maven2/com/google/guava/guava/19.0/guava-19.0.jar (2.3 MB at 10 MB/s)
[windows-jdk8-m3.5.x_build] [INFO] There are 4 errors reported by Checkstyle 6.18 with config/maven_checks.xml ruleset.
[windows-jdk8-m3.5.x_build] [INFO] Ignored 4 errors, 0 violation remaining.
[windows-jdk8-m3.5.x_build] [INFO]
[windows-jdk8-m3.5.x_build] [INFO] --- maven-invoker-plugin:3.1.0:verify (integration-test) @ maven-ant-plugin ---
[windows-jdk8-m3.5.x_build] [INFO] -------------------------------------------------
[windows-jdk8-m3.5.x_build] [INFO] Build Summary:
[windows-jdk8-m3.5.x_build] [INFO] Passed: 17, Failed: 1, Errors: 0, Skipped: 0
[windows-jdk8-m3.5.x_build] [INFO] -------------------------------------------------
[windows-jdk8-m3.5.x_build] [ERROR] The following builds failed:
[windows-jdk8-m3.5.x_build] [ERROR] * ear-it\pom.xml
[windows-jdk8-m3.5.x_build] [INFO] -------------------------------------------------
[windows-jdk8-m3.5.x_build] [INFO] ------------------------------------------------------------------------
[windows-jdk8-m3.5.x_build] [INFO] BUILD FAILURE
[windows-jdk8-m3.5.x_build] [INFO] ------------------------------------------------------------------------
[windows-jdk8-m3.5.x_build] [INFO] Total time: 02:29 min
[windows-jdk8-m3.5.x_build] [INFO] Finished at: 2018-07-19T12:05:31Z
[windows-jdk8-m3.5.x_build] [INFO] Final Memory: 46M/567M
[windows-jdk8-m3.5.x_build] [INFO] ------------------------------------------------------------------------
[windows-jdk8-m3.5.x_build] [INFO] [jenkins-event-spy] Generated F:\jenkins\jenkins-slave\workspace\box_maven-ant-plugin_master-N743QKOWXTZ36LZCK2YK3A6N4ZY3UG7X5RV3MH7PEH646A2IMDHA@tmp\withMaven1b4703b8\maven-spy-20180719-120301-981186404487516550936.log
[windows-jdk8-m3.5.x_build] [ERROR] Failed to execute goal org.apache.maven.plugins:maven-invoker-plugin:3.1.0:verify (integration-test) on project maven-ant-plugin: 1 build failed. See console output above for details. -> [Help 1]
[windows-jdk8-m3.5.x_build] [ERROR]
[windows-jdk8-m3.5.x_build] [ERROR] To see the full stack trace of the errors, re-run Maven with the -e switch.
[windows-jdk8-m3.5.x_build] [ERROR] Re-run Maven using the -X switch to enable full debug logging.
[windows-jdk8-m3.5.x_build] [ERROR]
[windows-jdk8-m3.5.x_build] [ERROR] For more information about the errors and possible solutions, please read the following articles:
[windows-jdk8-m3.5.x_build] [ERROR] [Help 1] http://cwiki.apache.org/confluence/display/MAVEN/MojoFailureException
[windows-jdk8-m3.5.x_build] Picked up JAVA_TOOL_OPTIONS: -Dmaven.ext.class.path="f:\jenkins\jenkins-slave\workspace\box_maven-ant-plugin_master-N743QKOWXTZ36LZCK2YK3A6N4ZY3UG7X5RV3MH7PEH646A2IMDHA@tmp\withMaven1b4703b8\pipeline-maven-spy.jar" -Dorg.jenkinsci.plugins.pipeline.maven.reportsFolder="f:\jenkins\jenkins-slave\workspace\box_maven-ant-plugin_master-N743QKOWXTZ36LZCK2YK3A6N4ZY3UG7X5RV3MH7PEH646A2IMDHA@tmp\withMaven1b4703b8"
[Pipeline] [windows-jdk8-m3.5.x_build] }
[Pipeline] [windows-jdk8-m3.5.x_build] // dir
[Pipeline] [windows-jdk8-m3.5.x_build] }
[windows-jdk8-m3.5.x_build] [withMaven] invokerPublisher - Archive invoker results for Maven artifact MavenArtifact{org.apache.maven.plugins:maven-ant-plugin::2.5-SNAPSHOT(version: 2.5-SNAPSHOT, snapshot:false) } generated by PluginInvocation{org.apache.maven.plugins:maven-invoker-plugin:3.1.0@integration-test integration-test}: windows-jdk8-m3.5.x_build\target\invoker-reports\*.xml
[windows-jdk8-m3.5.x_build] performing MavenInvokerRecorder, reportsFilenamePattern:'**/windows-jdk8-m3.5.x_build\target\invoker-reports/BUILD*.xml', invokerBuildDir:'**/windows-jdk8-m3.5.x_build\target\it'
[windows-jdk8-m3.5.x_build] Found reports:[f:\jenkins\jenkins-slave\workspace\box_maven-ant-plugin_master-N743QKOWXTZ36LZCK2YK3A6N4ZY3UG7X5RV3MH7PEH646A2IMDHA\windows-jdk8-m3.5.x_build\target\invoker-reports\BUILD-clean-custom-files.xml, f:\jenkins\jenkins-slave\workspace\box_maven-ant-plugin_master-N743QKOWXTZ36LZCK2YK3A6N4ZY3UG7X5RV3MH7PEH646A2IMDHA\windows-jdk8-m3.5.x_build\target\invoker-reports\BUILD-clean.xml, f:\jenkins\jenkins-slave\workspace\box_maven-ant-plugin_master-N743QKOWXTZ36LZCK2YK3A6N4ZY3UG7X5RV3MH7PEH646A2IMDHA\windows-jdk8-m3.5.x_build\target\invoker-reports\BUILD-ear-it.xml, f:\jenkins\jenkins-slave\workspace\box_maven-ant-plugin_master-N743QKOWXTZ36LZCK2YK3A6N4ZY3UG7X5RV3MH7PEH646A2IMDHA\windows-jdk8-m3.5.x_build\target\invoker-reports\BUILD-encoding-it.xml, f:\jenkins\jenkins-slave\workspace\box_maven-ant-plugin_master-N743QKOWXTZ36LZCK2YK3A6N4ZY3UG7X5RV3MH7PEH646A2IMDHA\windows-jdk8-m3.5.x_build\target\invoker-reports\BUILD-file-repo-it.xml, f:\jenkins\jenkins-slave\workspace\box_maven-ant-plugin_master-N743QKOWXTZ36LZCK2YK3A6N4ZY3UG7X5RV3MH7PEH646A2IMDHA\windows-jdk8-m3.5.x_build\target\invoker-reports\BUILD-javadoc-it.xml, f:\jenkins\jenkins-slave\workspace\box_maven-ant-plugin_master-N743QKOWXTZ36LZCK2YK3A6N4ZY3UG7X5RV3MH7PEH646A2IMDHA\windows-jdk8-m3.5.x_build\target\invoker-reports\BUILD-plugin-it.xml, f:\jenkins\jenkins-slave\workspace\box_maven-ant-plugin_master-N743QKOWXTZ36LZCK2YK3A6N4ZY3UG7X5RV3MH7PEH646A2IMDHA\windows-jdk8-m3.5.x_build\target\invoker-reports\BUILD-plugin-mngt-config-only.xml, f:\jenkins\jenkins-slave\workspace\box_maven-ant-plugin_master-N743QKOWXTZ36LZCK2YK3A6N4ZY3UG7X5RV3MH7PEH646A2IMDHA\windows-jdk8-m3.5.x_build\target\invoker-reports\BUILD-plugin-mngt-config.xml, f:\jenkins\jenkins-slave\workspace\box_maven-ant-plugin_master-N743QKOWXTZ36LZCK2YK3A6N4ZY3UG7X5RV3MH7PEH646A2IMDHA\windows-jdk8-m3.5.x_build\target\invoker-reports\BUILD-relative-path-it.xml, f:\jenkins\jenkins-slave\workspace\box_maven-ant-plugin_master-N743QKOWXTZ36LZCK2YK3A6N4ZY3UG7X5RV3MH7PEH646A2IMDHA\windows-jdk8-m3.5.x_build\target\invoker-reports\BUILD-single-test-it.xml, f:\jenkins\jenkins-slave\workspace\box_maven-ant-plugin_master-N743QKOWXTZ36LZCK2YK3A6N4ZY3UG7X5RV3MH7PEH646A2IMDHA\windows-jdk8-m3.5.x_build\target\invoker-reports\BUILD-skip-missing-junit-it.xml, f:\jenkins\jenkins-slave\workspace\box_maven-ant-plugin_master-N743QKOWXTZ36LZCK2YK3A6N4ZY3UG7X5RV3MH7PEH646A2IMDHA\windows-jdk8-m3.5.x_build\target\invoker-reports\BUILD-skip-test-compilation-it.xml, f:\jenkins\jenkins-slave\workspace\box_maven-ant-plugin_master-N743QKOWXTZ36LZCK2YK3A6N4ZY3UG7X5RV3MH7PEH646A2IMDHA\windows-jdk8-m3.5.x_build\target\invoker-reports\BUILD-skip-test-execution-it.xml, f:\jenkins\jenkins-slave\workspace\box_maven-ant-plugin_master-N743QKOWXTZ36LZCK2YK3A6N4ZY3UG7X5RV3MH7PEH646A2IMDHA\windows-jdk8-m3.5.x_build\target\invoker-reports\BUILD-system-scope-dep.xml, f:\jenkins\jenkins-slave\workspace\box_maven-ant-plugin_master-N743QKOWXTZ36LZCK2YK3A6N4ZY3UG7X5RV3MH7PEH646A2IMDHA\windows-jdk8-m3.5.x_build\target\invoker-reports\BUILD-test-custom-selector-it.xml, f:\jenkins\jenkins-slave\workspace\box_maven-ant-plugin_master-N743QKOWXTZ36LZCK2YK3A6N4ZY3UG7X5RV3MH7PEH646A2IMDHA\windows-jdk8-m3.5.x_build\target\invoker-reports\BUILD-test-default-selector-it.xml, f:\jenkins\jenkins-slave\workspace\box_maven-ant-plugin_master-N743QKOWXTZ36LZCK2YK3A6N4ZY3UG7X5RV3MH7PEH646A2IMDHA\windows-jdk8-m3.5.x_build\target\invoker-reports\BUILD-webapp-it.xml]
[windows-jdk8-m3.5.x_build] Found logs:[f:\jenkins\jenkins-slave\workspace\box_maven-ant-plugin_master-N743QKOWXTZ36LZCK2YK3A6N4ZY3UG7X5RV3MH7PEH646A2IMDHA\windows-jdk8-m3.5.x_build\target\it\clean-custom-files\build.log, f:\jenkins\jenkins-slave\workspace\box_maven-ant-plugin_master-N743QKOWXTZ36LZCK2YK3A6N4ZY3UG7X5RV3MH7PEH646A2IMDHA\windows-jdk8-m3.5.x_build\target\it\clean\build.log, f:\jenkins\jenkins-slave\workspace\box_maven-ant-plugin_master-N743QKOWXTZ36LZCK2YK3A6N4ZY3UG7X5RV3MH7PEH646A2IMDHA\windows-jdk8-m3.5.x_build\target\it\ear-it\build.log, f:\jenkins\jenkins-slave\workspace\box_maven-ant-plugin_master-N743QKOWXTZ36LZCK2YK3A6N4ZY3UG7X5RV3MH7PEH646A2IMDHA\windows-jdk8-m3.5.x_build\target\it\encoding-it\build.log, f:\jenkins\jenkins-slave\workspace\box_maven-ant-plugin_master-N743QKOWXTZ36LZCK2YK3A6N4ZY3UG7X5RV3MH7PEH646A2IMDHA\windows-jdk8-m3.5.x_build\target\it\file-repo-it\build.log, f:\jenkins\jenkins-slave\workspace\box_maven-ant-plugin_master-N743QKOWXTZ36LZCK2YK3A6N4ZY3UG7X5RV3MH7PEH646A2IMDHA\windows-jdk8-m3.5.x_build\target\it\javadoc-it\build.log, f:\jenkins\jenkins-slave\workspace\box_maven-ant-plugin_master-N743QKOWXTZ36LZCK2YK3A6N4ZY3UG7X5RV3MH7PEH646A2IMDHA\windows-jdk8-m3.5.x_build\target\it\plugin-it\build.log, f:\jenkins\jenkins-slave\workspace\box_maven-ant-plugin_master-N743QKOWXTZ36LZCK2YK3A6N4ZY3UG7X5RV3MH7PEH646A2IMDHA\windows-jdk8-m3.5.x_build\target\it\plugin-mngt-config-only\build.log, f:\jenkins\jenkins-slave\workspace\box_maven-ant-plugin_master-N743QKOWXTZ36LZCK2YK3A6N4ZY3UG7X5RV3MH7PEH646A2IMDHA\windows-jdk8-m3.5.x_build\target\it\plugin-mngt-config\build.log, f:\jenkins\jenkins-slave\workspace\box_maven-ant-plugin_master-N743QKOWXTZ36LZCK2YK3A6N4ZY3UG7X5RV3MH7PEH646A2IMDHA\windows-jdk8-m3.5.x_build\target\it\relative-path-it\build.log, f:\jenkins\jenkins-slave\workspace\box_maven-ant-plugin_master-N743QKOWXTZ36LZCK2YK3A6N4ZY3UG7X5RV3MH7PEH646A2IMDHA\windows-jdk8-m3.5.x_build\target\it\single-test-it\build.log, f:\jenkins\jenkins-slave\workspace\box_maven-ant-plugin_master-N743QKOWXTZ36LZCK2YK3A6N4ZY3UG7X5RV3MH7PEH646A2IMDHA\windows-jdk8-m3.5.x_build\target\it\skip-missing-junit-it\build.log, f:\jenkins\jenkins-slave\workspace\box_maven-ant-plugin_master-N743QKOWXTZ36LZCK2YK3A6N4ZY3UG7X5RV3MH7PEH646A2IMDHA\windows-jdk8-m3.5.x_build\target\it\skip-test-compilation-it\build.log, f:\jenkins\jenkins-slave\workspace\box_maven-ant-plugin_master-N743QKOWXTZ36LZCK2YK3A6N4ZY3UG7X5RV3MH7PEH646A2IMDHA\windows-jdk8-m3.5.x_build\target\it\skip-test-execution-it\build.log, f:\jenkins\jenkins-slave\workspace\box_maven-ant-plugin_master-N743QKOWXTZ36LZCK2YK3A6N4ZY3UG7X5RV3MH7PEH646A2IMDHA\windows-jdk8-m3.5.x_build\target\it\system-scope-dep\build.log, f:\jenkins\jenkins-slave\workspace\box_maven-ant-plugin_master-N743QKOWXTZ36LZCK2YK3A6N4ZY3UG7X5RV3MH7PEH646A2IMDHA\windows-jdk8-m3.5.x_build\target\it\test-custom-selector-it\build.log, f:\jenkins\jenkins-slave\workspace\box_maven-ant-plugin_master-N743QKOWXTZ36LZCK2YK3A6N4ZY3UG7X5RV3MH7PEH646A2IMDHA\windows-jdk8-m3.5.x_build\target\it\test-default-selector-it\build.log, f:\jenkins\jenkins-slave\workspace\box_maven-ant-plugin_master-N743QKOWXTZ36LZCK2YK3A6N4ZY3UG7X5RV3MH7PEH646A2IMDHA\windows-jdk8-m3.5.x_build\target\it\webapp-it\build.log]
[windows-jdk8-m3.5.x_build] Finished parsing Maven Invoker results (found 18)
[windows-jdk8-m3.5.x_build] [withMaven] junitPublisher - Archive test results for Maven artifact org.apache.maven.plugins:maven-ant-plugin:2.5-SNAPSHOT generated by maven-surefire-plugin:test (default-test): windows-jdk8-m3.5.x_build\target\surefire-reports\*.xml
[windows-jdk8-m3.5.x_build] Recording test results
[windows-jdk8-m3.5.x_build] [withMaven] openTasksPublisher - Scan Tasks for Maven artifact org.apache.maven.plugins:maven-ant-plugin:2.5-SNAPSHOT in source directory windows-jdk8-m3.5.x_build\src\main\java
[windows-jdk8-m3.5.x_build] [TASKS] Scanning folder 'f:\jenkins\jenkins-slave\workspace\box_maven-ant-plugin_master-N743QKOWXTZ36LZCK2YK3A6N4ZY3UG7X5RV3MH7PEH646A2IMDHA' for files matching the pattern 'windows-jdk8-m3.5.x_build\src\main\java\**\*' - excludes: null
[windows-jdk8-m3.5.x_build] [TASKS] Found 5 files to scan for tasks
[windows-jdk8-m3.5.x_build] [TASKS] Found 8 open tasks.
[windows-jdk8-m3.5.x_build] Skipping warnings blame since pipelines do not have an SCM link.%n
[windows-jdk8-m3.5.x_build] [TASKS] Computing warning deltas based on reference build #6
[Pipeline] [windows-jdk8-m3.5.x_build] // withMaven
[Pipeline] [windows-jdk8-m3.5.x_build] cleanWs
[windows-jdk8-m3.5.x_build] [WS-CLEANUP] Deleting project workspace...[WS-CLEANUP] done
[Pipeline] [windows-jdk8-m3.5.x_build] }
[Pipeline] [windows-jdk8-m3.5.x_build] // stage
[Pipeline] [windows-jdk8-m3.5.x_build] }
[Pipeline] [windows-jdk8-m3.5.x_build] // node
[Pipeline] [windows-jdk8-m3.5.x_build] }
[windows-jdk8-m3.5.x_build] Failed in branch windows-jdk8-m3.5.x_build
[Pipeline] // parallel
[Pipeline] stage
[Pipeline] { (Notifications)
[Pipeline] echo
Build result: FAILURE
[Pipeline] jiraIssueSelector
Build unstable in Jenkins: Maven TLP » maven-ant-plugin » master #6
Posted by Apache Jenkins Server <je...@builds.apache.org>.
See https://builds.apache.org/job/maven-box/job/maven-ant-plugin/job/master/6/
No changes.
All tests passed
Build log:
[...truncated 2.02 MB...]
[linux-jdk9] [INFO] ------------------------------------------------------------------------
[linux-jdk9] [INFO] [jenkins-event-spy] Generated /home/jenkins/jenkins-slave/workspace/box_maven-ant-plugin_master-N743QKOWXTZ36LZCK2YK3A6N4ZY3UG7X5RV3MH7PEH646A2IMDHA@tmp/withMaven8e757290/maven-spy-20180713-211722-9122406215407410387963.log
[Pipeline] [windows-jdk8] // dir
[linux-jdk8] [INFO] Final Memory: 53M/2025M
[linux-jdk8] [INFO] ------------------------------------------------------------------------
[linux-jdk8] [INFO] [jenkins-event-spy] Generated /home/jenkins/jenkins-slave/workspace/box_maven-ant-plugin_master-N743QKOWXTZ36LZCK2YK3A6N4ZY3UG7X5RV3MH7PEH646A2IMDHA@tmp/withMaven1965bf94/maven-spy-20180713-211725-2563179934668502006943.log
[linux-jdk10] [INFO] run script verify.bsh
[linux-jdk10] [INFO] ..SUCCESS (2.7 s)
[linux-jdk10] [INFO] Building: relative-path-it/pom.xml
[linux-jdk10] [INFO] run script verify.bsh
[linux-jdk10] [INFO] ..SUCCESS (2.5 s)
[linux-jdk10] [INFO] Building: plugin-it/pom.xml
[linux-jdk10] [INFO] run script verify.bsh
[linux-jdk10] [INFO] ..SUCCESS (4.0 s)
[linux-jdk10] [INFO] Building: skip-missing-junit-it/pom.xml
[linux-jdk10] [INFO] run script verify.bsh
[linux-jdk10] [INFO] ..SUCCESS (2.8 s)
[linux-jdk10] [INFO] Building: plugin-mngt-config-only/pom.xml
[linux-jdk10] [INFO] run script verify.bsh
[linux-jdk10] [INFO] ..SUCCESS (2.4 s)
[linux-jdk10] [INFO]
[linux-jdk10] [INFO] --- maven-invoker-plugin:2.0.0:verify (integration-test) @ maven-ant-plugin ---
[linux-jdk10] [INFO] -------------------------------------------------
[linux-jdk10] [INFO] Build Summary:
[linux-jdk10] [INFO] Passed: 18, Failed: 0, Errors: 0, Skipped: 0
[linux-jdk10] [INFO] -------------------------------------------------
[linux-jdk10] [INFO]
[linux-jdk10] [INFO] --- maven-checkstyle-plugin:2.15:check (checkstyle-check) @ maven-ant-plugin ---
[linux-jdk10] [INFO] Downloading from central: https://repo.maven.apache.org/maven2/org/apache/maven/shared/maven-shared-resources/2/maven-shared-resources-2.pom
[linux-jdk10] [INFO] Downloaded from central: https://repo.maven.apache.org/maven2/org/apache/maven/shared/maven-shared-resources/2/maven-shared-resources-2.pom (3.0 kB at 328 kB/s)
[linux-jdk10] [INFO] Downloading from central: https://repo.maven.apache.org/maven2/org/apache/velocity/velocity/1.6.2/velocity-1.6.2.pom
[linux-jdk10] [INFO] Downloaded from central: https://repo.maven.apache.org/maven2/org/apache/velocity/velocity/1.6.2/velocity-1.6.2.pom (11 kB at 1.8 MB/s)
[linux-jdk10] [INFO] Downloading from central: https://repo.maven.apache.org/maven2/org/apache/maven/doxia/doxia-integration-tools/1.6/doxia-integration-tools-1.6.pom
[linux-jdk10] [INFO] Downloaded from central: https://repo.maven.apache.org/maven2/org/apache/maven/doxia/doxia-integration-tools/1.6/doxia-integration-tools-1.6.pom (7.0 kB at 1.2 MB/s)
[linux-jdk10] [INFO] Downloading from central: https://repo.maven.apache.org/maven2/org/apache/maven/doxia/doxia-tools/3/doxia-tools-3.pom
[linux-jdk10] [INFO] Downloaded from central: https://repo.maven.apache.org/maven2/org/apache/maven/doxia/doxia-tools/3/doxia-tools-3.pom (9.9 kB at 1.4 MB/s)
[linux-jdk10] [INFO] Downloading from central: https://repo.maven.apache.org/maven2/commons-io/commons-io/1.4/commons-io-1.4.pom
[linux-jdk10] [INFO] Downloaded from central: https://repo.maven.apache.org/maven2/commons-io/commons-io/1.4/commons-io-1.4.pom (13 kB at 2.2 MB/s)
[linux-jdk10] [INFO] Downloading from central: https://repo.maven.apache.org/maven2/org/apache/commons/commons-parent/7/commons-parent-7.pom
[linux-jdk10] [INFO] Downloaded from central: https://repo.maven.apache.org/maven2/org/apache/commons/commons-parent/7/commons-parent-7.pom (17 kB at 2.9 MB/s)
[linux-jdk10] [INFO] Downloading from central: https://repo.maven.apache.org/maven2/org/apache/maven/doxia/doxia-logging-api/1.6/doxia-logging-api-1.6.pom
[linux-jdk10] [INFO] Downloaded from central: https://repo.maven.apache.org/maven2/org/apache/maven/doxia/doxia-logging-api/1.6/doxia-logging-api-1.6.pom (1.5 kB at 256 kB/s)
[linux-jdk10] [INFO] Downloading from central: https://repo.maven.apache.org/maven2/org/apache/maven/doxia/doxia/1.6/doxia-1.6.pom
[linux-jdk10] [INFO] Downloaded from central: https://repo.maven.apache.org/maven2/org/apache/maven/doxia/doxia/1.6/doxia-1.6.pom (19 kB at 2.1 MB/s)
[linux-jdk10] [INFO] Downloading from central: https://repo.maven.apache.org/maven2/org/apache/maven/doxia/doxia-decoration-model/1.6/doxia-decoration-model-1.6.pom
[linux-jdk10] [INFO] Downloaded from central: https://repo.maven.apache.org/maven2/org/apache/maven/doxia/doxia-decoration-model/1.6/doxia-decoration-model-1.6.pom (3.0 kB at 499 kB/s)
[linux-jdk10] [INFO] Downloading from central: https://repo.maven.apache.org/maven2/org/apache/maven/doxia/doxia-sitetools/1.6/doxia-sitetools-1.6.pom
[linux-jdk10] [INFO] Downloaded from central: https://repo.maven.apache.org/maven2/org/apache/maven/doxia/doxia-sitetools/1.6/doxia-sitetools-1.6.pom (18 kB at 2.2 MB/s)
[linux-jdk10] [INFO] Downloading from central: https://repo.maven.apache.org/maven2/org/codehaus/plexus/plexus-interpolation/1.14/plexus-interpolation-1.14.pom
[linux-jdk10] [INFO] Downloaded from central: https://repo.maven.apache.org/maven2/org/codehaus/plexus/plexus-interpolation/1.14/plexus-interpolation-1.14.pom (910 B at 152 kB/s)
[linux-jdk10] [INFO] Downloading from central: https://repo.maven.apache.org/maven2/org/codehaus/plexus/plexus-components/1.1.18/plexus-components-1.1.18.pom
[linux-jdk10] [INFO] Downloaded from central: https://repo.maven.apache.org/maven2/org/codehaus/plexus/plexus-components/1.1.18/plexus-components-1.1.18.pom (5.4 kB at 765 kB/s)
[linux-jdk10] [INFO] Downloading from central: https://repo.maven.apache.org/maven2/org/codehaus/plexus/plexus-resources/1.0.1/plexus-resources-1.0.1.pom
[linux-jdk10] [INFO] Downloaded from central: https://repo.maven.apache.org/maven2/org/codehaus/plexus/plexus-resources/1.0.1/plexus-resources-1.0.1.pom (1.3 kB at 220 kB/s)
[linux-jdk10] [INFO] Downloading from central: https://repo.maven.apache.org/maven2/com/puppycrawl/tools/checkstyle/6.1.1/checkstyle-6.1.1.pom
[linux-jdk10] [INFO] Downloaded from central: https://repo.maven.apache.org/maven2/com/puppycrawl/tools/checkstyle/6.1.1/checkstyle-6.1.1.pom (30 kB at 4.3 MB/s)
[linux-jdk10] [INFO] Downloading from central: https://repo.maven.apache.org/maven2/org/sonatype/oss/oss-parent/7/oss-parent-7.pom
[linux-jdk10] [INFO] Downloaded from central: https://repo.maven.apache.org/maven2/org/sonatype/oss/oss-parent/7/oss-parent-7.pom (4.8 kB at 689 kB/s)
[linux-jdk10] [INFO] Downloading from central: https://repo.maven.apache.org/maven2/org/antlr/antlr4-runtime/4.3/antlr4-runtime-4.3.pom
[linux-jdk10] [INFO] Downloaded from central: https://repo.maven.apache.org/maven2/org/antlr/antlr4-runtime/4.3/antlr4-runtime-4.3.pom (4.8 kB at 684 kB/s)
[linux-jdk10] [INFO] Downloading from central: https://repo.maven.apache.org/maven2/org/antlr/antlr4-master/4.3/antlr4-master-4.3.pom
[linux-jdk10] [INFO] Downloaded from central: https://repo.maven.apache.org/maven2/org/antlr/antlr4-master/4.3/antlr4-master-4.3.pom (7.9 kB at 1.3 MB/s)
[linux-jdk10] [INFO] Downloading from central: https://repo.maven.apache.org/maven2/org/abego/treelayout/org.abego.treelayout.core/1.0.1/org.abego.treelayout.core-1.0.1.pom
[linux-jdk10] [INFO] Downloaded from central: https://repo.maven.apache.org/maven2/org/abego/treelayout/org.abego.treelayout.core/1.0.1/org.abego.treelayout.core-1.0.1.pom (3.1 kB at 517 kB/s)
[linux-jdk10] [INFO] Downloading from central: https://repo.maven.apache.org/maven2/org/antlr/antlr4-annotations/4.3/antlr4-annotations-4.3.pom
[linux-jdk10] [INFO] Downloaded from central: https://repo.maven.apache.org/maven2/org/antlr/antlr4-annotations/4.3/antlr4-annotations-4.3.pom (1.3 kB at 141 kB/s)
[linux-jdk10] [INFO] Downloading from central: https://repo.maven.apache.org/maven2/commons-beanutils/commons-beanutils-core/1.8.3/commons-beanutils-core-1.8.3.pom
[linux-jdk10] [INFO] Downloaded from central: https://repo.maven.apache.org/maven2/commons-beanutils/commons-beanutils-core/1.8.3/commons-beanutils-core-1.8.3.pom (1.6 kB at 273 kB/s)
[linux-jdk10] [INFO] Downloading from central: https://repo.maven.apache.org/maven2/com/google/guava/guava/18.0/guava-18.0.pom
[linux-jdk10] [INFO] Downloaded from central: https://repo.maven.apache.org/maven2/com/google/guava/guava/18.0/guava-18.0.pom (5.7 kB at 944 kB/s)
[linux-jdk10] [INFO] Downloading from central: https://repo.maven.apache.org/maven2/com/google/guava/guava-parent/18.0/guava-parent-18.0.pom
[linux-jdk10] [INFO] Downloaded from central: https://repo.maven.apache.org/maven2/com/google/guava/guava-parent/18.0/guava-parent-18.0.pom (7.7 kB at 1.3 MB/s)
[linux-jdk10] [INFO] Downloading from central: https://repo.maven.apache.org/maven2/org/apache/maven/shared/maven-shared-resources/2/maven-shared-resources-2.jar
[linux-jdk10] [INFO] Downloading from central: https://repo.maven.apache.org/maven2/org/apache/maven/doxia/doxia-integration-tools/1.6/doxia-integration-tools-1.6.jar
[linux-jdk10] [INFO] Downloading from central: https://repo.maven.apache.org/maven2/org/codehaus/plexus/plexus-resources/1.0.1/plexus-resources-1.0.1.jar
[linux-jdk10] [INFO] Downloading from central: https://repo.maven.apache.org/maven2/com/puppycrawl/tools/checkstyle/6.1.1/checkstyle-6.1.1.jar
[linux-jdk10] [INFO] Downloading from central: https://repo.maven.apache.org/maven2/commons-io/commons-io/1.4/commons-io-1.4.jar
[linux-jdk10] [INFO] Downloaded from central: https://repo.maven.apache.org/maven2/org/apache/maven/shared/maven-shared-resources/2/maven-shared-resources-2.jar (13 kB at 1.3 MB/s)
[linux-jdk10] [INFO] Downloading from central: https://repo.maven.apache.org/maven2/org/antlr/antlr4-runtime/4.3/antlr4-runtime-4.3.jar
[linux-jdk10] [INFO] Downloaded from central: https://repo.maven.apache.org/maven2/org/apache/maven/doxia/doxia-integration-tools/1.6/doxia-integration-tools-1.6.jar (45 kB at 3.7 MB/s)
[linux-jdk10] [INFO] Downloading from central: https://repo.maven.apache.org/maven2/org/abego/treelayout/org.abego.treelayout.core/1.0.1/org.abego.treelayout.core-1.0.1.jar
[linux-jdk10] [INFO] Downloaded from central: https://repo.maven.apache.org/maven2/org/codehaus/plexus/plexus-resources/1.0.1/plexus-resources-1.0.1.jar (22 kB at 1.8 MB/s)
[linux-jdk10] [INFO] Downloading from central: https://repo.maven.apache.org/maven2/org/antlr/antlr4-annotations/4.3/antlr4-annotations-4.3.jar
[linux-jdk10] [INFO] Downloaded from central: https://repo.maven.apache.org/maven2/commons-io/commons-io/1.4/commons-io-1.4.jar (109 kB at 6.8 MB/s)
[linux-jdk10] [INFO] Downloading from central: https://repo.maven.apache.org/maven2/commons-beanutils/commons-beanutils-core/1.8.3/commons-beanutils-core-1.8.3.jar
[linux-jdk10] [INFO] Downloaded from central: https://repo.maven.apache.org/maven2/org/abego/treelayout/org.abego.treelayout.core/1.0.1/org.abego.treelayout.core-1.0.1.jar (26 kB at 1.3 MB/s)
[linux-jdk10] [INFO] Downloading from central: https://repo.maven.apache.org/maven2/com/google/guava/guava/18.0/guava-18.0.jar
[linux-jdk10] [INFO] Downloaded from central: https://repo.maven.apache.org/maven2/org/antlr/antlr4-annotations/4.3/antlr4-annotations-4.3.jar (10 kB at 506 kB/s)
[linux-jdk10] [INFO] Downloading from central: https://repo.maven.apache.org/maven2/commons-lang/commons-lang/2.1/commons-lang-2.1.jar
[linux-jdk10] [INFO] Downloaded from central: https://repo.maven.apache.org/maven2/org/antlr/antlr4-runtime/4.3/antlr4-runtime-4.3.jar (345 kB at 13 MB/s)
[linux-jdk10] [INFO] Downloaded from central: https://repo.maven.apache.org/maven2/commons-beanutils/commons-beanutils-core/1.8.3/commons-beanutils-core-1.8.3.jar (207 kB at 7.1 MB/s)
[linux-jdk10] [INFO] Downloaded from central: https://repo.maven.apache.org/maven2/commons-lang/commons-lang/2.1/commons-lang-2.1.jar (208 kB at 6.7 MB/s)
[linux-jdk10] [INFO] Downloaded from central: https://repo.maven.apache.org/maven2/com/puppycrawl/tools/checkstyle/6.1.1/checkstyle-6.1.1.jar (1.0 MB at 28 MB/s)
[linux-jdk10] [INFO] Downloaded from central: https://repo.maven.apache.org/maven2/com/google/guava/guava/18.0/guava-18.0.jar (2.3 MB at 32 MB/s)
[linux-jdk10] [INFO] There are 4 errors reported by Checkstyle 6.1.1 with config/maven_checks.xml ruleset.
[linux-jdk10] [INFO] Ignored 4 errors, 0 violation remaining.
[linux-jdk10] [INFO] ------------------------------------------------------------------------
[linux-jdk10] [INFO] BUILD SUCCESS
[linux-jdk10] [INFO] ------------------------------------------------------------------------
[linux-jdk10] [INFO] Total time: 01:26 min
[linux-jdk10] [INFO] Finished at: 2018-07-13T21:19:22Z
[linux-jdk10] [INFO] Final Memory: 36M/127M
[linux-jdk10] [INFO] ------------------------------------------------------------------------
[linux-jdk10] [INFO] [jenkins-event-spy] Generated /home/jenkins/jenkins-slave/workspace/box_maven-ant-plugin_master-N743QKOWXTZ36LZCK2YK3A6N4ZY3UG7X5RV3MH7PEH646A2IMDHA@2@tmp/withMavena357ed66/maven-spy-20180713-211755-63614579323383034828684.log
[Pipeline] [windows-jdk10] }
[Pipeline] [windows-jdk9] }
[windows-jdk9] [withMaven] invokerPublisher - Archive invoker results for Maven artifact MavenArtifact{org.apache.maven.plugins:maven-ant-plugin::2.5-SNAPSHOT(version: 2.5-SNAPSHOT, snapshot:false) } generated by PluginInvocation{org.apache.maven.plugins:maven-invoker-plugin:2.0.0@integration-test integration-test}: m\target\invoker-reports\*.xml
[windows-jdk9] performing MavenInvokerRecorder, reportsFilenamePattern:'**/m\target\invoker-reports/BUILD*.xml', invokerBuildDir:'**/m\target\it'
[windows-jdk9] Found reports:[f:\jenkins\jenkins-slave\workspace\box_maven-ant-plugin_master-N743QKOWXTZ36LZCK2YK3A6N4ZY3UG7X5RV3MH7PEH646A2IMDHA\m\target\invoker-reports\BUILD-clean-custom-files.xml, f:\jenkins\jenkins-slave\workspace\box_maven-ant-plugin_master-N743QKOWXTZ36LZCK2YK3A6N4ZY3UG7X5RV3MH7PEH646A2IMDHA\m\target\invoker-reports\BUILD-clean.xml, f:\jenkins\jenkins-slave\workspace\box_maven-ant-plugin_master-N743QKOWXTZ36LZCK2YK3A6N4ZY3UG7X5RV3MH7PEH646A2IMDHA\m\target\invoker-reports\BUILD-ear-it.xml, f:\jenkins\jenkins-slave\workspace\box_maven-ant-plugin_master-N743QKOWXTZ36LZCK2YK3A6N4ZY3UG7X5RV3MH7PEH646A2IMDHA\m\target\invoker-reports\BUILD-encoding-it.xml, f:\jenkins\jenkins-slave\workspace\box_maven-ant-plugin_master-N743QKOWXTZ36LZCK2YK3A6N4ZY3UG7X5RV3MH7PEH646A2IMDHA\m\target\invoker-reports\BUILD-file-repo-it.xml, f:\jenkins\jenkins-slave\workspace\box_maven-ant-plugin_master-N743QKOWXTZ36LZCK2YK3A6N4ZY3UG7X5RV3MH7PEH646A2IMDHA\m\target\invoker-reports\BUILD-javadoc-it.xml, f:\jenkins\jenkins-slave\workspace\box_maven-ant-plugin_master-N743QKOWXTZ36LZCK2YK3A6N4ZY3UG7X5RV3MH7PEH646A2IMDHA\m\target\invoker-reports\BUILD-plugin-it.xml, f:\jenkins\jenkins-slave\workspace\box_maven-ant-plugin_master-N743QKOWXTZ36LZCK2YK3A6N4ZY3UG7X5RV3MH7PEH646A2IMDHA\m\target\invoker-reports\BUILD-plugin-mngt-config-only.xml, f:\jenkins\jenkins-slave\workspace\box_maven-ant-plugin_master-N743QKOWXTZ36LZCK2YK3A6N4ZY3UG7X5RV3MH7PEH646A2IMDHA\m\target\invoker-reports\BUILD-plugin-mngt-config.xml, f:\jenkins\jenkins-slave\workspace\box_maven-ant-plugin_master-N743QKOWXTZ36LZCK2YK3A6N4ZY3UG7X5RV3MH7PEH646A2IMDHA\m\target\invoker-reports\BUILD-relative-path-it.xml, f:\jenkins\jenkins-slave\workspace\box_maven-ant-plugin_master-N743QKOWXTZ36LZCK2YK3A6N4ZY3UG7X5RV3MH7PEH646A2IMDHA\m\target\invoker-reports\BUILD-single-test-it.xml, f:\jenkins\jenkins-slave\workspace\box_maven-ant-plugin_master-N743QKOWXTZ36LZCK2YK3A6N4ZY3UG7X5RV3MH7PEH646A2IMDHA\m\target\invoker-reports\BUILD-skip-missing-junit-it.xml, f:\jenkins\jenkins-slave\workspace\box_maven-ant-plugin_master-N743QKOWXTZ36LZCK2YK3A6N4ZY3UG7X5RV3MH7PEH646A2IMDHA\m\target\invoker-reports\BUILD-skip-test-compilation-it.xml, f:\jenkins\jenkins-slave\workspace\box_maven-ant-plugin_master-N743QKOWXTZ36LZCK2YK3A6N4ZY3UG7X5RV3MH7PEH646A2IMDHA\m\target\invoker-reports\BUILD-skip-test-execution-it.xml, f:\jenkins\jenkins-slave\workspace\box_maven-ant-plugin_master-N743QKOWXTZ36LZCK2YK3A6N4ZY3UG7X5RV3MH7PEH646A2IMDHA\m\target\invoker-reports\BUILD-system-scope-dep.xml, f:\jenkins\jenkins-slave\workspace\box_maven-ant-plugin_master-N743QKOWXTZ36LZCK2YK3A6N4ZY3UG7X5RV3MH7PEH646A2IMDHA\m\target\invoker-reports\BUILD-test-custom-selector-it.xml, f:\jenkins\jenkins-slave\workspace\box_maven-ant-plugin_master-N743QKOWXTZ36LZCK2YK3A6N4ZY3UG7X5RV3MH7PEH646A2IMDHA\m\target\invoker-reports\BUILD-test-default-selector-it.xml, f:\jenkins\jenkins-slave\workspace\box_maven-ant-plugin_master-N743QKOWXTZ36LZCK2YK3A6N4ZY3UG7X5RV3MH7PEH646A2IMDHA\m\target\invoker-reports\BUILD-webapp-it.xml]
[windows-jdk9] Found logs:[f:\jenkins\jenkins-slave\workspace\box_maven-ant-plugin_master-N743QKOWXTZ36LZCK2YK3A6N4ZY3UG7X5RV3MH7PEH646A2IMDHA\m\target\it\clean-custom-files\build.log, f:\jenkins\jenkins-slave\workspace\box_maven-ant-plugin_master-N743QKOWXTZ36LZCK2YK3A6N4ZY3UG7X5RV3MH7PEH646A2IMDHA\m\target\it\clean\build.log, f:\jenkins\jenkins-slave\workspace\box_maven-ant-plugin_master-N743QKOWXTZ36LZCK2YK3A6N4ZY3UG7X5RV3MH7PEH646A2IMDHA\m\target\it\ear-it\build.log, f:\jenkins\jenkins-slave\workspace\box_maven-ant-plugin_master-N743QKOWXTZ36LZCK2YK3A6N4ZY3UG7X5RV3MH7PEH646A2IMDHA\m\target\it\encoding-it\build.log, f:\jenkins\jenkins-slave\workspace\box_maven-ant-plugin_master-N743QKOWXTZ36LZCK2YK3A6N4ZY3UG7X5RV3MH7PEH646A2IMDHA\m\target\it\file-repo-it\build.log, f:\jenkins\jenkins-slave\workspace\box_maven-ant-plugin_master-N743QKOWXTZ36LZCK2YK3A6N4ZY3UG7X5RV3MH7PEH646A2IMDHA\m\target\it\javadoc-it\build.log, f:\jenkins\jenkins-slave\workspace\box_maven-ant-plugin_master-N743QKOWXTZ36LZCK2YK3A6N4ZY3UG7X5RV3MH7PEH646A2IMDHA\m\target\it\plugin-it\build.log, f:\jenkins\jenkins-slave\workspace\box_maven-ant-plugin_master-N743QKOWXTZ36LZCK2YK3A6N4ZY3UG7X5RV3MH7PEH646A2IMDHA\m\target\it\plugin-mngt-config-only\build.log, f:\jenkins\jenkins-slave\workspace\box_maven-ant-plugin_master-N743QKOWXTZ36LZCK2YK3A6N4ZY3UG7X5RV3MH7PEH646A2IMDHA\m\target\it\plugin-mngt-config\build.log, f:\jenkins\jenkins-slave\workspace\box_maven-ant-plugin_master-N743QKOWXTZ36LZCK2YK3A6N4ZY3UG7X5RV3MH7PEH646A2IMDHA\m\target\it\relative-path-it\build.log, f:\jenkins\jenkins-slave\workspace\box_maven-ant-plugin_master-N743QKOWXTZ36LZCK2YK3A6N4ZY3UG7X5RV3MH7PEH646A2IMDHA\m\target\it\single-test-it\build.log, f:\jenkins\jenkins-slave\workspace\box_maven-ant-plugin_master-N743QKOWXTZ36LZCK2YK3A6N4ZY3UG7X5RV3MH7PEH646A2IMDHA\m\target\it\skip-missing-junit-it\build.log, f:\jenkins\jenkins-slave\workspace\box_maven-ant-plugin_master-N743QKOWXTZ36LZCK2YK3A6N4ZY3UG7X5RV3MH7PEH646A2IMDHA\m\target\it\skip-test-compilation-it\build.log, f:\jenkins\jenkins-slave\workspace\box_maven-ant-plugin_master-N743QKOWXTZ36LZCK2YK3A6N4ZY3UG7X5RV3MH7PEH646A2IMDHA\m\target\it\skip-test-execution-it\build.log, f:\jenkins\jenkins-slave\workspace\box_maven-ant-plugin_master-N743QKOWXTZ36LZCK2YK3A6N4ZY3UG7X5RV3MH7PEH646A2IMDHA\m\target\it\system-scope-dep\build.log, f:\jenkins\jenkins-slave\workspace\box_maven-ant-plugin_master-N743QKOWXTZ36LZCK2YK3A6N4ZY3UG7X5RV3MH7PEH646A2IMDHA\m\target\it\test-custom-selector-it\build.log, f:\jenkins\jenkins-slave\workspace\box_maven-ant-plugin_master-N743QKOWXTZ36LZCK2YK3A6N4ZY3UG7X5RV3MH7PEH646A2IMDHA\m\target\it\test-default-selector-it\build.log, f:\jenkins\jenkins-slave\workspace\box_maven-ant-plugin_master-N743QKOWXTZ36LZCK2YK3A6N4ZY3UG7X5RV3MH7PEH646A2IMDHA\m\target\it\webapp-it\build.log]
[windows-jdk9] Finished parsing Maven Invoker results (found 18)
[windows-jdk9] [withMaven] junitPublisher - Archive test results for Maven artifact org.apache.maven.plugins:maven-ant-plugin:2.5-SNAPSHOT generated by maven-surefire-plugin:test (default-test): m\target\surefire-reports\*.xml
[windows-jdk9] Recording test results
[windows-jdk9] [withMaven] junitPublisher - Archive test results for Maven artifact org.apache.maven.plugins.maven-ant-plugin.it.ear-it.projects:logging:1.0 generated by maven-surefire-plugin:test (default-test): m\target\it\ear-it\projects\logging\target\surefire-reports\*.xml
[windows-jdk9] Recording test results
[windows-jdk9] None of the test reports contained any result
[windows-jdk9] [withMaven] junitPublisher - Archive test results for Maven artifact org.apache.maven.plugins.maven-ant-plugin.it.ear-it:primary-source:1.0 generated by maven-surefire-plugin:test (default-test): m\target\it\ear-it\primary-source\target\surefire-reports\*.xml
[windows-jdk9] Recording test results
[windows-jdk9] None of the test reports contained any result
[windows-jdk9] [withMaven] junitPublisher - Archive test results for Maven artifact org.apache.maven.plugins.maven-ant-plugin.it.ear-it.servlets:servlet:1.0 generated by maven-surefire-plugin:test (default-test): m\target\it\ear-it\servlets\servlet\target\surefire-reports\*.xml
[windows-jdk9] Recording test results
[windows-jdk9] None of the test reports contained any result
[windows-jdk9] [withMaven] junitPublisher - Archive test results for Maven artifact org.apache.maven.plugins.maven-ant-plugin.it.ear-it:ejbs:1.0 generated by maven-surefire-plugin:test (default-test): m\target\it\ear-it\ejbs\target\surefire-reports\*.xml
[windows-jdk9] Recording test results
[windows-jdk9] None of the test reports contained any result
[Pipeline] [windows-jdk8] }
[windows-jdk8] [withMaven] invokerPublisher - Archive invoker results for Maven artifact MavenArtifact{org.apache.maven.plugins:maven-ant-plugin::2.5-SNAPSHOT(version: 2.5-SNAPSHOT, snapshot:false) } generated by PluginInvocation{org.apache.maven.plugins:maven-invoker-plugin:2.0.0@integration-test integration-test}: m\target\invoker-reports\*.xml
[windows-jdk8] performing MavenInvokerRecorder, reportsFilenamePattern:'**/m\target\invoker-reports/BUILD*.xml', invokerBuildDir:'**/m\target\it'
[windows-jdk8] Found reports:[f:\jenkins\jenkins-slave\workspace\box_maven-ant-plugin_master-N743QKOWXTZ36LZCK2YK3A6N4ZY3UG7X5RV3MH7PEH646A2IMDHA@2\m\target\invoker-reports\BUILD-clean-custom-files.xml, f:\jenkins\jenkins-slave\workspace\box_maven-ant-plugin_master-N743QKOWXTZ36LZCK2YK3A6N4ZY3UG7X5RV3MH7PEH646A2IMDHA@2\m\target\invoker-reports\BUILD-clean.xml, f:\jenkins\jenkins-slave\workspace\box_maven-ant-plugin_master-N743QKOWXTZ36LZCK2YK3A6N4ZY3UG7X5RV3MH7PEH646A2IMDHA@2\m\target\invoker-reports\BUILD-ear-it.xml, f:\jenkins\jenkins-slave\workspace\box_maven-ant-plugin_master-N743QKOWXTZ36LZCK2YK3A6N4ZY3UG7X5RV3MH7PEH646A2IMDHA@2\m\target\invoker-reports\BUILD-encoding-it.xml, f:\jenkins\jenkins-slave\workspace\box_maven-ant-plugin_master-N743QKOWXTZ36LZCK2YK3A6N4ZY3UG7X5RV3MH7PEH646A2IMDHA@2\m\target\invoker-reports\BUILD-file-repo-it.xml, f:\jenkins\jenkins-slave\workspace\box_maven-ant-plugin_master-N743QKOWXTZ36LZCK2YK3A6N4ZY3UG7X5RV3MH7PEH646A2IMDHA@2\m\target\invoker-reports\BUILD-javadoc-it.xml, f:\jenkins\jenkins-slave\workspace\box_maven-ant-plugin_master-N743QKOWXTZ36LZCK2YK3A6N4ZY3UG7X5RV3MH7PEH646A2IMDHA@2\m\target\invoker-reports\BUILD-plugin-it.xml, f:\jenkins\jenkins-slave\workspace\box_maven-ant-plugin_master-N743QKOWXTZ36LZCK2YK3A6N4ZY3UG7X5RV3MH7PEH646A2IMDHA@2\m\target\invoker-reports\BUILD-plugin-mngt-config-only.xml, f:\jenkins\jenkins-slave\workspace\box_maven-ant-plugin_master-N743QKOWXTZ36LZCK2YK3A6N4ZY3UG7X5RV3MH7PEH646A2IMDHA@2\m\target\invoker-reports\BUILD-plugin-mngt-config.xml, f:\jenkins\jenkins-slave\workspace\box_maven-ant-plugin_master-N743QKOWXTZ36LZCK2YK3A6N4ZY3UG7X5RV3MH7PEH646A2IMDHA@2\m\target\invoker-reports\BUILD-relative-path-it.xml, f:\jenkins\jenkins-slave\workspace\box_maven-ant-plugin_master-N743QKOWXTZ36LZCK2YK3A6N4ZY3UG7X5RV3MH7PEH646A2IMDHA@2\m\target\invoker-reports\BUILD-single-test-it.xml, f:\jenkins\jenkins-slave\workspace\box_maven-ant-plugin_master-N743QKOWXTZ36LZCK2YK3A6N4ZY3UG7X5RV3MH7PEH646A2IMDHA@2\m\target\invoker-reports\BUILD-skip-missing-junit-it.xml, f:\jenkins\jenkins-slave\workspace\box_maven-ant-plugin_master-N743QKOWXTZ36LZCK2YK3A6N4ZY3UG7X5RV3MH7PEH646A2IMDHA@2\m\target\invoker-reports\BUILD-skip-test-compilation-it.xml, f:\jenkins\jenkins-slave\workspace\box_maven-ant-plugin_master-N743QKOWXTZ36LZCK2YK3A6N4ZY3UG7X5RV3MH7PEH646A2IMDHA@2\m\target\invoker-reports\BUILD-skip-test-execution-it.xml, f:\jenkins\jenkins-slave\workspace\box_maven-ant-plugin_master-N743QKOWXTZ36LZCK2YK3A6N4ZY3UG7X5RV3MH7PEH646A2IMDHA@2\m\target\invoker-reports\BUILD-system-scope-dep.xml, f:\jenkins\jenkins-slave\workspace\box_maven-ant-plugin_master-N743QKOWXTZ36LZCK2YK3A6N4ZY3UG7X5RV3MH7PEH646A2IMDHA@2\m\target\invoker-reports\BUILD-test-custom-selector-it.xml, f:\jenkins\jenkins-slave\workspace\box_maven-ant-plugin_master-N743QKOWXTZ36LZCK2YK3A6N4ZY3UG7X5RV3MH7PEH646A2IMDHA@2\m\target\invoker-reports\BUILD-test-default-selector-it.xml, f:\jenkins\jenkins-slave\workspace\box_maven-ant-plugin_master-N743QKOWXTZ36LZCK2YK3A6N4ZY3UG7X5RV3MH7PEH646A2IMDHA@2\m\target\invoker-reports\BUILD-webapp-it.xml]
[windows-jdk8] Found logs:[f:\jenkins\jenkins-slave\workspace\box_maven-ant-plugin_master-N743QKOWXTZ36LZCK2YK3A6N4ZY3UG7X5RV3MH7PEH646A2IMDHA@2\m\target\it\clean-custom-files\build.log, f:\jenkins\jenkins-slave\workspace\box_maven-ant-plugin_master-N743QKOWXTZ36LZCK2YK3A6N4ZY3UG7X5RV3MH7PEH646A2IMDHA@2\m\target\it\clean\build.log, f:\jenkins\jenkins-slave\workspace\box_maven-ant-plugin_master-N743QKOWXTZ36LZCK2YK3A6N4ZY3UG7X5RV3MH7PEH646A2IMDHA@2\m\target\it\ear-it\build.log, f:\jenkins\jenkins-slave\workspace\box_maven-ant-plugin_master-N743QKOWXTZ36LZCK2YK3A6N4ZY3UG7X5RV3MH7PEH646A2IMDHA@2\m\target\it\encoding-it\build.log, f:\jenkins\jenkins-slave\workspace\box_maven-ant-plugin_master-N743QKOWXTZ36LZCK2YK3A6N4ZY3UG7X5RV3MH7PEH646A2IMDHA@2\m\target\it\file-repo-it\build.log, f:\jenkins\jenkins-slave\workspace\box_maven-ant-plugin_master-N743QKOWXTZ36LZCK2YK3A6N4ZY3UG7X5RV3MH7PEH646A2IMDHA@2\m\target\it\javadoc-it\build.log, f:\jenkins\jenkins-slave\workspace\box_maven-ant-plugin_master-N743QKOWXTZ36LZCK2YK3A6N4ZY3UG7X5RV3MH7PEH646A2IMDHA@2\m\target\it\plugin-it\build.log, f:\jenkins\jenkins-slave\workspace\box_maven-ant-plugin_master-N743QKOWXTZ36LZCK2YK3A6N4ZY3UG7X5RV3MH7PEH646A2IMDHA@2\m\target\it\plugin-mngt-config-only\build.log, f:\jenkins\jenkins-slave\workspace\box_maven-ant-plugin_master-N743QKOWXTZ36LZCK2YK3A6N4ZY3UG7X5RV3MH7PEH646A2IMDHA@2\m\target\it\plugin-mngt-config\build.log, f:\jenkins\jenkins-slave\workspace\box_maven-ant-plugin_master-N743QKOWXTZ36LZCK2YK3A6N4ZY3UG7X5RV3MH7PEH646A2IMDHA@2\m\target\it\relative-path-it\build.log, f:\jenkins\jenkins-slave\workspace\box_maven-ant-plugin_master-N743QKOWXTZ36LZCK2YK3A6N4ZY3UG7X5RV3MH7PEH646A2IMDHA@2\m\target\it\single-test-it\build.log, f:\jenkins\jenkins-slave\workspace\box_maven-ant-plugin_master-N743QKOWXTZ36LZCK2YK3A6N4ZY3UG7X5RV3MH7PEH646A2IMDHA@2\m\target\it\skip-missing-junit-it\build.log, f:\jenkins\jenkins-slave\workspace\box_maven-ant-plugin_master-N743QKOWXTZ36LZCK2YK3A6N4ZY3UG7X5RV3MH7PEH646A2IMDHA@2\m\target\it\skip-test-compilation-it\build.log, f:\jenkins\jenkins-slave\workspace\box_maven-ant-plugin_master-N743QKOWXTZ36LZCK2YK3A6N4ZY3UG7X5RV3MH7PEH646A2IMDHA@2\m\target\it\skip-test-execution-it\build.log, f:\jenkins\jenkins-slave\workspace\box_maven-ant-plugin_master-N743QKOWXTZ36LZCK2YK3A6N4ZY3UG7X5RV3MH7PEH646A2IMDHA@2\m\target\it\system-scope-dep\build.log, f:\jenkins\jenkins-slave\workspace\box_maven-ant-plugin_master-N743QKOWXTZ36LZCK2YK3A6N4ZY3UG7X5RV3MH7PEH646A2IMDHA@2\m\target\it\test-custom-selector-it\build.log, f:\jenkins\jenkins-slave\workspace\box_maven-ant-plugin_master-N743QKOWXTZ36LZCK2YK3A6N4ZY3UG7X5RV3MH7PEH646A2IMDHA@2\m\target\it\test-default-selector-it\build.log, f:\jenkins\jenkins-slave\workspace\box_maven-ant-plugin_master-N743QKOWXTZ36LZCK2YK3A6N4ZY3UG7X5RV3MH7PEH646A2IMDHA@2\m\target\it\webapp-it\build.log]
[windows-jdk8] Finished parsing Maven Invoker results (found 18)
[windows-jdk8] [withMaven] junitPublisher - Archive test results for Maven artifact org.apache.maven.plugins:maven-ant-plugin:2.5-SNAPSHOT generated by maven-surefire-plugin:test (default-test): m\target\surefire-reports\*.xml
[windows-jdk8] Recording test results
[windows-jdk8] [withMaven] junitPublisher - Archive test results for Maven artifact org.apache.maven.plugins.maven-ant-plugin.it.ear-it.projects:logging:1.0 generated by maven-surefire-plugin:test (default-test): m\target\it\ear-it\projects\logging\target\surefire-reports\*.xml
[windows-jdk8] Recording test results
[windows-jdk8] None of the test reports contained any result
[windows-jdk8] [withMaven] junitPublisher - Archive test results for Maven artifact org.apache.maven.plugins.maven-ant-plugin.it.ear-it:primary-source:1.0 generated by maven-surefire-plugin:test (default-test): m\target\it\ear-it\primary-source\target\surefire-reports\*.xml
[windows-jdk8] Recording test results
[windows-jdk8] None of the test reports contained any result
[windows-jdk8] [withMaven] junitPublisher - Archive test results for Maven artifact org.apache.maven.plugins.maven-ant-plugin.it.ear-it.servlets:servlet:1.0 generated by maven-surefire-plugin:test (default-test): m\target\it\ear-it\servlets\servlet\target\surefire-reports\*.xml
[windows-jdk8] Recording test results
[windows-jdk8] None of the test reports contained any result
[windows-jdk8] [withMaven] junitPublisher - Archive test results for Maven artifact org.apache.maven.plugins.maven-ant-plugin.it.ear-it:ejbs:1.0 generated by maven-surefire-plugin:test (default-test): m\target\it\ear-it\ejbs\target\surefire-reports\*.xml
[windows-jdk8] Recording test results
[windows-jdk8] None of the test reports contained any result
[Pipeline] [windows-jdk10] // node
[Pipeline] [windows-jdk9] // withMaven
[Pipeline] [windows-jdk8] // withMaven
[Pipeline] [windows-jdk10] }
[Pipeline] [windows-jdk9] }
[Pipeline] [windows-jdk8] }
[Pipeline] [linux-jdk9] }
[Pipeline] [linux-jdk8] }
[Pipeline] [linux-jdk10] }
[Pipeline] [windows-jdk9] // stage
[Pipeline] [windows-jdk8] // stage
[Pipeline] [linux-jdk9] // dir
[Pipeline] [linux-jdk8] // dir
[Pipeline] [linux-jdk10] // dir
[Pipeline] [windows-jdk8] }
[Pipeline] [windows-jdk9] }
[Pipeline] [linux-jdk9] }
[linux-jdk9] [withMaven] invokerPublisher - Archive invoker results for Maven artifact MavenArtifact{org.apache.maven.plugins:maven-ant-plugin::2.5-SNAPSHOT(version: 2.5-SNAPSHOT, snapshot:false) } generated by PluginInvocation{org.apache.maven.plugins:maven-invoker-plugin:2.0.0@integration-test integration-test}: m/target/invoker-reports/*.xml
[linux-jdk9] performing MavenInvokerRecorder, reportsFilenamePattern:'**/m/target/invoker-reports/BUILD*.xml', invokerBuildDir:'**/m/target/it'
[linux-jdk9] Found reports:[/home/jenkins/jenkins-slave/workspace/box_maven-ant-plugin_master-N743QKOWXTZ36LZCK2YK3A6N4ZY3UG7X5RV3MH7PEH646A2IMDHA/m/target/invoker-reports/BUILD-clean-custom-files.xml, /home/jenkins/jenkins-slave/workspace/box_maven-ant-plugin_master-N743QKOWXTZ36LZCK2YK3A6N4ZY3UG7X5RV3MH7PEH646A2IMDHA/m/target/invoker-reports/BUILD-clean.xml, /home/jenkins/jenkins-slave/workspace/box_maven-ant-plugin_master-N743QKOWXTZ36LZCK2YK3A6N4ZY3UG7X5RV3MH7PEH646A2IMDHA/m/target/invoker-reports/BUILD-ear-it.xml, /home/jenkins/jenkins-slave/workspace/box_maven-ant-plugin_master-N743QKOWXTZ36LZCK2YK3A6N4ZY3UG7X5RV3MH7PEH646A2IMDHA/m/target/invoker-reports/BUILD-encoding-it.xml, /home/jenkins/jenkins-slave/workspace/box_maven-ant-plugin_master-N743QKOWXTZ36LZCK2YK3A6N4ZY3UG7X5RV3MH7PEH646A2IMDHA/m/target/invoker-reports/BUILD-file-repo-it.xml, /home/jenkins/jenkins-slave/workspace/box_maven-ant-plugin_master-N743QKOWXTZ36LZCK2YK3A6N4ZY3UG7X5RV3MH7PEH646A2IMDHA/m/target/invoker-reports/BUILD-javadoc-it.xml, /home/jenkins/jenkins-slave/workspace/box_maven-ant-plugin_master-N743QKOWXTZ36LZCK2YK3A6N4ZY3UG7X5RV3MH7PEH646A2IMDHA/m/target/invoker-reports/BUILD-plugin-it.xml, /home/jenkins/jenkins-slave/workspace/box_maven-ant-plugin_master-N743QKOWXTZ36LZCK2YK3A6N4ZY3UG7X5RV3MH7PEH646A2IMDHA/m/target/invoker-reports/BUILD-plugin-mngt-config-only.xml, /home/jenkins/jenkins-slave/workspace/box_maven-ant-plugin_master-N743QKOWXTZ36LZCK2YK3A6N4ZY3UG7X5RV3MH7PEH646A2IMDHA/m/target/invoker-reports/BUILD-plugin-mngt-config.xml, /home/jenkins/jenkins-slave/workspace/box_maven-ant-plugin_master-N743QKOWXTZ36LZCK2YK3A6N4ZY3UG7X5RV3MH7PEH646A2IMDHA/m/target/invoker-reports/BUILD-relative-path-it.xml, /home/jenkins/jenkins-slave/workspace/box_maven-ant-plugin_master-N743QKOWXTZ36LZCK2YK3A6N4ZY3UG7X5RV3MH7PEH646A2IMDHA/m/target/invoker-reports/BUILD-single-test-it.xml, /home/jenkins/jenkins-slave/workspace/box_maven-ant-plugin_master-N743QKOWXTZ36LZCK2YK3A6N4ZY3UG7X5RV3MH7PEH646A2IMDHA/m/target/invoker-reports/BUILD-skip-missing-junit-it.xml, /home/jenkins/jenkins-slave/workspace/box_maven-ant-plugin_master-N743QKOWXTZ36LZCK2YK3A6N4ZY3UG7X5RV3MH7PEH646A2IMDHA/m/target/invoker-reports/BUILD-skip-test-compilation-it.xml, /home/jenkins/jenkins-slave/workspace/box_maven-ant-plugin_master-N743QKOWXTZ36LZCK2YK3A6N4ZY3UG7X5RV3MH7PEH646A2IMDHA/m/target/invoker-reports/BUILD-skip-test-execution-it.xml, /home/jenkins/jenkins-slave/workspace/box_maven-ant-plugin_master-N743QKOWXTZ36LZCK2YK3A6N4ZY3UG7X5RV3MH7PEH646A2IMDHA/m/target/invoker-reports/BUILD-system-scope-dep.xml, /home/jenkins/jenkins-slave/workspace/box_maven-ant-plugin_master-N743QKOWXTZ36LZCK2YK3A6N4ZY3UG7X5RV3MH7PEH646A2IMDHA/m/target/invoker-reports/BUILD-test-custom-selector-it.xml, /home/jenkins/jenkins-slave/workspace/box_maven-ant-plugin_master-N743QKOWXTZ36LZCK2YK3A6N4ZY3UG7X5RV3MH7PEH646A2IMDHA/m/target/invoker-reports/BUILD-test-default-selector-it.xml, /home/jenkins/jenkins-slave/workspace/box_maven-ant-plugin_master-N743QKOWXTZ36LZCK2YK3A6N4ZY3UG7X5RV3MH7PEH646A2IMDHA/m/target/invoker-reports/BUILD-webapp-it.xml]
[linux-jdk9] Found logs:[/home/jenkins/jenkins-slave/workspace/box_maven-ant-plugin_master-N743QKOWXTZ36LZCK2YK3A6N4ZY3UG7X5RV3MH7PEH646A2IMDHA/m/target/it/clean-custom-files/build.log, /home/jenkins/jenkins-slave/workspace/box_maven-ant-plugin_master-N743QKOWXTZ36LZCK2YK3A6N4ZY3UG7X5RV3MH7PEH646A2IMDHA/m/target/it/clean/build.log, /home/jenkins/jenkins-slave/workspace/box_maven-ant-plugin_master-N743QKOWXTZ36LZCK2YK3A6N4ZY3UG7X5RV3MH7PEH646A2IMDHA/m/target/it/ear-it/build.log, /home/jenkins/jenkins-slave/workspace/box_maven-ant-plugin_master-N743QKOWXTZ36LZCK2YK3A6N4ZY3UG7X5RV3MH7PEH646A2IMDHA/m/target/it/encoding-it/build.log, /home/jenkins/jenkins-slave/workspace/box_maven-ant-plugin_master-N743QKOWXTZ36LZCK2YK3A6N4ZY3UG7X5RV3MH7PEH646A2IMDHA/m/target/it/file-repo-it/build.log, /home/jenkins/jenkins-slave/workspace/box_maven-ant-plugin_master-N743QKOWXTZ36LZCK2YK3A6N4ZY3UG7X5RV3MH7PEH646A2IMDHA/m/target/it/javadoc-it/build.log, /home/jenkins/jenkins-slave/workspace/box_maven-ant-plugin_master-N743QKOWXTZ36LZCK2YK3A6N4ZY3UG7X5RV3MH7PEH646A2IMDHA/m/target/it/plugin-it/build.log, /home/jenkins/jenkins-slave/workspace/box_maven-ant-plugin_master-N743QKOWXTZ36LZCK2YK3A6N4ZY3UG7X5RV3MH7PEH646A2IMDHA/m/target/it/plugin-mngt-config-only/build.log, /home/jenkins/jenkins-slave/workspace/box_maven-ant-plugin_master-N743QKOWXTZ36LZCK2YK3A6N4ZY3UG7X5RV3MH7PEH646A2IMDHA/m/target/it/plugin-mngt-config/build.log, /home/jenkins/jenkins-slave/workspace/box_maven-ant-plugin_master-N743QKOWXTZ36LZCK2YK3A6N4ZY3UG7X5RV3MH7PEH646A2IMDHA/m/target/it/relative-path-it/build.log, /home/jenkins/jenkins-slave/workspace/box_maven-ant-plugin_master-N743QKOWXTZ36LZCK2YK3A6N4ZY3UG7X5RV3MH7PEH646A2IMDHA/m/target/it/single-test-it/build.log, /home/jenkins/jenkins-slave/workspace/box_maven-ant-plugin_master-N743QKOWXTZ36LZCK2YK3A6N4ZY3UG7X5RV3MH7PEH646A2IMDHA/m/target/it/skip-missing-junit-it/build.log, /home/jenkins/jenkins-slave/workspace/box_maven-ant-plugin_master-N743QKOWXTZ36LZCK2YK3A6N4ZY3UG7X5RV3MH7PEH646A2IMDHA/m/target/it/skip-test-compilation-it/build.log, /home/jenkins/jenkins-slave/workspace/box_maven-ant-plugin_master-N743QKOWXTZ36LZCK2YK3A6N4ZY3UG7X5RV3MH7PEH646A2IMDHA/m/target/it/skip-test-execution-it/build.log, /home/jenkins/jenkins-slave/workspace/box_maven-ant-plugin_master-N743QKOWXTZ36LZCK2YK3A6N4ZY3UG7X5RV3MH7PEH646A2IMDHA/m/target/it/system-scope-dep/build.log, /home/jenkins/jenkins-slave/workspace/box_maven-ant-plugin_master-N743QKOWXTZ36LZCK2YK3A6N4ZY3UG7X5RV3MH7PEH646A2IMDHA/m/target/it/test-custom-selector-it/build.log, /home/jenkins/jenkins-slave/workspace/box_maven-ant-plugin_master-N743QKOWXTZ36LZCK2YK3A6N4ZY3UG7X5RV3MH7PEH646A2IMDHA/m/target/it/test-default-selector-it/build.log, /home/jenkins/jenkins-slave/workspace/box_maven-ant-plugin_master-N743QKOWXTZ36LZCK2YK3A6N4ZY3UG7X5RV3MH7PEH646A2IMDHA/m/target/it/webapp-it/build.log]
[linux-jdk9] Finished parsing Maven Invoker results (found 18)
[linux-jdk9] [withMaven] junitPublisher - Archive test results for Maven artifact org.apache.maven.plugins:maven-ant-plugin:2.5-SNAPSHOT generated by maven-surefire-plugin:test (default-test): m/target/surefire-reports/*.xml
[linux-jdk9] Recording test results
[linux-jdk9] [withMaven] junitPublisher - Archive test results for Maven artifact org.apache.maven.plugins.maven-ant-plugin.it.ear-it.projects:logging:1.0 generated by maven-surefire-plugin:test (default-test): m/target/it/ear-it/projects/logging/target/surefire-reports/*.xml
[linux-jdk9] Recording test results
[linux-jdk9] None of the test reports contained any result
[linux-jdk9] [withMaven] junitPublisher - Archive test results for Maven artifact org.apache.maven.plugins.maven-ant-plugin.it.ear-it:primary-source:1.0 generated by maven-surefire-plugin:test (default-test): m/target/it/ear-it/primary-source/target/surefire-reports/*.xml
[linux-jdk9] Recording test results
[linux-jdk9] None of the test reports contained any result
[linux-jdk9] [withMaven] junitPublisher - Archive test results for Maven artifact org.apache.maven.plugins.maven-ant-plugin.it.ear-it.servlets:servlet:1.0 generated by maven-surefire-plugin:test (default-test): m/target/it/ear-it/servlets/servlet/target/surefire-reports/*.xml
[linux-jdk9] Recording test results
[linux-jdk9] None of the test reports contained any result
[linux-jdk9] [withMaven] junitPublisher - Archive test results for Maven artifact org.apache.maven.plugins.maven-ant-plugin.it.ear-it:ejbs:1.0 generated by maven-surefire-plugin:test (default-test): m/target/it/ear-it/ejbs/target/surefire-reports/*.xml
[linux-jdk9] Recording test results
[linux-jdk9] None of the test reports contained any result
[Pipeline] [linux-jdk8] }
[linux-jdk8] [withMaven] invokerPublisher - Archive invoker results for Maven artifact MavenArtifact{org.apache.maven.plugins:maven-ant-plugin::2.5-SNAPSHOT(version: 2.5-SNAPSHOT, snapshot:false) } generated by PluginInvocation{org.apache.maven.plugins:maven-invoker-plugin:2.0.0@integration-test integration-test}: m/target/invoker-reports/*.xml
[linux-jdk8] performing MavenInvokerRecorder, reportsFilenamePattern:'**/m/target/invoker-reports/BUILD*.xml', invokerBuildDir:'**/m/target/it'
[linux-jdk8] Found reports:[/home/jenkins/jenkins-slave/workspace/box_maven-ant-plugin_master-N743QKOWXTZ36LZCK2YK3A6N4ZY3UG7X5RV3MH7PEH646A2IMDHA/m/target/invoker-reports/BUILD-clean-custom-files.xml, /home/jenkins/jenkins-slave/workspace/box_maven-ant-plugin_master-N743QKOWXTZ36LZCK2YK3A6N4ZY3UG7X5RV3MH7PEH646A2IMDHA/m/target/invoker-reports/BUILD-clean.xml, /home/jenkins/jenkins-slave/workspace/box_maven-ant-plugin_master-N743QKOWXTZ36LZCK2YK3A6N4ZY3UG7X5RV3MH7PEH646A2IMDHA/m/target/invoker-reports/BUILD-ear-it.xml, /home/jenkins/jenkins-slave/workspace/box_maven-ant-plugin_master-N743QKOWXTZ36LZCK2YK3A6N4ZY3UG7X5RV3MH7PEH646A2IMDHA/m/target/invoker-reports/BUILD-encoding-it.xml, /home/jenkins/jenkins-slave/workspace/box_maven-ant-plugin_master-N743QKOWXTZ36LZCK2YK3A6N4ZY3UG7X5RV3MH7PEH646A2IMDHA/m/target/invoker-reports/BUILD-file-repo-it.xml, /home/jenkins/jenkins-slave/workspace/box_maven-ant-plugin_master-N743QKOWXTZ36LZCK2YK3A6N4ZY3UG7X5RV3MH7PEH646A2IMDHA/m/target/invoker-reports/BUILD-javadoc-it.xml, /home/jenkins/jenkins-slave/workspace/box_maven-ant-plugin_master-N743QKOWXTZ36LZCK2YK3A6N4ZY3UG7X5RV3MH7PEH646A2IMDHA/m/target/invoker-reports/BUILD-plugin-it.xml, /home/jenkins/jenkins-slave/workspace/box_maven-ant-plugin_master-N743QKOWXTZ36LZCK2YK3A6N4ZY3UG7X5RV3MH7PEH646A2IMDHA/m/target/invoker-reports/BUILD-plugin-mngt-config-only.xml, /home/jenkins/jenkins-slave/workspace/box_maven-ant-plugin_master-N743QKOWXTZ36LZCK2YK3A6N4ZY3UG7X5RV3MH7PEH646A2IMDHA/m/target/invoker-reports/BUILD-plugin-mngt-config.xml, /home/jenkins/jenkins-slave/workspace/box_maven-ant-plugin_master-N743QKOWXTZ36LZCK2YK3A6N4ZY3UG7X5RV3MH7PEH646A2IMDHA/m/target/invoker-reports/BUILD-relative-path-it.xml, /home/jenkins/jenkins-slave/workspace/box_maven-ant-plugin_master-N743QKOWXTZ36LZCK2YK3A6N4ZY3UG7X5RV3MH7PEH646A2IMDHA/m/target/invoker-reports/BUILD-single-test-it.xml, /home/jenkins/jenkins-slave/workspace/box_maven-ant-plugin_master-N743QKOWXTZ36LZCK2YK3A6N4ZY3UG7X5RV3MH7PEH646A2IMDHA/m/target/invoker-reports/BUILD-skip-missing-junit-it.xml, /home/jenkins/jenkins-slave/workspace/box_maven-ant-plugin_master-N743QKOWXTZ36LZCK2YK3A6N4ZY3UG7X5RV3MH7PEH646A2IMDHA/m/target/invoker-reports/BUILD-skip-test-compilation-it.xml, /home/jenkins/jenkins-slave/workspace/box_maven-ant-plugin_master-N743QKOWXTZ36LZCK2YK3A6N4ZY3UG7X5RV3MH7PEH646A2IMDHA/m/target/invoker-reports/BUILD-skip-test-execution-it.xml, /home/jenkins/jenkins-slave/workspace/box_maven-ant-plugin_master-N743QKOWXTZ36LZCK2YK3A6N4ZY3UG7X5RV3MH7PEH646A2IMDHA/m/target/invoker-reports/BUILD-system-scope-dep.xml, /home/jenkins/jenkins-slave/workspace/box_maven-ant-plugin_master-N743QKOWXTZ36LZCK2YK3A6N4ZY3UG7X5RV3MH7PEH646A2IMDHA/m/target/invoker-reports/BUILD-test-custom-selector-it.xml, /home/jenkins/jenkins-slave/workspace/box_maven-ant-plugin_master-N743QKOWXTZ36LZCK2YK3A6N4ZY3UG7X5RV3MH7PEH646A2IMDHA/m/target/invoker-reports/BUILD-test-default-selector-it.xml, /home/jenkins/jenkins-slave/workspace/box_maven-ant-plugin_master-N743QKOWXTZ36LZCK2YK3A6N4ZY3UG7X5RV3MH7PEH646A2IMDHA/m/target/invoker-reports/BUILD-webapp-it.xml]
[linux-jdk8] Found logs:[/home/jenkins/jenkins-slave/workspace/box_maven-ant-plugin_master-N743QKOWXTZ36LZCK2YK3A6N4ZY3UG7X5RV3MH7PEH646A2IMDHA/m/target/it/clean-custom-files/build.log, /home/jenkins/jenkins-slave/workspace/box_maven-ant-plugin_master-N743QKOWXTZ36LZCK2YK3A6N4ZY3UG7X5RV3MH7PEH646A2IMDHA/m/target/it/clean/build.log, /home/jenkins/jenkins-slave/workspace/box_maven-ant-plugin_master-N743QKOWXTZ36LZCK2YK3A6N4ZY3UG7X5RV3MH7PEH646A2IMDHA/m/target/it/ear-it/build.log, /home/jenkins/jenkins-slave/workspace/box_maven-ant-plugin_master-N743QKOWXTZ36LZCK2YK3A6N4ZY3UG7X5RV3MH7PEH646A2IMDHA/m/target/it/encoding-it/build.log, /home/jenkins/jenkins-slave/workspace/box_maven-ant-plugin_master-N743QKOWXTZ36LZCK2YK3A6N4ZY3UG7X5RV3MH7PEH646A2IMDHA/m/target/it/file-repo-it/build.log, /home/jenkins/jenkins-slave/workspace/box_maven-ant-plugin_master-N743QKOWXTZ36LZCK2YK3A6N4ZY3UG7X5RV3MH7PEH646A2IMDHA/m/target/it/javadoc-it/build.log, /home/jenkins/jenkins-slave/workspace/box_maven-ant-plugin_master-N743QKOWXTZ36LZCK2YK3A6N4ZY3UG7X5RV3MH7PEH646A2IMDHA/m/target/it/plugin-it/build.log, /home/jenkins/jenkins-slave/workspace/box_maven-ant-plugin_master-N743QKOWXTZ36LZCK2YK3A6N4ZY3UG7X5RV3MH7PEH646A2IMDHA/m/target/it/plugin-mngt-config-only/build.log, /home/jenkins/jenkins-slave/workspace/box_maven-ant-plugin_master-N743QKOWXTZ36LZCK2YK3A6N4ZY3UG7X5RV3MH7PEH646A2IMDHA/m/target/it/plugin-mngt-config/build.log, /home/jenkins/jenkins-slave/workspace/box_maven-ant-plugin_master-N743QKOWXTZ36LZCK2YK3A6N4ZY3UG7X5RV3MH7PEH646A2IMDHA/m/target/it/relative-path-it/build.log, /home/jenkins/jenkins-slave/workspace/box_maven-ant-plugin_master-N743QKOWXTZ36LZCK2YK3A6N4ZY3UG7X5RV3MH7PEH646A2IMDHA/m/target/it/single-test-it/build.log, /home/jenkins/jenkins-slave/workspace/box_maven-ant-plugin_master-N743QKOWXTZ36LZCK2YK3A6N4ZY3UG7X5RV3MH7PEH646A2IMDHA/m/target/it/skip-missing-junit-it/build.log, /home/jenkins/jenkins-slave/workspace/box_maven-ant-plugin_master-N743QKOWXTZ36LZCK2YK3A6N4ZY3UG7X5RV3MH7PEH646A2IMDHA/m/target/it/skip-test-compilation-it/build.log, /home/jenkins/jenkins-slave/workspace/box_maven-ant-plugin_master-N743QKOWXTZ36LZCK2YK3A6N4ZY3UG7X5RV3MH7PEH646A2IMDHA/m/target/it/skip-test-execution-it/build.log, /home/jenkins/jenkins-slave/workspace/box_maven-ant-plugin_master-N743QKOWXTZ36LZCK2YK3A6N4ZY3UG7X5RV3MH7PEH646A2IMDHA/m/target/it/system-scope-dep/build.log, /home/jenkins/jenkins-slave/workspace/box_maven-ant-plugin_master-N743QKOWXTZ36LZCK2YK3A6N4ZY3UG7X5RV3MH7PEH646A2IMDHA/m/target/it/test-custom-selector-it/build.log, /home/jenkins/jenkins-slave/workspace/box_maven-ant-plugin_master-N743QKOWXTZ36LZCK2YK3A6N4ZY3UG7X5RV3MH7PEH646A2IMDHA/m/target/it/test-default-selector-it/build.log, /home/jenkins/jenkins-slave/workspace/box_maven-ant-plugin_master-N743QKOWXTZ36LZCK2YK3A6N4ZY3UG7X5RV3MH7PEH646A2IMDHA/m/target/it/webapp-it/build.log]
[linux-jdk8] Finished parsing Maven Invoker results (found 18)
[linux-jdk8] [withMaven] junitPublisher - Archive test results for Maven artifact org.apache.maven.plugins:maven-ant-plugin:2.5-SNAPSHOT generated by maven-surefire-plugin:test (default-test): m/target/surefire-reports/*.xml
[linux-jdk8] Recording test results
[linux-jdk8] [withMaven] junitPublisher - Archive test results for Maven artifact org.apache.maven.plugins.maven-ant-plugin.it.ear-it.projects:logging:1.0 generated by maven-surefire-plugin:test (default-test): m/target/it/ear-it/projects/logging/target/surefire-reports/*.xml
[linux-jdk8] Recording test results
[linux-jdk8] None of the test reports contained any result
[linux-jdk8] [withMaven] junitPublisher - Archive test results for Maven artifact org.apache.maven.plugins.maven-ant-plugin.it.ear-it:primary-source:1.0 generated by maven-surefire-plugin:test (default-test): m/target/it/ear-it/primary-source/target/surefire-reports/*.xml
[linux-jdk8] Recording test results
[linux-jdk8] None of the test reports contained any result
[linux-jdk8] [withMaven] junitPublisher - Archive test results for Maven artifact org.apache.maven.plugins.maven-ant-plugin.it.ear-it.servlets:servlet:1.0 generated by maven-surefire-plugin:test (default-test): m/target/it/ear-it/servlets/servlet/target/surefire-reports/*.xml
[linux-jdk8] Recording test results
[linux-jdk8] None of the test reports contained any result
[linux-jdk8] [withMaven] junitPublisher - Archive test results for Maven artifact org.apache.maven.plugins.maven-ant-plugin.it.ear-it:ejbs:1.0 generated by maven-surefire-plugin:test (default-test): m/target/it/ear-it/ejbs/target/surefire-reports/*.xml
[linux-jdk8] Recording test results
[linux-jdk8] None of the test reports contained any result
[Pipeline] [linux-jdk10] }
[linux-jdk10] [withMaven] invokerPublisher - Archive invoker results for Maven artifact MavenArtifact{org.apache.maven.plugins:maven-ant-plugin::2.5-SNAPSHOT(version: 2.5-SNAPSHOT, snapshot:false) } generated by PluginInvocation{org.apache.maven.plugins:maven-invoker-plugin:2.0.0@integration-test integration-test}: m/target/invoker-reports/*.xml
[linux-jdk10] performing MavenInvokerRecorder, reportsFilenamePattern:'**/m/target/invoker-reports/BUILD*.xml', invokerBuildDir:'**/m/target/it'
[linux-jdk10] Found reports:[/home/jenkins/jenkins-slave/workspace/box_maven-ant-plugin_master-N743QKOWXTZ36LZCK2YK3A6N4ZY3UG7X5RV3MH7PEH646A2IMDHA@2/m/target/invoker-reports/BUILD-clean-custom-files.xml, /home/jenkins/jenkins-slave/workspace/box_maven-ant-plugin_master-N743QKOWXTZ36LZCK2YK3A6N4ZY3UG7X5RV3MH7PEH646A2IMDHA@2/m/target/invoker-reports/BUILD-clean.xml, /home/jenkins/jenkins-slave/workspace/box_maven-ant-plugin_master-N743QKOWXTZ36LZCK2YK3A6N4ZY3UG7X5RV3MH7PEH646A2IMDHA@2/m/target/invoker-reports/BUILD-ear-it.xml, /home/jenkins/jenkins-slave/workspace/box_maven-ant-plugin_master-N743QKOWXTZ36LZCK2YK3A6N4ZY3UG7X5RV3MH7PEH646A2IMDHA@2/m/target/invoker-reports/BUILD-encoding-it.xml, /home/jenkins/jenkins-slave/workspace/box_maven-ant-plugin_master-N743QKOWXTZ36LZCK2YK3A6N4ZY3UG7X5RV3MH7PEH646A2IMDHA@2/m/target/invoker-reports/BUILD-file-repo-it.xml, /home/jenkins/jenkins-slave/workspace/box_maven-ant-plugin_master-N743QKOWXTZ36LZCK2YK3A6N4ZY3UG7X5RV3MH7PEH646A2IMDHA@2/m/target/invoker-reports/BUILD-javadoc-it.xml, /home/jenkins/jenkins-slave/workspace/box_maven-ant-plugin_master-N743QKOWXTZ36LZCK2YK3A6N4ZY3UG7X5RV3MH7PEH646A2IMDHA@2/m/target/invoker-reports/BUILD-plugin-it.xml, /home/jenkins/jenkins-slave/workspace/box_maven-ant-plugin_master-N743QKOWXTZ36LZCK2YK3A6N4ZY3UG7X5RV3MH7PEH646A2IMDHA@2/m/target/invoker-reports/BUILD-plugin-mngt-config-only.xml, /home/jenkins/jenkins-slave/workspace/box_maven-ant-plugin_master-N743QKOWXTZ36LZCK2YK3A6N4ZY3UG7X5RV3MH7PEH646A2IMDHA@2/m/target/invoker-reports/BUILD-plugin-mngt-config.xml, /home/jenkins/jenkins-slave/workspace/box_maven-ant-plugin_master-N743QKOWXTZ36LZCK2YK3A6N4ZY3UG7X5RV3MH7PEH646A2IMDHA@2/m/target/invoker-reports/BUILD-relative-path-it.xml, /home/jenkins/jenkins-slave/workspace/box_maven-ant-plugin_master-N743QKOWXTZ36LZCK2YK3A6N4ZY3UG7X5RV3MH7PEH646A2IMDHA@2/m/target/invoker-reports/BUILD-single-test-it.xml, /home/jenkins/jenkins-slave/workspace/box_maven-ant-plugin_master-N743QKOWXTZ36LZCK2YK3A6N4ZY3UG7X5RV3MH7PEH646A2IMDHA@2/m/target/invoker-reports/BUILD-skip-missing-junit-it.xml, /home/jenkins/jenkins-slave/workspace/box_maven-ant-plugin_master-N743QKOWXTZ36LZCK2YK3A6N4ZY3UG7X5RV3MH7PEH646A2IMDHA@2/m/target/invoker-reports/BUILD-skip-test-compilation-it.xml, /home/jenkins/jenkins-slave/workspace/box_maven-ant-plugin_master-N743QKOWXTZ36LZCK2YK3A6N4ZY3UG7X5RV3MH7PEH646A2IMDHA@2/m/target/invoker-reports/BUILD-skip-test-execution-it.xml, /home/jenkins/jenkins-slave/workspace/box_maven-ant-plugin_master-N743QKOWXTZ36LZCK2YK3A6N4ZY3UG7X5RV3MH7PEH646A2IMDHA@2/m/target/invoker-reports/BUILD-system-scope-dep.xml, /home/jenkins/jenkins-slave/workspace/box_maven-ant-plugin_master-N743QKOWXTZ36LZCK2YK3A6N4ZY3UG7X5RV3MH7PEH646A2IMDHA@2/m/target/invoker-reports/BUILD-test-custom-selector-it.xml, /home/jenkins/jenkins-slave/workspace/box_maven-ant-plugin_master-N743QKOWXTZ36LZCK2YK3A6N4ZY3UG7X5RV3MH7PEH646A2IMDHA@2/m/target/invoker-reports/BUILD-test-default-selector-it.xml, /home/jenkins/jenkins-slave/workspace/box_maven-ant-plugin_master-N743QKOWXTZ36LZCK2YK3A6N4ZY3UG7X5RV3MH7PEH646A2IMDHA@2/m/target/invoker-reports/BUILD-webapp-it.xml]
[linux-jdk10] Found logs:[/home/jenkins/jenkins-slave/workspace/box_maven-ant-plugin_master-N743QKOWXTZ36LZCK2YK3A6N4ZY3UG7X5RV3MH7PEH646A2IMDHA@2/m/target/it/clean-custom-files/build.log, /home/jenkins/jenkins-slave/workspace/box_maven-ant-plugin_master-N743QKOWXTZ36LZCK2YK3A6N4ZY3UG7X5RV3MH7PEH646A2IMDHA@2/m/target/it/clean/build.log, /home/jenkins/jenkins-slave/workspace/box_maven-ant-plugin_master-N743QKOWXTZ36LZCK2YK3A6N4ZY3UG7X5RV3MH7PEH646A2IMDHA@2/m/target/it/ear-it/build.log, /home/jenkins/jenkins-slave/workspace/box_maven-ant-plugin_master-N743QKOWXTZ36LZCK2YK3A6N4ZY3UG7X5RV3MH7PEH646A2IMDHA@2/m/target/it/encoding-it/build.log, /home/jenkins/jenkins-slave/workspace/box_maven-ant-plugin_master-N743QKOWXTZ36LZCK2YK3A6N4ZY3UG7X5RV3MH7PEH646A2IMDHA@2/m/target/it/file-repo-it/build.log, /home/jenkins/jenkins-slave/workspace/box_maven-ant-plugin_master-N743QKOWXTZ36LZCK2YK3A6N4ZY3UG7X5RV3MH7PEH646A2IMDHA@2/m/target/it/javadoc-it/build.log, /home/jenkins/jenkins-slave/workspace/box_maven-ant-plugin_master-N743QKOWXTZ36LZCK2YK3A6N4ZY3UG7X5RV3MH7PEH646A2IMDHA@2/m/target/it/plugin-it/build.log, /home/jenkins/jenkins-slave/workspace/box_maven-ant-plugin_master-N743QKOWXTZ36LZCK2YK3A6N4ZY3UG7X5RV3MH7PEH646A2IMDHA@2/m/target/it/plugin-mngt-config-only/build.log, /home/jenkins/jenkins-slave/workspace/box_maven-ant-plugin_master-N743QKOWXTZ36LZCK2YK3A6N4ZY3UG7X5RV3MH7PEH646A2IMDHA@2/m/target/it/plugin-mngt-config/build.log, /home/jenkins/jenkins-slave/workspace/box_maven-ant-plugin_master-N743QKOWXTZ36LZCK2YK3A6N4ZY3UG7X5RV3MH7PEH646A2IMDHA@2/m/target/it/relative-path-it/build.log, /home/jenkins/jenkins-slave/workspace/box_maven-ant-plugin_master-N743QKOWXTZ36LZCK2YK3A6N4ZY3UG7X5RV3MH7PEH646A2IMDHA@2/m/target/it/single-test-it/build.log, /home/jenkins/jenkins-slave/workspace/box_maven-ant-plugin_master-N743QKOWXTZ36LZCK2YK3A6N4ZY3UG7X5RV3MH7PEH646A2IMDHA@2/m/target/it/skip-missing-junit-it/build.log, /home/jenkins/jenkins-slave/workspace/box_maven-ant-plugin_master-N743QKOWXTZ36LZCK2YK3A6N4ZY3UG7X5RV3MH7PEH646A2IMDHA@2/m/target/it/skip-test-compilation-it/build.log, /home/jenkins/jenkins-slave/workspace/box_maven-ant-plugin_master-N743QKOWXTZ36LZCK2YK3A6N4ZY3UG7X5RV3MH7PEH646A2IMDHA@2/m/target/it/skip-test-execution-it/build.log, /home/jenkins/jenkins-slave/workspace/box_maven-ant-plugin_master-N743QKOWXTZ36LZCK2YK3A6N4ZY3UG7X5RV3MH7PEH646A2IMDHA@2/m/target/it/system-scope-dep/build.log, /home/jenkins/jenkins-slave/workspace/box_maven-ant-plugin_master-N743QKOWXTZ36LZCK2YK3A6N4ZY3UG7X5RV3MH7PEH646A2IMDHA@2/m/target/it/test-custom-selector-it/build.log, /home/jenkins/jenkins-slave/workspace/box_maven-ant-plugin_master-N743QKOWXTZ36LZCK2YK3A6N4ZY3UG7X5RV3MH7PEH646A2IMDHA@2/m/target/it/test-default-selector-it/build.log, /home/jenkins/jenkins-slave/workspace/box_maven-ant-plugin_master-N743QKOWXTZ36LZCK2YK3A6N4ZY3UG7X5RV3MH7PEH646A2IMDHA@2/m/target/it/webapp-it/build.log]
[linux-jdk10] Finished parsing Maven Invoker results (found 18)
[linux-jdk10] [withMaven] junitPublisher - Archive test results for Maven artifact org.apache.maven.plugins:maven-ant-plugin:2.5-SNAPSHOT generated by maven-surefire-plugin:test (default-test): m/target/surefire-reports/*.xml
[linux-jdk10] Recording test results
[linux-jdk10] [withMaven] junitPublisher - Archive test results for Maven artifact org.apache.maven.plugins.maven-ant-plugin.it.ear-it.projects:logging:1.0 generated by maven-surefire-plugin:test (default-test): m/target/it/ear-it/projects/logging/target/surefire-reports/*.xml
[linux-jdk10] Recording test results
[linux-jdk10] None of the test reports contained any result
[linux-jdk10] [withMaven] junitPublisher - Archive test results for Maven artifact org.apache.maven.plugins.maven-ant-plugin.it.ear-it:primary-source:1.0 generated by maven-surefire-plugin:test (default-test): m/target/it/ear-it/primary-source/target/surefire-reports/*.xml
[linux-jdk10] Recording test results
[linux-jdk10] None of the test reports contained any result
[linux-jdk10] [withMaven] junitPublisher - Archive test results for Maven artifact org.apache.maven.plugins.maven-ant-plugin.it.ear-it.servlets:servlet:1.0 generated by maven-surefire-plugin:test (default-test): m/target/it/ear-it/servlets/servlet/target/surefire-reports/*.xml
[linux-jdk10] Recording test results
[linux-jdk10] None of the test reports contained any result
[linux-jdk10] [withMaven] junitPublisher - Archive test results for Maven artifact org.apache.maven.plugins.maven-ant-plugin.it.ear-it:ejbs:1.0 generated by maven-surefire-plugin:test (default-test): m/target/it/ear-it/ejbs/target/surefire-reports/*.xml
[linux-jdk10] Recording test results
[linux-jdk10] None of the test reports contained any result
[Pipeline] [windows-jdk8] // node
[Pipeline] [windows-jdk9] // node
[Pipeline] [linux-jdk9] // withMaven
[Pipeline] [linux-jdk8] // withMaven
[Pipeline] [linux-jdk10] // withMaven
[Pipeline] [windows-jdk8] }
[Pipeline] [windows-jdk9] }
[Pipeline] [linux-jdk9] }
[Pipeline] [linux-jdk8] }
[Pipeline] [linux-jdk10] }
[Pipeline] [linux-jdk9] // stage
[Pipeline] [linux-jdk8] // stage
[Pipeline] [linux-jdk10] // stage
[Pipeline] [linux-jdk8] }
[Pipeline] [linux-jdk9] }
[Pipeline] [linux-jdk10] }
[Pipeline] [linux-jdk8] // node
[Pipeline] [linux-jdk9] // node
[Pipeline] [linux-jdk10] // node
[Pipeline] [linux-jdk8] }
[Pipeline] [linux-jdk9] }
[Pipeline] [linux-jdk10] }
[Pipeline] // parallel
[Pipeline] stage
[Pipeline] { (Notifications)
[Pipeline] echo
Build result: UNSTABLE
[Pipeline] jiraIssueSelector