You are viewing a plain text version of this content. The canonical link for it is here.
Posted to dev@royale.apache.org by ap...@gmail.com on 2020/03/23 23:04:09 UTC

Build failed in Jenkins: royale-typedefs #441

See <http://apacheroyaleci2.westus2.cloudapp.azure.com:8080/job/royale-typedefs/441/display/redirect?page=changes>

Changes:

[christofer.dutz] - Adjusted the releasesteps.xml files to the new server name and


------------------------------------------
Started by an SCM change
Running as SYSTEM
[EnvInject] - Loading node environment variables.
Building remotely on agent1 in workspace <http://apacheroyaleci2.westus2.cloudapp.azure.com:8080/job/royale-typedefs/ws/>
No credentials specified
 > C:\Program Files\Git\cmd\git.exe rev-parse --is-inside-work-tree # timeout=10
Fetching changes from the remote Git repository
 > C:\Program Files\Git\cmd\git.exe config remote.origin.url https://github.com/apache/royale-typedefs # timeout=10
Fetching upstream changes from https://github.com/apache/royale-typedefs
 > C:\Program Files\Git\cmd\git.exe --version # timeout=10
 > C:\Program Files\Git\cmd\git.exe fetch --tags --force --progress -- https://github.com/apache/royale-typedefs +refs/heads/*:refs/remotes/origin/*
 > C:\Program Files\Git\cmd\git.exe rev-parse "refs/remotes/origin/develop^{commit}" # timeout=10
 > C:\Program Files\Git\cmd\git.exe rev-parse "refs/remotes/origin/origin/develop^{commit}" # timeout=10
Checking out Revision a153d76374ff30c2c95a4d9a25a72b80d74bdf4d (refs/remotes/origin/develop)
 > C:\Program Files\Git\cmd\git.exe config core.sparsecheckout # timeout=10
 > C:\Program Files\Git\cmd\git.exe checkout -f a153d76374ff30c2c95a4d9a25a72b80d74bdf4d
Commit message: "Merge pull request #7 from chrisdutz/develop"
 > C:\Program Files\Git\cmd\git.exe rev-list --no-walk 06fecfddf0298b9f21fcbc48b4c6b39fbdf8baca # timeout=10
[royale-typedefs] $ cmd.exe /C "C:\apache\apache-ant-1.9.9\bin\ant.bat -Dbuild.number=441 main && exit %%ERRORLEVEL%%"
Buildfile: <http://apacheroyaleci2.westus2.cloudapp.azure.com:8080/job/royale-typedefs/ws/build.xml>

main:
     [echo] swc-date is 03/23/20 23:04 +0000

download:
     [echo] <http://apacheroyaleci2.westus2.cloudapp.azure.com:8080/job/royale-typedefs/ws/js/..>

BUILD FAILED
<http://apacheroyaleci2.westus2.cloudapp.azure.com:8080/job/royale-typedefs/ws/build.xml>:58: The following error occurred while executing this line:
<http://apacheroyaleci2.westus2.cloudapp.azure.com:8080/job/royale-typedefs/ws/js/build.xml>:91: src '<http://apacheroyaleci2.westus2.cloudapp.azure.com:8080/job/royale-typedefs/ws/js/${ROYALE_TRANSPILER_HOME}/lib/google/closure-compiler/compiler.jar'> doesn't exist.

Total time: 0 seconds
Picked up JAVA_TOOL_OPTIONS: -Dfile.encoding=UTF-8 -Xms384m -Xmx2g
Build step 'Invoke Ant' marked build as failure

Jenkins build is back to normal : royale-typedefs #444

Posted by ap...@gmail.com.
See <http://apacheroyaleci2.westus2.cloudapp.azure.com:8080/job/royale-typedefs/444/display/redirect>


Build failed in Jenkins: royale-typedefs #443

Posted by ap...@gmail.com.
See <http://apacheroyaleci2.westus2.cloudapp.azure.com:8080/job/royale-typedefs/443/display/redirect?page=changes>

Changes:

[christofer.dutz] - Added a previously existing profile back which is used by the ant


------------------------------------------
Started by an SCM change
Running as SYSTEM
[EnvInject] - Loading node environment variables.
Building remotely on agent1 in workspace <http://apacheroyaleci2.westus2.cloudapp.azure.com:8080/job/royale-typedefs/ws/>
No credentials specified
 > C:\Program Files\Git\cmd\git.exe rev-parse --is-inside-work-tree # timeout=10
Fetching changes from the remote Git repository
 > C:\Program Files\Git\cmd\git.exe config remote.origin.url https://github.com/apache/royale-typedefs # timeout=10
Fetching upstream changes from https://github.com/apache/royale-typedefs
 > C:\Program Files\Git\cmd\git.exe --version # timeout=10
 > C:\Program Files\Git\cmd\git.exe fetch --tags --force --progress -- https://github.com/apache/royale-typedefs +refs/heads/*:refs/remotes/origin/*
 > C:\Program Files\Git\cmd\git.exe rev-parse "refs/remotes/origin/develop^{commit}" # timeout=10
 > C:\Program Files\Git\cmd\git.exe rev-parse "refs/remotes/origin/origin/develop^{commit}" # timeout=10
Checking out Revision 70d835284e8ef4cc91ebff0fb7644ad47571a727 (refs/remotes/origin/develop)
 > C:\Program Files\Git\cmd\git.exe config core.sparsecheckout # timeout=10
 > C:\Program Files\Git\cmd\git.exe checkout -f 70d835284e8ef4cc91ebff0fb7644ad47571a727
Commit message: "Merge pull request #8 from chrisdutz/develop"
 > C:\Program Files\Git\cmd\git.exe rev-list --no-walk a153d76374ff30c2c95a4d9a25a72b80d74bdf4d # timeout=10
[royale-typedefs] $ cmd.exe /C "C:\apache\apache-ant-1.9.9\bin\ant.bat -Dbuild.number=443 main && exit %%ERRORLEVEL%%"
Buildfile: <http://apacheroyaleci2.westus2.cloudapp.azure.com:8080/job/royale-typedefs/ws/build.xml>

main:
     [echo] swc-date is 03/24/20 09:06 +0000

download:
     [echo] <http://apacheroyaleci2.westus2.cloudapp.azure.com:8080/job/royale-typedefs/ws/js/..>

BUILD FAILED
<http://apacheroyaleci2.westus2.cloudapp.azure.com:8080/job/royale-typedefs/ws/build.xml>:58: The following error occurred while executing this line:
<http://apacheroyaleci2.westus2.cloudapp.azure.com:8080/job/royale-typedefs/ws/js/build.xml>:91: src '<http://apacheroyaleci2.westus2.cloudapp.azure.com:8080/job/royale-typedefs/ws/js/${ROYALE_TRANSPILER_HOME}/lib/google/closure-compiler/compiler.jar'> doesn't exist.

Total time: 0 seconds
Picked up JAVA_TOOL_OPTIONS: -Dfile.encoding=UTF-8 -Xms384m -Xmx2g
Build step 'Invoke Ant' marked build as failure

Build failed in Jenkins: royale-typedefs #442

Posted by ap...@gmail.com.
See <http://apacheroyaleci2.westus2.cloudapp.azure.com:8080/job/royale-typedefs/442/display/redirect>

Changes:


------------------------------------------
Started by timer
Running as SYSTEM
[EnvInject] - Loading node environment variables.
Building remotely on agent1 in workspace <http://apacheroyaleci2.westus2.cloudapp.azure.com:8080/job/royale-typedefs/ws/>
No credentials specified
 > C:\Program Files\Git\cmd\git.exe rev-parse --is-inside-work-tree # timeout=10
Fetching changes from the remote Git repository
 > C:\Program Files\Git\cmd\git.exe config remote.origin.url https://github.com/apache/royale-typedefs # timeout=10
Fetching upstream changes from https://github.com/apache/royale-typedefs
 > C:\Program Files\Git\cmd\git.exe --version # timeout=10
 > C:\Program Files\Git\cmd\git.exe fetch --tags --force --progress -- https://github.com/apache/royale-typedefs +refs/heads/*:refs/remotes/origin/*
 > C:\Program Files\Git\cmd\git.exe rev-parse "refs/remotes/origin/develop^{commit}" # timeout=10
 > C:\Program Files\Git\cmd\git.exe rev-parse "refs/remotes/origin/origin/develop^{commit}" # timeout=10
Checking out Revision a153d76374ff30c2c95a4d9a25a72b80d74bdf4d (refs/remotes/origin/develop)
 > C:\Program Files\Git\cmd\git.exe config core.sparsecheckout # timeout=10
 > C:\Program Files\Git\cmd\git.exe checkout -f a153d76374ff30c2c95a4d9a25a72b80d74bdf4d
Commit message: "Merge pull request #7 from chrisdutz/develop"
 > C:\Program Files\Git\cmd\git.exe rev-list --no-walk a153d76374ff30c2c95a4d9a25a72b80d74bdf4d # timeout=10
[royale-typedefs] $ cmd.exe /C "C:\apache\apache-ant-1.9.9\bin\ant.bat -Dbuild.number=442 main && exit %%ERRORLEVEL%%"
Buildfile: <http://apacheroyaleci2.westus2.cloudapp.azure.com:8080/job/royale-typedefs/ws/build.xml>

main:
     [echo] swc-date is 03/24/20 04:04 +0000

download:
     [echo] <http://apacheroyaleci2.westus2.cloudapp.azure.com:8080/job/royale-typedefs/ws/js/..>

BUILD FAILED
<http://apacheroyaleci2.westus2.cloudapp.azure.com:8080/job/royale-typedefs/ws/build.xml>:58: The following error occurred while executing this line:
<http://apacheroyaleci2.westus2.cloudapp.azure.com:8080/job/royale-typedefs/ws/js/build.xml>:91: src '<http://apacheroyaleci2.westus2.cloudapp.azure.com:8080/job/royale-typedefs/ws/js/${ROYALE_TRANSPILER_HOME}/lib/google/closure-compiler/compiler.jar'> doesn't exist.

Total time: 0 seconds
Picked up JAVA_TOOL_OPTIONS: -Dfile.encoding=UTF-8 -Xms384m -Xmx2g
Build step 'Invoke Ant' marked build as failure