You are viewing a plain text version of this content. The canonical link for it is here.
Posted to dev@jclouds.apache.org by je...@cloudbees.com on 2013/08/27 19:48:00 UTC

Build failed in Jenkins: jclouds-karaf-1.6.x-branch #91

See <https://jclouds.ci.cloudbees.com/job/jclouds-karaf-1.6.x-branch/91/>

------------------------------------------
[...truncated 2171 lines...]
Downloading: http://repository.apache.org/snapshots/org/apache/jclouds/driver/jclouds-sshj/1.6.3-SNAPSHOT/maven-metadata.xml
Downloaded: http://repository.apache.org/snapshots/org/apache/jclouds/driver/jclouds-sshj/1.6.3-SNAPSHOT/maven-metadata.xml (2 KB at 6.8 KB/sec)
Downloaded: https://repository.apache.org/content/repositories/snapshots/org/apache/jclouds/driver/jclouds-sshj/1.6.3-SNAPSHOT/maven-metadata.xml (2 KB at 1.8 KB/sec)
Downloading: https://repository-jclouds.forge.cloudbees.com/snapshot/org/apache/jclouds/driver/jclouds-sshj/1.6.3-SNAPSHOT/jclouds-sshj-1.6.3-20130827.163336-2.pom
Downloading: https://repository.apache.org/content/repositories/snapshots/org/apache/jclouds/driver/jclouds-sshj/1.6.3-SNAPSHOT/jclouds-sshj-1.6.3-20130827.163336-2.pom
Downloaded: https://repository.apache.org/content/repositories/snapshots/org/apache/jclouds/driver/jclouds-sshj/1.6.3-SNAPSHOT/jclouds-sshj-1.6.3-20130827.163336-2.pom (6 KB at 9.0 KB/sec)
Downloading: https://repository-jclouds.forge.cloudbees.com/snapshot/org/apache/jclouds/driver/jclouds-slf4j/1.6.3-SNAPSHOT/maven-metadata.xml
Downloading: https://oss.sonatype.org/content/repositories/releases/org/apache/jclouds/driver/jclouds-slf4j/1.6.3-SNAPSHOT/maven-metadata.xml
Downloading: https://repository.apache.org/content/repositories/snapshots/org/apache/jclouds/driver/jclouds-slf4j/1.6.3-SNAPSHOT/maven-metadata.xml
Downloading: http://download.java.net/maven/2/org/apache/jclouds/driver/jclouds-slf4j/1.6.3-SNAPSHOT/maven-metadata.xml
Downloading: http://repository.apache.org/snapshots/org/apache/jclouds/driver/jclouds-slf4j/1.6.3-SNAPSHOT/maven-metadata.xml
Downloading: https://oss.sonatype.org/content/repositories/snapshots/org/apache/jclouds/driver/jclouds-slf4j/1.6.3-SNAPSHOT/maven-metadata.xml
Downloaded: http://repository.apache.org/snapshots/org/apache/jclouds/driver/jclouds-slf4j/1.6.3-SNAPSHOT/maven-metadata.xml (2 KB at 5.4 KB/sec)
Downloaded: https://repository.apache.org/content/repositories/snapshots/org/apache/jclouds/driver/jclouds-slf4j/1.6.3-SNAPSHOT/maven-metadata.xml (2 KB at 2.4 KB/sec)
Downloading: https://repository-jclouds.forge.cloudbees.com/snapshot/org/apache/jclouds/driver/jclouds-slf4j/1.6.3-SNAPSHOT/jclouds-slf4j-1.6.3-20130827.163241-2.pom
Downloading: https://repository.apache.org/content/repositories/snapshots/org/apache/jclouds/driver/jclouds-slf4j/1.6.3-SNAPSHOT/jclouds-slf4j-1.6.3-20130827.163241-2.pom
Downloaded: https://repository.apache.org/content/repositories/snapshots/org/apache/jclouds/driver/jclouds-slf4j/1.6.3-SNAPSHOT/jclouds-slf4j-1.6.3-20130827.163241-2.pom (3 KB at 4.7 KB/sec)
Downloading: https://repository-jclouds.forge.cloudbees.com/snapshot/org/apache/jclouds/driver/jclouds-bouncycastle/1.6.3-SNAPSHOT/maven-metadata.xml
Downloading: https://oss.sonatype.org/content/repositories/releases/org/apache/jclouds/driver/jclouds-bouncycastle/1.6.3-SNAPSHOT/maven-metadata.xml
Downloading: https://repository.apache.org/content/repositories/snapshots/org/apache/jclouds/driver/jclouds-bouncycastle/1.6.3-SNAPSHOT/maven-metadata.xml
Downloading: http://download.java.net/maven/2/org/apache/jclouds/driver/jclouds-bouncycastle/1.6.3-SNAPSHOT/maven-metadata.xml
Downloading: http://repository.apache.org/snapshots/org/apache/jclouds/driver/jclouds-bouncycastle/1.6.3-SNAPSHOT/maven-metadata.xml
Downloading: https://oss.sonatype.org/content/repositories/snapshots/org/apache/jclouds/driver/jclouds-bouncycastle/1.6.3-SNAPSHOT/maven-metadata.xml
Downloaded: http://repository.apache.org/snapshots/org/apache/jclouds/driver/jclouds-bouncycastle/1.6.3-SNAPSHOT/maven-metadata.xml (2 KB at 6.9 KB/sec)
Downloaded: https://repository.apache.org/content/repositories/snapshots/org/apache/jclouds/driver/jclouds-bouncycastle/1.6.3-SNAPSHOT/maven-metadata.xml (2 KB at 2.4 KB/sec)
Downloading: https://repository-jclouds.forge.cloudbees.com/snapshot/org/apache/jclouds/driver/jclouds-bouncycastle/1.6.3-SNAPSHOT/jclouds-bouncycastle-1.6.3-20130827.163307-2.pom
Downloading: https://repository.apache.org/content/repositories/snapshots/org/apache/jclouds/driver/jclouds-bouncycastle/1.6.3-SNAPSHOT/jclouds-bouncycastle-1.6.3-20130827.163307-2.pom
Downloaded: https://repository.apache.org/content/repositories/snapshots/org/apache/jclouds/driver/jclouds-bouncycastle/1.6.3-SNAPSHOT/jclouds-bouncycastle-1.6.3-20130827.163307-2.pom (3 KB at 4.5 KB/sec)
Downloading: http://repo.cloudbees.com/content/repositories/central/org/bouncycastle/bcprov-jdk16/1.46/bcprov-jdk16-1.46.pom
Downloaded: http://repo.cloudbees.com/content/repositories/central/org/bouncycastle/bcprov-jdk16/1.46/bcprov-jdk16-1.46.pom (819 B at 21.0 KB/sec)
Downloading: http://repo.cloudbees.com/content/repositories/central/net/schmizz/sshj/0.8.1/sshj-0.8.1.pom
Downloaded: http://repo.cloudbees.com/content/repositories/central/net/schmizz/sshj/0.8.1/sshj-0.8.1.pom (10 KB at 759.7 KB/sec)
Downloading: http://repo.cloudbees.com/content/repositories/central/junit/junit/4.8.2/junit-4.8.2.pom
Downloaded: http://repo.cloudbees.com/content/repositories/central/junit/junit/4.8.2/junit-4.8.2.pom (2 KB at 40.2 KB/sec)
Downloading: http://repo.cloudbees.com/content/repositories/central/org/easymock/easymock/3.0/easymock-3.0.pom
Downloaded: http://repo.cloudbees.com/content/repositories/central/org/easymock/easymock/3.0/easymock-3.0.pom (6 KB at 133.1 KB/sec)
Downloading: http://repo.cloudbees.com/content/repositories/central/org/easymock/easymock-parent/3.0/easymock-parent-3.0.pom
Downloaded: http://repo.cloudbees.com/content/repositories/central/org/easymock/easymock-parent/3.0/easymock-parent-3.0.pom (11 KB at 926.5 KB/sec)
Downloading: http://repo.cloudbees.com/content/repositories/central/cglib/cglib-nodep/2.2/cglib-nodep-2.2.pom
Downloaded: http://repo.cloudbees.com/content/repositories/central/cglib/cglib-nodep/2.2/cglib-nodep-2.2.pom (807 B at 71.6 KB/sec)
Downloading: http://repo.cloudbees.com/content/repositories/central/org/objenesis/objenesis/1.2/objenesis-1.2.pom
Downloaded: http://repo.cloudbees.com/content/repositories/central/org/objenesis/objenesis/1.2/objenesis-1.2.pom (3 KB at 244.8 KB/sec)
Downloading: http://repo.cloudbees.com/content/repositories/central/org/objenesis/objenesis-parent/1.2/objenesis-parent-1.2.pom
Downloaded: http://repo.cloudbees.com/content/repositories/central/org/objenesis/objenesis-parent/1.2/objenesis-parent-1.2.pom (11 KB at 777.6 KB/sec)
Downloading: http://repo.cloudbees.com/content/repositories/central/org/slf4j/slf4j-simple/1.5.8/slf4j-simple-1.5.8.pom
Downloaded: http://repo.cloudbees.com/content/repositories/central/org/slf4j/slf4j-simple/1.5.8/slf4j-simple-1.5.8.pom (2 KB at 118.4 KB/sec)
Downloading: https://repository-jclouds.forge.cloudbees.com/snapshot/org/apache/jclouds/labs/management/management-core/1.6.3-SNAPSHOT/management-core-1.6.3-SNAPSHOT.jar
Downloading: https://repository.apache.org/content/repositories/snapshots/org/apache/jclouds/labs/management/management-core/1.6.3-SNAPSHOT/management-core-1.6.3-SNAPSHOT.jar
Downloading: https://repository.apache.org/content/repositories/snapshots/org/apache/jclouds/driver/jclouds-log4j/1.6.3-SNAPSHOT/jclouds-log4j-1.6.3-20130827.163218-2.jar
Downloading: https://repository.apache.org/content/repositories/snapshots/org/apache/jclouds/driver/jclouds-sshj/1.6.3-SNAPSHOT/jclouds-sshj-1.6.3-20130827.163336-2.jar
Downloading: https://repository.apache.org/content/repositories/snapshots/org/apache/jclouds/driver/jclouds-slf4j/1.6.3-SNAPSHOT/jclouds-slf4j-1.6.3-20130827.163241-2.jar
Downloading: https://repository.apache.org/content/repositories/snapshots/org/apache/jclouds/driver/jclouds-bouncycastle/1.6.3-SNAPSHOT/jclouds-bouncycastle-1.6.3-20130827.163307-2.jar
Downloaded: https://repository.apache.org/content/repositories/snapshots/org/apache/jclouds/driver/jclouds-bouncycastle/1.6.3-SNAPSHOT/jclouds-bouncycastle-1.6.3-20130827.163307-2.jar (11 KB at 28.0 KB/sec)
Downloaded: https://repository.apache.org/content/repositories/snapshots/org/apache/jclouds/driver/jclouds-slf4j/1.6.3-SNAPSHOT/jclouds-slf4j-1.6.3-20130827.163241-2.jar (12 KB at 27.9 KB/sec)
Downloaded: https://repository.apache.org/content/repositories/snapshots/org/apache/jclouds/driver/jclouds-log4j/1.6.3-SNAPSHOT/jclouds-log4j-1.6.3-20130827.163218-2.jar (12 KB at 27.4 KB/sec)
Downloaded: https://repository.apache.org/content/repositories/snapshots/org/apache/jclouds/driver/jclouds-sshj/1.6.3-SNAPSHOT/jclouds-sshj-1.6.3-20130827.163336-2.jar (35 KB at 63.4 KB/sec)
Downloading: https://oss.sonatype.org/content/repositories/releases/org/apache/jclouds/labs/management/management-core/1.6.3-SNAPSHOT/management-core-1.6.3-SNAPSHOT.jar
Downloading: http://download.java.net/maven/2/org/apache/jclouds/labs/management/management-core/1.6.3-SNAPSHOT/management-core-1.6.3-SNAPSHOT.jar
Downloading: http://repository.apache.org/snapshots/org/apache/jclouds/labs/management/management-core/1.6.3-SNAPSHOT/management-core-1.6.3-SNAPSHOT.jar
Downloading: http://repo.cloudbees.com/content/repositories/central/log4j/log4j/1.2.17/log4j-1.2.17.jar
Downloading: http://repo.cloudbees.com/content/repositories/central/org/bouncycastle/bcprov-jdk16/1.46/bcprov-jdk16-1.46.jar
Downloading: http://repo.cloudbees.com/content/repositories/central/net/schmizz/sshj/0.8.1/sshj-0.8.1.jar
Downloading: http://repo.cloudbees.com/content/repositories/central/junit/junit/4.8.2/junit-4.8.2.jar
Downloading: http://repo.cloudbees.com/content/repositories/central/org/easymock/easymock/3.0/easymock-3.0.jar
Downloaded: http://repo.cloudbees.com/content/repositories/central/org/easymock/easymock/3.0/easymock-3.0.jar (112 KB at 1639.0 KB/sec)
Downloading: http://repo.cloudbees.com/content/repositories/central/cglib/cglib-nodep/2.2/cglib-nodep-2.2.jar
Downloaded: http://repo.cloudbees.com/content/repositories/central/junit/junit/4.8.2/junit-4.8.2.jar (232 KB at 1704.3 KB/sec)
Downloading: http://repo.cloudbees.com/content/repositories/central/org/objenesis/objenesis/1.2/objenesis-1.2.jar
Downloaded: http://repo.cloudbees.com/content/repositories/central/log4j/log4j/1.2.17/log4j-1.2.17.jar (479 KB at 3254.4 KB/sec)
Downloaded: http://repo.cloudbees.com/content/repositories/central/net/schmizz/sshj/0.8.1/sshj-0.8.1.jar (342 KB at 2370.4 KB/sec)
Downloading: http://repo.cloudbees.com/content/repositories/central/org/slf4j/slf4j-simple/1.5.8/slf4j-simple-1.5.8.jar
Downloaded: http://repo.cloudbees.com/content/repositories/central/org/objenesis/objenesis/1.2/objenesis-1.2.jar (36 KB at 765.2 KB/sec)
Downloaded: http://repo.cloudbees.com/content/repositories/central/org/slf4j/slf4j-simple/1.5.8/slf4j-simple-1.5.8.jar (8 KB at 96.2 KB/sec)
Downloaded: http://repo.cloudbees.com/content/repositories/central/cglib/cglib-nodep/2.2/cglib-nodep-2.2.jar (315 KB at 2459.4 KB/sec)
Downloaded: http://repo.cloudbees.com/content/repositories/central/org/bouncycastle/bcprov-jdk16/1.46/bcprov-jdk16-1.46.jar (1833 KB at 5969.2 KB/sec)
[INFO] ------------------------------------------------------------------------
[INFO] Reactor Summary:
[INFO] 
[INFO] Apache jclouds :: Karaf ........................... SUCCESS [41.723s]
[INFO] JClouds :: Karaf :: Core .......................... SUCCESS [25.592s]
[INFO] JClouds :: Karaf :: Utils ......................... SUCCESS [9.966s]
[INFO] JClouds :: Karaf :: Recipe ........................ SUCCESS [8.064s]
[INFO] JClouds :: Karaf :: Cache ......................... SUCCESS [8.899s]
[INFO] JClouds :: Karaf :: Services ...................... FAILURE [7.844s]
[INFO] JClouds :: Karaf :: Commands ...................... SKIPPED
[INFO] JClouds :: Karaf :: URL Handler ................... SKIPPED
[INFO] JClouds :: Karaf :: Chef .......................... SKIPPED
[INFO] JClouds :: Karaf :: Chef :: Core .................. SKIPPED
[INFO] JClouds :: Karaf :: Chef :: Services .............. SKIPPED
[INFO] JClouds :: Karaf :: Chef :: Commands .............. SKIPPED
[INFO] JClouds :: Karaf :: Chef :: Cache ................. SKIPPED
[INFO] JClouds :: Karaf :: Feature ....................... SKIPPED
[INFO] JClouds :: Karaf :: Integration Tests ............. SKIPPED
[INFO] ------------------------------------------------------------------------
[INFO] BUILD FAILURE
[INFO] ------------------------------------------------------------------------
[INFO] Total time: 1:54.868s
[INFO] Finished at: Tue Aug 27 13:47:51 EDT 2013
[Unloading class GregorSamsa$0]
[Unloading class GregorSamsa$1]
[Unloading class GregorSamsa$0]
[Unloading class GregorSamsa$0]
[Unloading class GregorSamsa$0]
[Unloading class GregorSamsa]
[Unloading class GregorSamsa]
[Unloading class GregorSamsa$2]
[Unloading class GregorSamsa]
[Unloading class GregorSamsa]
[Unloading class GregorSamsa$1]
[Unloading class GregorSamsa]
[Unloading class GregorSamsa$1]
[Unloading class GregorSamsa$2]
[Unloading class GregorSamsa$1]
[Unloading class GregorSamsa$0]
[Unloading class GregorSamsa]
[Unloading class GregorSamsa$0]
[Unloading class GregorSamsa$0]
[Unloading class GregorSamsa$0]
[Unloading class GregorSamsa]
[Unloading class GregorSamsa$0]
[Unloading class GregorSamsa$2]
[Unloading class GregorSamsa]
[Unloading class GregorSamsa$1]
[Unloading class GregorSamsa$0]
[Unloading class GregorSamsa]
[Unloading class GregorSamsa]
[Unloading class GregorSamsa]
[Unloading class GregorSamsa$0]
[Unloading class GregorSamsa$1]
[Unloading class GregorSamsa$0]
[Unloading class GregorSamsa$1]
[Unloading class GregorSamsa$2]
[Unloading class GregorSamsa]
[Unloading class GregorSamsa$0]
[Unloading class GregorSamsa]
[Unloading class GregorSamsa$0]
[Unloading class GregorSamsa]
[Unloading class GregorSamsa]
[Unloading class GregorSamsa$1]
[Unloading class GregorSamsa]
[Unloading class GregorSamsa]
[Unloading class GregorSamsa$0]
[Unloading class GregorSamsa$0]
[Unloading class GregorSamsa$0]
[Unloading class GregorSamsa$0]
[Unloading class GregorSamsa]
[Unloading class GregorSamsa]
[Unloading class GregorSamsa]
[Unloading class GregorSamsa$1]
[Unloading class GregorSamsa$2]
[Unloading class GregorSamsa$0]
[Unloading class GregorSamsa$1]
[Unloading class GregorSamsa$0]
[Unloading class GregorSamsa$0]
[Unloading class GregorSamsa]
[Unloading class GregorSamsa$0]
[Unloading class GregorSamsa]
[Unloading class GregorSamsa$1]
[Unloading class GregorSamsa]
[Unloading class GregorSamsa$0]
[Unloading class GregorSamsa$0]
[Unloading class GregorSamsa]
[Unloading class GregorSamsa$1]
[Unloading class GregorSamsa]
[Unloading class GregorSamsa$0]
[Unloading class GregorSamsa$0]
[Unloading class GregorSamsa]
[INFO] Final Memory: 36M/141M
[INFO] ------------------------------------------------------------------------
[JENKINS] Archiving <https://jclouds.ci.cloudbees.com/job/jclouds-karaf-1.6.x-branch/ws/utils/pom.xml> to /home/jclouds/hudson_home/jobs/jclouds-karaf-1.6.x-branch/modules/org.apache.jclouds.karaf$utils/builds/2013-08-27_17-45-44/archive/org.apache.jclouds.karaf/utils/1.6.3-SNAPSHOT/utils-1.6.3-SNAPSHOT.pom
[JENKINS] Archiving <https://jclouds.ci.cloudbees.com/job/jclouds-karaf-1.6.x-branch/ws/utils/target/utils-1.6.3-SNAPSHOT.jar> to /home/jclouds/hudson_home/jobs/jclouds-karaf-1.6.x-branch/modules/org.apache.jclouds.karaf$utils/builds/2013-08-27_17-45-44/archive/org.apache.jclouds.karaf/utils/1.6.3-20130827.174724-2/utils-1.6.3-20130827.174724-2.jar
[JENKINS] Archiving <https://jclouds.ci.cloudbees.com/job/jclouds-karaf-1.6.x-branch/ws/cache/pom.xml> to /home/jclouds/hudson_home/jobs/jclouds-karaf-1.6.x-branch/modules/org.apache.jclouds.karaf$cache/builds/2013-08-27_17-45-44/archive/org.apache.jclouds.karaf/cache/1.6.3-SNAPSHOT/cache-1.6.3-SNAPSHOT.pom
[JENKINS] Archiving <https://jclouds.ci.cloudbees.com/job/jclouds-karaf-1.6.x-branch/ws/cache/target/cache-1.6.3-SNAPSHOT.jar> to /home/jclouds/hudson_home/jobs/jclouds-karaf-1.6.x-branch/modules/org.apache.jclouds.karaf$cache/builds/2013-08-27_17-45-44/archive/org.apache.jclouds.karaf/cache/1.6.3-20130827.174741-2/cache-1.6.3-20130827.174741-2.jar
[JENKINS] Archiving <https://jclouds.ci.cloudbees.com/job/jclouds-karaf-1.6.x-branch/ws/chef/commands/pom.xml> to /home/jclouds/hudson_home/jobs/jclouds-karaf-1.6.x-branch/modules/org.apache.jclouds.karaf.chef$commands/builds/2013-08-27_17-45-44/archive/org.apache.jclouds.karaf.chef/commands/1.6.3-SNAPSHOT/commands-1.6.3-SNAPSHOT.pom
[JENKINS] Archiving <https://jclouds.ci.cloudbees.com/job/jclouds-karaf-1.6.x-branch/ws/recipe/pom.xml> to /home/jclouds/hudson_home/jobs/jclouds-karaf-1.6.x-branch/modules/org.apache.jclouds.karaf$recipe/builds/2013-08-27_17-45-44/archive/org.apache.jclouds.karaf/recipe/1.6.3-SNAPSHOT/recipe-1.6.3-SNAPSHOT.pom
[JENKINS] Archiving <https://jclouds.ci.cloudbees.com/job/jclouds-karaf-1.6.x-branch/ws/recipe/target/recipe-1.6.3-SNAPSHOT.jar> to /home/jclouds/hudson_home/jobs/jclouds-karaf-1.6.x-branch/modules/org.apache.jclouds.karaf$recipe/builds/2013-08-27_17-45-44/archive/org.apache.jclouds.karaf/recipe/1.6.3-20130827.174732-2/recipe-1.6.3-20130827.174732-2.jar
[JENKINS] Archiving <https://jclouds.ci.cloudbees.com/job/jclouds-karaf-1.6.x-branch/ws/feature/pom.xml> to /home/jclouds/hudson_home/jobs/jclouds-karaf-1.6.x-branch/modules/org.apache.jclouds.karaf$jclouds-karaf/builds/2013-08-27_17-45-44/archive/org.apache.jclouds.karaf/jclouds-karaf/1.6.3-SNAPSHOT/jclouds-karaf-1.6.3-SNAPSHOT.pom
[JENKINS] Archiving <https://jclouds.ci.cloudbees.com/job/jclouds-karaf-1.6.x-branch/ws/commands/pom.xml> to /home/jclouds/hudson_home/jobs/jclouds-karaf-1.6.x-branch/modules/org.apache.jclouds.karaf$commands/builds/2013-08-27_17-45-44/archive/org.apache.jclouds.karaf/commands/1.6.3-SNAPSHOT/commands-1.6.3-SNAPSHOT.pom
[JENKINS] Archiving <https://jclouds.ci.cloudbees.com/job/jclouds-karaf-1.6.x-branch/ws/itests/pom.xml> to /home/jclouds/hudson_home/jobs/jclouds-karaf-1.6.x-branch/modules/org.apache.jclouds.karaf$itests/builds/2013-08-27_17-45-44/archive/org.apache.jclouds.karaf/itests/1.6.3-SNAPSHOT/itests-1.6.3-SNAPSHOT.pom
[JENKINS] Archiving <https://jclouds.ci.cloudbees.com/job/jclouds-karaf-1.6.x-branch/ws/urlhandler/pom.xml> to /home/jclouds/hudson_home/jobs/jclouds-karaf-1.6.x-branch/modules/org.apache.jclouds.karaf$urlhandler/builds/2013-08-27_17-45-44/archive/org.apache.jclouds.karaf/urlhandler/1.6.3-SNAPSHOT/urlhandler-1.6.3-SNAPSHOT.pom
[JENKINS] Archiving <https://jclouds.ci.cloudbees.com/job/jclouds-karaf-1.6.x-branch/ws/services/pom.xml> to /home/jclouds/hudson_home/jobs/jclouds-karaf-1.6.x-branch/modules/org.apache.jclouds.karaf$services/builds/2013-08-27_17-45-44/archive/org.apache.jclouds.karaf/services/1.6.3-SNAPSHOT/services-1.6.3-SNAPSHOT.pom
[JENKINS] Archiving <https://jclouds.ci.cloudbees.com/job/jclouds-karaf-1.6.x-branch/ws/chef/core/pom.xml> to /home/jclouds/hudson_home/jobs/jclouds-karaf-1.6.x-branch/modules/org.apache.jclouds.karaf.chef$core/builds/2013-08-27_17-45-44/archive/org.apache.jclouds.karaf.chef/core/1.6.3-SNAPSHOT/core-1.6.3-SNAPSHOT.pom
[JENKINS] Archiving <https://jclouds.ci.cloudbees.com/job/jclouds-karaf-1.6.x-branch/ws/chef/services/pom.xml> to /home/jclouds/hudson_home/jobs/jclouds-karaf-1.6.x-branch/modules/org.apache.jclouds.karaf.chef$services/builds/2013-08-27_17-45-44/archive/org.apache.jclouds.karaf.chef/services/1.6.3-SNAPSHOT/services-1.6.3-SNAPSHOT.pom
[JENKINS] Archiving <https://jclouds.ci.cloudbees.com/job/jclouds-karaf-1.6.x-branch/ws/chef/pom.xml> to /home/jclouds/hudson_home/jobs/jclouds-karaf-1.6.x-branch/modules/org.apache.jclouds.karaf$chef/builds/2013-08-27_17-45-44/archive/org.apache.jclouds.karaf/chef/1.6.3-SNAPSHOT/chef-1.6.3-SNAPSHOT.pom
[JENKINS] Archiving <https://jclouds.ci.cloudbees.com/job/jclouds-karaf-1.6.x-branch/ws/pom.xml> to /home/jclouds/hudson_home/jobs/jclouds-karaf-1.6.x-branch/modules/org.apache.jclouds$jclouds-karaf/builds/2013-08-27_17-45-44/archive/org.apache.jclouds/jclouds-karaf/1.6.3-SNAPSHOT/jclouds-karaf-1.6.3-SNAPSHOT.pom
[JENKINS] Archiving <https://jclouds.ci.cloudbees.com/job/jclouds-karaf-1.6.x-branch/ws/core/pom.xml> to /home/jclouds/hudson_home/jobs/jclouds-karaf-1.6.x-branch/modules/org.apache.jclouds.karaf$core/builds/2013-08-27_17-45-44/archive/org.apache.jclouds.karaf/core/1.6.3-SNAPSHOT/core-1.6.3-SNAPSHOT.pom
[JENKINS] Archiving <https://jclouds.ci.cloudbees.com/job/jclouds-karaf-1.6.x-branch/ws/core/target/core-1.6.3-SNAPSHOT.jar> to /home/jclouds/hudson_home/jobs/jclouds-karaf-1.6.x-branch/modules/org.apache.jclouds.karaf$core/builds/2013-08-27_17-45-44/archive/org.apache.jclouds.karaf/core/1.6.3-20130827.174713-2/core-1.6.3-20130827.174713-2.jar
[JENKINS] Archiving <https://jclouds.ci.cloudbees.com/job/jclouds-karaf-1.6.x-branch/ws/chef/cache/pom.xml> to /home/jclouds/hudson_home/jobs/jclouds-karaf-1.6.x-branch/modules/org.apache.jclouds.karaf.chef$cache/builds/2013-08-27_17-45-44/archive/org.apache.jclouds.karaf.chef/cache/1.6.3-SNAPSHOT/cache-1.6.3-SNAPSHOT.pom
[WARNING] The requested profile "doc" could not be activated because it does not exist.
[WARNING] The requested profile "src" could not be activated because it does not exist.
Waiting for Jenkins to finish collecting data
mavenExecutionResult exceptions not empty
message : Failed to execute goal on project services: Could not resolve dependencies for project org.apache.jclouds.karaf:services:bundle:1.6.3-SNAPSHOT: Could not find artifact org.apache.jclouds.labs.management:management-core:jar:1.6.3-SNAPSHOT in cloudbees-private-snapshot-repository (https://repository-jclouds.forge.cloudbees.com/snapshot)
cause : Could not resolve dependencies for project org.apache.jclouds.karaf:services:bundle:1.6.3-SNAPSHOT: Could not find artifact org.apache.jclouds.labs.management:management-core:jar:1.6.3-SNAPSHOT in cloudbees-private-snapshot-repository (https://repository-jclouds.forge.cloudbees.com/snapshot)
Stack trace : 
org.apache.maven.lifecycle.LifecycleExecutionException: Failed to execute goal on project services: Could not resolve dependencies for project org.apache.jclouds.karaf:services:bundle:1.6.3-SNAPSHOT: Could not find artifact org.apache.jclouds.labs.management:management-core:jar:1.6.3-SNAPSHOT in cloudbees-private-snapshot-repository (https://repository-jclouds.forge.cloudbees.com/snapshot)
	at org.apache.maven.lifecycle.internal.LifecycleDependencyResolver.getDependencies(LifecycleDependencyResolver.java:196)
	at org.apache.maven.lifecycle.internal.LifecycleDependencyResolver.resolveProjectDependencies(LifecycleDependencyResolver.java:108)
	at org.apache.maven.lifecycle.internal.MojoExecutor.ensureDependenciesAreResolved(MojoExecutor.java:258)
	at org.apache.maven.lifecycle.internal.MojoExecutor.execute(MojoExecutor.java:201)
	at org.apache.maven.lifecycle.internal.MojoExecutor.execute(MojoExecutor.java:153)
	at org.apache.maven.lifecycle.internal.MojoExecutor.execute(MojoExecutor.java:145)
	at org.apache.maven.lifecycle.internal.LifecycleModuleBuilder.buildProject(LifecycleModuleBuilder.java:84)
	at org.apache.maven.lifecycle.internal.LifecycleModuleBuilder.buildProject(LifecycleModuleBuilder.java:59)
	at org.apache.maven.lifecycle.internal.LifecycleStarter.singleThreadedBuild(LifecycleStarter.java:183)
	at org.apache.maven.lifecycle.internal.LifecycleStarter.execute(LifecycleStarter.java:161)
	at org.apache.maven.DefaultMaven.doExecute(DefaultMaven.java:319)
	at org.apache.maven.DefaultMaven.execute(DefaultMaven.java:156)
	at org.jvnet.hudson.maven3.launcher.Maven3Launcher.main(Maven3Launcher.java:79)
	at sun.reflect.NativeMethodAccessorImpl.invoke0(Native Method)
	at sun.reflect.NativeMethodAccessorImpl.invoke(NativeMethodAccessorImpl.java:39)
	at sun.reflect.DelegatingMethodAccessorImpl.invoke(DelegatingMethodAccessorImpl.java:25)
	at java.lang.reflect.Method.invoke(Method.java:597)
	at org.codehaus.plexus.classworlds.launcher.Launcher.launchStandard(Launcher.java:329)
	at org.codehaus.plexus.classworlds.launcher.Launcher.launch(Launcher.java:239)
	at org.jvnet.hudson.maven3.agent.Maven3Main.launch(Maven3Main.java:158)
	at hudson.maven.Maven3Builder.call(Maven3Builder.java:100)
	at hudson.maven.Maven3Builder.call(Maven3Builder.java:66)
	at hudson.remoting.UserRequest.perform(UserRequest.java:118)
	at hudson.remoting.UserRequest.perform(UserRequest.java:48)
	at hudson.remoting.Request$2.run(Request.java:326)
	at hudson.remoting.InterceptingExecutorService$1.call(InterceptingExecutorService.java:72)
	at java.util.concurrent.FutureTask$Sync.innerRun(FutureTask.java:303)
	at java.util.concurrent.FutureTask.run(FutureTask.java:138)
	at java.util.concurrent.ThreadPoolExecutor$Worker.runTask(ThreadPoolExecutor.java:895)
	at java.util.concurrent.ThreadPoolExecutor$Worker.run(ThreadPoolExecutor.java:918)
	at java.lang.Thread.run(Thread.java:662)
Caused by: org.apache.maven.project.DependencyResolutionException: Could not resolve dependencies for project org.apache.jclouds.karaf:services:bundle:1.6.3-SNAPSHOT: Could not find artifact org.apache.jclouds.labs.management:management-core:jar:1.6.3-SNAPSHOT in cloudbees-private-snapshot-repository (https://repository-jclouds.forge.cloudbees.com/snapshot)
	at org.apache.maven.project.DefaultProjectDependenciesResolver.resolve(DefaultProjectDependenciesResolver.java:170)
	at org.apache.maven.lifecycle.internal.LifecycleDependencyResolver.getDependencies(LifecycleDependencyResolver.java:171)
	... 30 more
Caused by: org.sonatype.aether.resolution.DependencyResolutionException: Could not find artifact org.apache.jclouds.labs.management:management-core:jar:1.6.3-SNAPSHOT in cloudbees-private-snapshot-repository (https://repository-jclouds.forge.cloudbees.com/snapshot)
	at org.sonatype.aether.impl.internal.DefaultRepositorySystem.resolveDependencies(DefaultRepositorySystem.java:412)
	at org.apache.maven.project.DefaultProjectDependenciesResolver.resolve(DefaultProjectDependenciesResolver.java:164)
	... 31 more
Caused by: org.sonatype.aether.resolution.ArtifactResolutionException: Could not find artifact org.apache.jclouds.labs.management:management-core:jar:1.6.3-SNAPSHOT in cloudbees-private-snapshot-repository (https://repository-jclouds.forge.cloudbees.com/snapshot)
	at org.sonatype.aether.impl.internal.DefaultArtifactResolver.resolve(DefaultArtifactResolver.java:541)
	at org.sonatype.aether.impl.internal.DefaultArtifactResolver.resolveArtifacts(DefaultArtifactResolver.java:220)
	at org.sonatype.aether.impl.internal.DefaultRepositorySystem.resolveDependencies(DefaultRepositorySystem.java:395)
	... 32 more
Caused by: org.sonatype.aether.transfer.ArtifactNotFoundException: Could not find artifact org.apache.jclouds.labs.management:management-core:jar:1.6.3-SNAPSHOT in cloudbees-private-snapshot-repository (https://repository-jclouds.forge.cloudbees.com/snapshot)
	at org.sonatype.aether.connector.wagon.WagonRepositoryConnector$4.wrap(WagonRepositoryConnector.java:945)
	at org.sonatype.aether.connector.wagon.WagonRepositoryConnector$4.wrap(WagonRepositoryConnector.java:940)
	at org.sonatype.aether.connector.wagon.WagonRepositoryConnector$GetTask.flush(WagonRepositoryConnector.java:695)
	at org.sonatype.aether.connector.wagon.WagonRepositoryConnector$GetTask.flush(WagonRepositoryConnector.java:689)
	at org.sonatype.aether.connector.wagon.WagonRepositoryConnector.get(WagonRepositoryConnector.java:445)
	at org.sonatype.aether.impl.internal.DefaultArtifactResolver.resolve(DefaultArtifactResolver.java:460)
	... 34 more
channel stopped

Jenkins build is back to normal : jclouds-karaf-1.6.x-branch #92

Posted by je...@cloudbees.com.
See <https://jclouds.ci.cloudbees.com/job/jclouds-karaf-1.6.x-branch/92/changes>