You are viewing a plain text version of this content. The canonical link for it is here.
Posted to builds@lucene.apache.org by Apache Jenkins Server <je...@builds.apache.org> on 2021/01/15 23:46:47 UTC

[JENKINS] Lucene » Lucene-Solr-Tests-8.8 - Build # 85 - Still Unstable!

Build: https://ci-builds.apache.org/job/Lucene/job/Lucene-Solr-Tests-8.8/85/

2 tests failed.
FAILED:  org.apache.solr.cloud.TestWithCollection.testNodeAdded

Error Message:
Action was not fired till 30 seconds

Stack Trace:
java.lang.AssertionError: Action was not fired till 30 seconds
	at __randomizedtesting.SeedInfo.seed([36DCEFC297F441B:66AE988B8BDCEC18]:0)
	at org.junit.Assert.fail(Assert.java:89)
	at org.junit.Assert.assertTrue(Assert.java:42)
	at org.apache.solr.cloud.TestWithCollection.testNodeAdded(TestWithCollection.java:471)
	at sun.reflect.NativeMethodAccessorImpl.invoke0(Native Method)
	at sun.reflect.NativeMethodAccessorImpl.invoke(NativeMethodAccessorImpl.java:62)
	at sun.reflect.DelegatingMethodAccessorImpl.invoke(DelegatingMethodAccessorImpl.java:43)
	at java.lang.reflect.Method.invoke(Method.java:498)
	at com.carrotsearch.randomizedtesting.RandomizedRunner.invoke(RandomizedRunner.java:1750)
	at com.carrotsearch.randomizedtesting.RandomizedRunner$8.evaluate(RandomizedRunner.java:938)
	at com.carrotsearch.randomizedtesting.RandomizedRunner$9.evaluate(RandomizedRunner.java:974)
	at com.carrotsearch.randomizedtesting.RandomizedRunner$10.evaluate(RandomizedRunner.java:988)
	at com.carrotsearch.randomizedtesting.rules.SystemPropertiesRestoreRule$1.evaluate(SystemPropertiesRestoreRule.java:57)
	at org.junit.rules.RunRules.evaluate(RunRules.java:20)
	at org.apache.lucene.util.TestRuleSetupTeardownChained$1.evaluate(TestRuleSetupTeardownChained.java:49)
	at org.apache.lucene.util.AbstractBeforeAfterRule$1.evaluate(AbstractBeforeAfterRule.java:45)
	at org.apache.lucene.util.TestRuleThreadAndTestName$1.evaluate(TestRuleThreadAndTestName.java:48)
	at org.apache.lucene.util.TestRuleIgnoreAfterMaxFailures$1.evaluate(TestRuleIgnoreAfterMaxFailures.java:64)
	at org.apache.lucene.util.TestRuleMarkFailure$1.evaluate(TestRuleMarkFailure.java:47)
	at org.junit.rules.RunRules.evaluate(RunRules.java:20)
	at com.carrotsearch.randomizedtesting.rules.StatementAdapter.evaluate(StatementAdapter.java:36)
	at com.carrotsearch.randomizedtesting.ThreadLeakControl$StatementRunner.run(ThreadLeakControl.java:368)
	at com.carrotsearch.randomizedtesting.ThreadLeakControl.forkTimeoutingTask(ThreadLeakControl.java:817)
	at com.carrotsearch.randomizedtesting.ThreadLeakControl$3.evaluate(ThreadLeakControl.java:468)
	at com.carrotsearch.randomizedtesting.RandomizedRunner.runSingleTest(RandomizedRunner.java:947)
	at com.carrotsearch.randomizedtesting.RandomizedRunner$5.evaluate(RandomizedRunner.java:832)
	at com.carrotsearch.randomizedtesting.RandomizedRunner$6.evaluate(RandomizedRunner.java:883)
	at com.carrotsearch.randomizedtesting.RandomizedRunner$7.evaluate(RandomizedRunner.java:894)
	at com.carrotsearch.randomizedtesting.rules.StatementAdapter.evaluate(StatementAdapter.java:36)
	at com.carrotsearch.randomizedtesting.rules.SystemPropertiesRestoreRule$1.evaluate(SystemPropertiesRestoreRule.java:57)
	at org.junit.rules.RunRules.evaluate(RunRules.java:20)
	at org.apache.lucene.util.AbstractBeforeAfterRule$1.evaluate(AbstractBeforeAfterRule.java:45)
	at com.carrotsearch.randomizedtesting.rules.StatementAdapter.evaluate(StatementAdapter.java:36)
	at org.apache.lucene.util.TestRuleStoreClassName$1.evaluate(TestRuleStoreClassName.java:41)
	at com.carrotsearch.randomizedtesting.rules.NoShadowingOrOverridesOnMethodsRule$1.evaluate(NoShadowingOrOverridesOnMethodsRule.java:40)
	at com.carrotsearch.randomizedtesting.rules.NoShadowingOrOverridesOnMethodsRule$1.evaluate(NoShadowingOrOverridesOnMethodsRule.java:40)
	at com.carrotsearch.randomizedtesting.rules.StatementAdapter.evaluate(StatementAdapter.java:36)
	at com.carrotsearch.randomizedtesting.rules.StatementAdapter.evaluate(StatementAdapter.java:36)
	at com.carrotsearch.randomizedtesting.rules.StatementAdapter.evaluate(StatementAdapter.java:36)
	at org.apache.lucene.util.TestRuleAssertionsRequired$1.evaluate(TestRuleAssertionsRequired.java:53)
	at org.apache.lucene.util.TestRuleMarkFailure$1.evaluate(TestRuleMarkFailure.java:47)
	at org.apache.lucene.util.TestRuleIgnoreAfterMaxFailures$1.evaluate(TestRuleIgnoreAfterMaxFailures.java:64)
	at org.apache.lucene.util.TestRuleIgnoreTestSuites$1.evaluate(TestRuleIgnoreTestSuites.java:54)
	at org.junit.rules.RunRules.evaluate(RunRules.java:20)
	at com.carrotsearch.randomizedtesting.rules.StatementAdapter.evaluate(StatementAdapter.java:36)
	at com.carrotsearch.randomizedtesting.ThreadLeakControl$StatementRunner.run(ThreadLeakControl.java:368)
	at java.lang.Thread.run(Thread.java:748)


FAILED:  org.apache.solr.metrics.reporters.SolrJmxReporterTest.testClosedCore

Error Message:
Captured an uncaught exception in thread: Thread[id=31146, name=Thread-5673, state=RUNNABLE, group=TGRP-SolrJmxReporterTest]

Stack Trace:
com.carrotsearch.randomizedtesting.UncaughtExceptionError: Captured an uncaught exception in thread: Thread[id=31146, name=Thread-5673, state=RUNNABLE, group=TGRP-SolrJmxReporterTest]
	at __randomizedtesting.SeedInfo.seed([36DCEFC297F441B:741018DC09E626EB]:0)
Caused by: java.lang.AssertionError
	at __randomizedtesting.SeedInfo.seed([36DCEFC297F441B]:0)
	at org.junit.Assert.fail(Assert.java:87)
	at org.junit.Assert.assertTrue(Assert.java:42)
	at org.junit.Assert.assertNotNull(Assert.java:713)
	at org.junit.Assert.assertNotNull(Assert.java:723)
	at org.apache.solr.metrics.reporters.SolrJmxReporterTest$1.run(SolrJmxReporterTest.java:213)




Build Log:
[...truncated 15238 lines...]
   [junit4] Suite: org.apache.solr.cloud.TestWithCollection
   [junit4]   2> 1597303 INFO  (SUITE-TestWithCollection-seed#[36DCEFC297F441B]-worker) [     ] o.a.s.SolrTestCase Setting 'solr.default.confdir' system property to test-framework derived value of '/home/jenkins/jenkins-slave/workspace/Lucene/Lucene-Solr-Tests-8.8/solr/server/solr/configsets/_default/conf'
   [junit4]   2> 1597303 INFO  (SUITE-TestWithCollection-seed#[36DCEFC297F441B]-worker) [     ] o.a.s.SolrTestCaseJ4 SecureRandom sanity checks: test.solr.allowed.securerandom=null & java.security.egd=file:/dev/./urandom
   [junit4]   2> 1597305 INFO  (SUITE-TestWithCollection-seed#[36DCEFC297F441B]-worker) [     ] o.a.s.SolrTestCaseJ4 Created dataDir: /home/jenkins/jenkins-slave/workspace/Lucene/Lucene-Solr-Tests-8.8/solr/build/solr-core/test/J1/temp/solr.cloud.TestWithCollection_36DCEFC297F441B-001/data-dir-150-001
   [junit4]   2> 1597305 WARN  (SUITE-TestWithCollection-seed#[36DCEFC297F441B]-worker) [     ] o.a.s.SolrTestCaseJ4 startTrackingSearchers: numOpens=1837 numCloses=1837
   [junit4]   2> 1597305 INFO  (SUITE-TestWithCollection-seed#[36DCEFC297F441B]-worker) [     ] o.a.s.SolrTestCaseJ4 Using TrieFields (NUMERIC_POINTS_SYSPROP=false) w/NUMERIC_DOCVALUES_SYSPROP=true
   [junit4]   2> 1597306 INFO  (SUITE-TestWithCollection-seed#[36DCEFC297F441B]-worker) [     ] o.a.s.SolrTestCaseJ4 Randomized ssl (true) and clientAuth (false) via: @org.apache.solr.util.RandomizeSSL(reason=, ssl=NaN, value=NaN, clientAuth=NaN)
   [junit4]   2> 1597307 INFO  (SUITE-TestWithCollection-seed#[36DCEFC297F441B]-worker) [     ] o.a.s.c.SolrCloudTestCase Using per-replica state
   [junit4]   2> 1597310 INFO  (TEST-TestWithCollection.testMoveReplicaMainCollection-seed#[36DCEFC297F441B]) [     ] o.a.s.SolrTestCaseJ4 ###Starting testMoveReplicaMainCollection
   [junit4]   2> 1597310 INFO  (TEST-TestWithCollection.testMoveReplicaMainCollection-seed#[36DCEFC297F441B]) [     ] o.a.s.c.MiniSolrCloudCluster Starting cluster of 2 servers in /home/jenkins/jenkins-slave/workspace/Lucene/Lucene-Solr-Tests-8.8/solr/build/solr-core/test/J1/temp/solr.cloud.TestWithCollection_36DCEFC297F441B-001/tempDir-001
   [junit4]   2> 1597310 INFO  (TEST-TestWithCollection.testMoveReplicaMainCollection-seed#[36DCEFC297F441B]) [     ] o.a.s.c.ZkTestServer STARTING ZK TEST SERVER
   [junit4]   2> 1597310 INFO  (ZkTestServer Run Thread) [     ] o.a.s.c.ZkTestServer client port: 0.0.0.0/0.0.0.0:0
   [junit4]   2> 1597311 INFO  (ZkTestServer Run Thread) [     ] o.a.s.c.ZkTestServer Starting server
   [junit4]   2> 1597311 WARN  (ZkTestServer Run Thread) [     ] o.a.z.s.ServerCnxnFactory maxCnxns is not configured, using default value 0.
   [junit4]   2> 1597410 INFO  (TEST-TestWithCollection.testMoveReplicaMainCollection-seed#[36DCEFC297F441B]) [     ] o.a.s.c.ZkTestServer start zk server on port: 40377
   [junit4]   2> 1597411 INFO  (TEST-TestWithCollection.testMoveReplicaMainCollection-seed#[36DCEFC297F441B]) [     ] o.a.s.c.ZkTestServer waitForServerUp: 127.0.0.1:40377
   [junit4]   2> 1597411 INFO  (TEST-TestWithCollection.testMoveReplicaMainCollection-seed#[36DCEFC297F441B]) [     ] o.a.s.c.ZkTestServer parse host and port list: 127.0.0.1:40377
   [junit4]   2> 1597411 INFO  (TEST-TestWithCollection.testMoveReplicaMainCollection-seed#[36DCEFC297F441B]) [     ] o.a.s.c.ZkTestServer connecting to 127.0.0.1 40377
   [junit4]   2> 1597412 INFO  (TEST-TestWithCollection.testMoveReplicaMainCollection-seed#[36DCEFC297F441B]) [     ] o.a.s.c.c.ConnectionManager Waiting for client to connect to ZooKeeper
   [junit4]   2> 1597415 INFO  (zkConnectionManagerCallback-20333-thread-1) [     ] o.a.s.c.c.ConnectionManager zkClient has connected
   [junit4]   2> 1597415 INFO  (TEST-TestWithCollection.testMoveReplicaMainCollection-seed#[36DCEFC297F441B]) [     ] o.a.s.c.c.ConnectionManager Client is connected to ZooKeeper
   [junit4]   2> 1597417 INFO  (TEST-TestWithCollection.testMoveReplicaMainCollection-seed#[36DCEFC297F441B]) [     ] o.a.s.c.c.ConnectionManager Waiting for client to connect to ZooKeeper
   [junit4]   2> 1597419 INFO  (zkConnectionManagerCallback-20335-thread-1) [     ] o.a.s.c.c.ConnectionManager zkClient has connected
   [junit4]   2> 1597419 INFO  (TEST-TestWithCollection.testMoveReplicaMainCollection-seed#[36DCEFC297F441B]) [     ] o.a.s.c.c.ConnectionManager Client is connected to ZooKeeper
   [junit4]   2> 1597419 INFO  (TEST-TestWithCollection.testMoveReplicaMainCollection-seed#[36DCEFC297F441B]) [     ] o.a.s.c.c.ConnectionManager Waiting for client to connect to ZooKeeper
   [junit4]   2> 1597420 INFO  (zkConnectionManagerCallback-20337-thread-1) [     ] o.a.s.c.c.ConnectionManager zkClient has connected
   [junit4]   2> 1597420 INFO  (TEST-TestWithCollection.testMoveReplicaMainCollection-seed#[36DCEFC297F441B]) [     ] o.a.s.c.c.ConnectionManager Client is connected to ZooKeeper
   [junit4]   2> 1597524 INFO  (jetty-launcher-20338-thread-2) [     ] o.a.s.c.s.e.JettySolrRunner Start Jetty (configured port=0, binding port=0)
   [junit4]   2> 1597524 INFO  (jetty-launcher-20338-thread-1) [     ] o.a.s.c.s.e.JettySolrRunner Start Jetty (configured port=0, binding port=0)
   [junit4]   2> 1597524 INFO  (jetty-launcher-20338-thread-2) [     ] o.a.s.c.s.e.JettySolrRunner Trying to start Jetty on port 0 try number 2 ...
   [junit4]   2> 1597524 INFO  (jetty-launcher-20338-thread-1) [     ] o.a.s.c.s.e.JettySolrRunner Trying to start Jetty on port 0 try number 2 ...
   [junit4]   2> 1597524 INFO  (jetty-launcher-20338-thread-1) [     ] o.e.j.s.Server jetty-9.4.34.v20201102; built: 2020-11-02T14:15:39.302Z; git: e46af88704a893fc12cb0e3bf46e2c7b48a009e7; jvm 1.8.0_252-b09
   [junit4]   2> 1597524 INFO  (jetty-launcher-20338-thread-2) [     ] o.e.j.s.Server jetty-9.4.34.v20201102; built: 2020-11-02T14:15:39.302Z; git: e46af88704a893fc12cb0e3bf46e2c7b48a009e7; jvm 1.8.0_252-b09
   [junit4]   2> 1597533 INFO  (jetty-launcher-20338-thread-1) [     ] o.e.j.s.session DefaultSessionIdManager workerName=node0
   [junit4]   2> 1597533 INFO  (jetty-launcher-20338-thread-1) [     ] o.e.j.s.session No SessionScavenger set, using defaults
   [junit4]   2> 1597533 INFO  (jetty-launcher-20338-thread-1) [     ] o.e.j.s.session node0 Scavenging every 660000ms
   [junit4]   2> 1597533 INFO  (jetty-launcher-20338-thread-2) [     ] o.e.j.s.session DefaultSessionIdManager workerName=node0
   [junit4]   2> 1597533 INFO  (jetty-launcher-20338-thread-2) [     ] o.e.j.s.session No SessionScavenger set, using defaults
   [junit4]   2> 1597533 INFO  (jetty-launcher-20338-thread-2) [     ] o.e.j.s.session node0 Scavenging every 660000ms
   [junit4]   2> 1597533 INFO  (jetty-launcher-20338-thread-1) [     ] o.e.j.s.h.ContextHandler Started o.e.j.s.ServletContextHandler@2b33fcfc{/solr,null,AVAILABLE}
   [junit4]   2> 1597533 INFO  (jetty-launcher-20338-thread-2) [     ] o.e.j.s.h.ContextHandler Started o.e.j.s.ServletContextHandler@604abaa0{/solr,null,AVAILABLE}
   [junit4]   2> 1597534 INFO  (jetty-launcher-20338-thread-1) [     ] o.e.j.s.AbstractConnector Started ServerConnector@16d427a{SSL, (ssl, http/1.1)}{127.0.0.1:41305}
   [junit4]   2> 1597534 INFO  (jetty-launcher-20338-thread-2) [     ] o.e.j.s.AbstractConnector Started ServerConnector@18e338c1{SSL, (ssl, http/1.1)}{127.0.0.1:40263}
   [junit4]   2> 1597534 INFO  (jetty-launcher-20338-thread-1) [     ] o.e.j.s.Server Started @1597561ms
   [junit4]   2> 1597534 INFO  (jetty-launcher-20338-thread-2) [     ] o.e.j.s.Server Started @1597561ms
   [junit4]   2> 1597534 INFO  (jetty-launcher-20338-thread-1) [     ] o.a.s.c.s.e.JettySolrRunner Jetty properties: {hostContext=/solr, zkHost=127.0.0.1:40377/solr, hostPort=41305}
   [junit4]   2> 1597534 INFO  (jetty-launcher-20338-thread-2) [     ] o.a.s.c.s.e.JettySolrRunner Jetty properties: {hostContext=/solr, zkHost=127.0.0.1:40377/solr, hostPort=40263}
   [junit4]   2> 1597535 ERROR (jetty-launcher-20338-thread-1) [     ] o.a.s.u.StartupLoggingUtils Missing Java Option solr.log.dir. Logging may be missing or incomplete.
   [junit4]   2> 1597535 ERROR (jetty-launcher-20338-thread-2) [     ] o.a.s.u.StartupLoggingUtils Missing Java Option solr.log.dir. Logging may be missing or incomplete.
   [junit4]   2> 1597535 INFO  (jetty-launcher-20338-thread-1) [     ] o.a.s.s.SolrDispatchFilter Using logger factory org.apache.logging.slf4j.Log4jLoggerFactory
   [junit4]   2> 1597535 INFO  (jetty-launcher-20338-thread-2) [     ] o.a.s.s.SolrDispatchFilter Using logger factory org.apache.logging.slf4j.Log4jLoggerFactory
   [junit4]   2> 1597535 INFO  (jetty-launcher-20338-thread-1) [     ] o.a.s.s.SolrDispatchFilter  ___      _       Welcome to Apache Solr™ version 8.8.0
   [junit4]   2> 1597535 INFO  (jetty-launcher-20338-thread-1) [     ] o.a.s.s.SolrDispatchFilter / __| ___| |_ _   Starting in cloud mode on port null
   [junit4]   2> 1597535 INFO  (jetty-launcher-20338-thread-2) [     ] o.a.s.s.SolrDispatchFilter  ___      _       Welcome to Apache Solr™ version 8.8.0
   [junit4]   2> 1597535 INFO  (jetty-launcher-20338-thread-1) [     ] o.a.s.s.SolrDispatchFilter \__ \/ _ \ | '_|  Install dir: /home/jenkins/jenkins-slave/workspace/Lucene/Lucene-Solr-Tests-8.8/solr
   [junit4]   2> 1597535 INFO  (jetty-launcher-20338-thread-2) [     ] o.a.s.s.SolrDispatchFilter / __| ___| |_ _   Starting in cloud mode on port null
   [junit4]   2> 1597535 INFO  (jetty-launcher-20338-thread-1) [     ] o.a.s.s.SolrDispatchFilter |___/\___/_|_|    Start time: 2021-01-15T23:14:48.270Z
   [junit4]   2> 1597535 INFO  (jetty-launcher-20338-thread-2) [     ] o.a.s.s.SolrDispatchFilter \__ \/ _ \ | '_|  Install dir: /home/jenkins/jenkins-slave/workspace/Lucene/Lucene-Solr-Tests-8.8/solr
   [junit4]   2> 1597535 INFO  (jetty-launcher-20338-thread-2) [     ] o.a.s.s.SolrDispatchFilter |___/\___/_|_|    Start time: 2021-01-15T23:14:48.270Z
   [junit4]   2> 1597536 INFO  (jetty-launcher-20338-thread-1) [     ] o.a.s.c.c.ConnectionManager Waiting for client to connect to ZooKeeper
   [junit4]   2> 1597536 INFO  (jetty-launcher-20338-thread-2) [     ] o.a.s.c.c.ConnectionManager Waiting for client to connect to ZooKeeper
   [junit4]   2> 1597537 INFO  (zkConnectionManagerCallback-20340-thread-1) [     ] o.a.s.c.c.ConnectionManager zkClient has connected
   [junit4]   2> 1597537 INFO  (jetty-launcher-20338-thread-1) [     ] o.a.s.c.c.ConnectionManager Client is connected to ZooKeeper
   [junit4]   2> 1597538 INFO  (jetty-launcher-20338-thread-1) [     ] o.a.s.s.SolrDispatchFilter solr.xml found in ZooKeeper. Loading...
   [junit4]   2> 1597541 INFO  (zkConnectionManagerCallback-20342-thread-1) [     ] o.a.s.c.c.ConnectionManager zkClient has connected
   [junit4]   2> 1597541 INFO  (jetty-launcher-20338-thread-2) [     ] o.a.s.c.c.ConnectionManager Client is connected to ZooKeeper
   [junit4]   2> 1597542 INFO  (jetty-launcher-20338-thread-2) [     ] o.a.s.s.SolrDispatchFilter solr.xml found in ZooKeeper. Loading...
   [junit4]   2> 1597545 WARN  (jetty-launcher-20338-thread-1-SendThread(127.0.0.1:40377)) [     ] o.a.z.ClientCnxn An exception was thrown while closing send thread for session 0x102bf3f64af0003.
   [junit4]   2>           => EndOfStreamException: Unable to read additional data from server sessionid 0x102bf3f64af0003, likely server has closed socket
   [junit4]   2> 	at org.apache.zookeeper.ClientCnxnSocketNIO.doIO(ClientCnxnSocketNIO.java:77)
   [junit4]   2> org.apache.zookeeper.ClientCnxn$EndOfStreamException: Unable to read additional data from server sessionid 0x102bf3f64af0003, likely server has closed socket
   [junit4]   2> 	at org.apache.zookeeper.ClientCnxnSocketNIO.doIO(ClientCnxnSocketNIO.java:77) ~[zookeeper-3.6.2.jar:3.6.2]
   [junit4]   2> 	at org.apache.zookeeper.ClientCnxnSocketNIO.doTransport(ClientCnxnSocketNIO.java:350) ~[zookeeper-3.6.2.jar:3.6.2]
   [junit4]   2> 	at org.apache.zookeeper.ClientCnxn$SendThread.run(ClientCnxn.java:1275) [zookeeper-3.6.2.jar:3.6.2]
   [junit4]   2> 1598037 INFO  (jetty-launcher-20338-thread-1) [     ] o.a.s.h.c.HttpShardHandlerFactory Host whitelist initialized: WhitelistHostChecker [whitelistHosts=null, whitelistHostCheckingEnabled=true]
   [junit4]   2> 1598037 WARN  (jetty-launcher-20338-thread-1) [     ] o.a.s.c.s.i.Http2SolrClient Create Http2SolrClient with HTTP/1.1 transport since Java 8 or lower versions does not support SSL + HTTP/2
   [junit4]   2> 1598038 WARN  (jetty-launcher-20338-thread-1) [     ] o.e.j.u.s.S.config Trusting all certificates configured for Client@20e5f0e9[provider=null,keyStore=null,trustStore=null]
   [junit4]   2> 1598038 WARN  (jetty-launcher-20338-thread-1) [     ] o.e.j.u.s.S.config No Client EndPointIdentificationAlgorithm configured for Client@20e5f0e9[provider=null,keyStore=null,trustStore=null]
   [junit4]   2> 1598040 WARN  (jetty-launcher-20338-thread-1) [     ] o.a.s.c.s.i.Http2SolrClient Create Http2SolrClient with HTTP/1.1 transport since Java 8 or lower versions does not support SSL + HTTP/2
   [junit4]   2> 1598041 WARN  (jetty-launcher-20338-thread-1) [     ] o.e.j.u.s.S.config Trusting all certificates configured for Client@72f3ef9[provider=null,keyStore=null,trustStore=null]
   [junit4]   2> 1598041 WARN  (jetty-launcher-20338-thread-1) [     ] o.e.j.u.s.S.config No Client EndPointIdentificationAlgorithm configured for Client@72f3ef9[provider=null,keyStore=null,trustStore=null]
   [junit4]   2> 1598042 INFO  (jetty-launcher-20338-thread-1) [     ] o.a.s.c.ZkContainer Zookeeper client=127.0.0.1:40377/solr
   [junit4]   2> 1598045 INFO  (jetty-launcher-20338-thread-1) [     ] o.a.s.c.c.ConnectionManager Waiting for client to connect to ZooKeeper
   [junit4]   2> 1598046 INFO  (zkConnectionManagerCallback-20356-thread-1) [     ] o.a.s.c.c.ConnectionManager zkClient has connected
   [junit4]   2> 1598046 INFO  (jetty-launcher-20338-thread-1) [     ] o.a.s.c.c.ConnectionManager Client is connected to ZooKeeper
   [junit4]   2> 1598148 INFO  (jetty-launcher-20338-thread-1) [n:127.0.0.1:41305_solr     ] o.a.s.c.c.ConnectionManager Waiting for client to connect to ZooKeeper
   [junit4]   2> 1598149 INFO  (zkConnectionManagerCallback-20358-thread-1) [     ] o.a.s.c.c.ConnectionManager zkClient has connected
   [junit4]   2> 1598149 INFO  (jetty-launcher-20338-thread-1) [n:127.0.0.1:41305_solr     ] o.a.s.c.c.ConnectionManager Client is connected to ZooKeeper
   [junit4]   2> 1598212 INFO  (jetty-launcher-20338-thread-1) [n:127.0.0.1:41305_solr     ] o.a.s.c.OverseerElectionContext I am going to be the leader 127.0.0.1:41305_solr
   [junit4]   2> 1598212 INFO  (jetty-launcher-20338-thread-1) [n:127.0.0.1:41305_solr     ] o.a.s.c.Overseer Overseer (id=72830822984384518-127.0.0.1:41305_solr-n_0000000000) starting
   [junit4]   2> 1598226 INFO  (jetty-launcher-20338-thread-1) [n:127.0.0.1:41305_solr     ] o.a.s.c.ZkController Register node as live in ZooKeeper:/live_nodes/127.0.0.1:41305_solr
   [junit4]   2> 1598226 DEBUG (OverseerAutoScalingTriggerThread-72830822984384518-127.0.0.1:41305_solr-n_0000000000) [     ] o.a.s.c.a.OverseerTriggerThread Adding .auto_add_replicas and .scheduled_maintenance triggers
   [junit4]   2> 1598226 INFO  (OverseerStateUpdate-72830822984384518-127.0.0.1:41305_solr-n_0000000000) [n:127.0.0.1:41305_solr     ] o.a.s.c.Overseer Starting to work on the main queue : 127.0.0.1:41305_solr
   [junit4]   2> 1598229 DEBUG (OverseerAutoScalingTriggerThread-72830822984384518-127.0.0.1:41305_solr-n_0000000000) [     ] o.a.s.c.a.OverseerTriggerThread Refreshing /autoscaling.json with znode version 1
   [junit4]   2> 1598229 DEBUG (OverseerAutoScalingTriggerThread-72830822984384518-127.0.0.1:41305_solr-n_0000000000) [     ] o.a.s.c.a.OverseerTriggerThread Current znodeVersion 1, lastZnodeVersion 0
   [junit4]   2> 1598229 DEBUG (OverseerAutoScalingTriggerThread-72830822984384518-127.0.0.1:41305_solr-n_0000000000) [     ] o.a.s.c.a.OverseerTriggerThread Processed trigger updates upto znodeVersion 1
   [junit4]   2> 1598230 INFO  (OverseerStateUpdate-72830822984384518-127.0.0.1:41305_solr-n_0000000000) [n:127.0.0.1:41305_solr     ] o.a.s.c.c.ZkStateReader Updated live nodes from ZooKeeper... (0) -> (1)
   [junit4]   2> 1598236 INFO  (jetty-launcher-20338-thread-1) [n:127.0.0.1:41305_solr     ] o.a.s.p.PackageLoader /packages.json updated to version -1
   [junit4]   2> 1598237 WARN  (jetty-launcher-20338-thread-1) [n:127.0.0.1:41305_solr     ] o.a.s.c.CoreContainer Not all security plugins configured!  authentication=disabled authorization=disabled.  Solr is only as secure as you make it. Consider configuring authentication/authorization before exposing Solr to users internal or external.  See https://s.apache.org/solrsecurity for more info
   [junit4]   2> 1598244 DEBUG (OverseerAutoScalingTriggerThread-72830822984384518-127.0.0.1:41305_solr-n_0000000000) [     ] o.a.s.c.a.NodeLostTrigger NodeLostTrigger .auto_add_replicas - Initial livenodes: [127.0.0.1:41305_solr]
   [junit4]   2> 1598251 DEBUG (OverseerAutoScalingTriggerThread-72830822984384518-127.0.0.1:41305_solr-n_0000000000) [     ] o.a.s.c.a.OverseerTriggerThread -- deactivating old nodeLost / nodeAdded markers
   [junit4]   2> 1598252 DEBUG (OverseerAutoScalingTriggerThread-72830822984384518-127.0.0.1:41305_solr-n_0000000000) [     ] o.a.s.c.a.OverseerTriggerThread Current znodeVersion 1, lastZnodeVersion 1
   [junit4]   2> 1598252 DEBUG (ScheduledTrigger-20363-thread-2) [     ] o.a.s.c.a.NodeLostTrigger Running NodeLostTrigger: .auto_add_replicas with currently live nodes: 1 and last live nodes: 1
   [junit4]   2> 1598252 TRACE (ScheduledTrigger-20363-thread-2) [     ] o.a.s.c.a.NodeLostTrigger Current Live Nodes for .auto_add_replicas: [127.0.0.1:41305_solr]
   [junit4]   2> 1598252 TRACE (ScheduledTrigger-20363-thread-2) [     ] o.a.s.c.a.NodeLostTrigger Last Live Nodes for .auto_add_replicas: [127.0.0.1:41305_solr]
   [junit4]   2> 1598254 INFO  (jetty-launcher-20338-thread-1) [n:127.0.0.1:41305_solr     ] o.a.s.h.a.MetricsHistoryHandler No .system collection, keeping metrics history in memory.
   [junit4]   2> 1598284 INFO  (jetty-launcher-20338-thread-1) [n:127.0.0.1:41305_solr     ] o.a.s.m.r.SolrJmxReporter JMX monitoring for 'solr_41305.solr.node' (registry 'solr.node') enabled at server: com.sun.jmx.mbeanserver.JmxMBeanServer@26a139b5
   [junit4]   2> 1598302 INFO  (jetty-launcher-20338-thread-1) [n:127.0.0.1:41305_solr     ] o.a.s.m.r.SolrJmxReporter JMX monitoring for 'solr_41305.solr.jvm' (registry 'solr.jvm') enabled at server: com.sun.jmx.mbeanserver.JmxMBeanServer@26a139b5
   [junit4]   2> 1598302 INFO  (jetty-launcher-20338-thread-1) [n:127.0.0.1:41305_solr     ] o.a.s.m.r.SolrJmxReporter JMX monitoring for 'solr_41305.solr.jetty' (registry 'solr.jetty') enabled at server: com.sun.jmx.mbeanserver.JmxMBeanServer@26a139b5
   [junit4]   2> 1598303 INFO  (jetty-launcher-20338-thread-1) [n:127.0.0.1:41305_solr     ] o.a.s.c.CorePropertiesLocator Found 0 core definitions underneath /home/jenkins/jenkins-slave/workspace/Lucene/Lucene-Solr-Tests-8.8/solr/build/solr-core/test/J1/temp/solr.cloud.TestWithCollection_36DCEFC297F441B-001/tempDir-001/node1
   [junit4]   2> 1598341 INFO  (jetty-launcher-20338-thread-2) [     ] o.a.s.h.c.HttpShardHandlerFactory Host whitelist initialized: WhitelistHostChecker [whitelistHosts=null, whitelistHostCheckingEnabled=true]
   [junit4]   2> 1598341 WARN  (jetty-launcher-20338-thread-2) [     ] o.a.s.c.s.i.Http2SolrClient Create Http2SolrClient with HTTP/1.1 transport since Java 8 or lower versions does not support SSL + HTTP/2
   [junit4]   2> 1598342 WARN  (jetty-launcher-20338-thread-2) [     ] o.e.j.u.s.S.config Trusting all certificates configured for Client@514c1f50[provider=null,keyStore=null,trustStore=null]
   [junit4]   2> 1598342 WARN  (jetty-launcher-20338-thread-2) [     ] o.e.j.u.s.S.config No Client EndPointIdentificationAlgorithm configured for Client@514c1f50[provider=null,keyStore=null,trustStore=null]
   [junit4]   2> 1598344 WARN  (jetty-launcher-20338-thread-2) [     ] o.a.s.c.s.i.Http2SolrClient Create Http2SolrClient with HTTP/1.1 transport since Java 8 or lower versions does not support SSL + HTTP/2
   [junit4]   2> 1598344 WARN  (jetty-launcher-20338-thread-2) [     ] o.e.j.u.s.S.config Trusting all certificates configured for Client@be9db40[provider=null,keyStore=null,trustStore=null]
   [junit4]   2> 1598344 WARN  (jetty-launcher-20338-thread-2) [     ] o.e.j.u.s.S.config No Client EndPointIdentificationAlgorithm configured for Client@be9db40[provider=null,keyStore=null,trustStore=null]
   [junit4]   2> 1598346 INFO  (jetty-launcher-20338-thread-2) [     ] o.a.s.c.ZkContainer Zookeeper client=127.0.0.1:40377/solr
   [junit4]   2> 1598346 INFO  (jetty-launcher-20338-thread-2) [     ] o.a.s.c.c.ConnectionManager Waiting for client to connect to ZooKeeper
   [junit4]   2> 1598347 INFO  (zkConnectionManagerCallback-20378-thread-1) [     ] o.a.s.c.c.ConnectionManager zkClient has connected
   [junit4]   2> 1598347 INFO  (jetty-launcher-20338-thread-2) [     ] o.a.s.c.c.ConnectionManager Client is connected to ZooKeeper
   [junit4]   2> 1598348 WARN  (jetty-launcher-20338-thread-2-SendThread(127.0.0.1:40377)) [     ] o.a.z.ClientCnxn An exception was thrown while closing send thread for session 0x102bf3f64af0007.
   [junit4]   2>           => EndOfStreamException: Unable to read additional data from server sessionid 0x102bf3f64af0007, likely server has closed socket
   [junit4]   2> 	at org.apache.zookeeper.ClientCnxnSocketNIO.doIO(ClientCnxnSocketNIO.java:77)
   [junit4]   2> org.apache.zookeeper.ClientCnxn$EndOfStreamException: Unable to read additional data from server sessionid 0x102bf3f64af0007, likely server has closed socket
   [junit4]   2> 	at org.apache.zookeeper.ClientCnxnSocketNIO.doIO(ClientCnxnSocketNIO.java:77) ~[zookeeper-3.6.2.jar:3.6.2]
   [junit4]   2> 	at org.apache.zookeeper.ClientCnxnSocketNIO.doTransport(ClientCnxnSocketNIO.java:350) ~[zookeeper-3.6.2.jar:3.6.2]
   [junit4]   2> 	at org.apache.zookeeper.ClientCnxn$SendThread.run(ClientCnxn.java:1275) [zookeeper-3.6.2.jar:3.6.2]
   [junit4]   2> 1598449 INFO  (jetty-launcher-20338-thread-2) [n:127.0.0.1:40263_solr     ] o.a.s.c.c.ConnectionManager Waiting for client to connect to ZooKeeper
   [junit4]   2> 1598450 INFO  (zkConnectionManagerCallback-20380-thread-1) [     ] o.a.s.c.c.ConnectionManager zkClient has connected
   [junit4]   2> 1598450 INFO  (jetty-launcher-20338-thread-2) [n:127.0.0.1:40263_solr     ] o.a.s.c.c.ConnectionManager Client is connected to ZooKeeper
   [junit4]   2> 1598454 INFO  (jetty-launcher-20338-thread-2) [n:127.0.0.1:40263_solr     ] o.a.s.c.c.ZkStateReader Updated live nodes from ZooKeeper... (0) -> (1)
   [junit4]   2> 1598460 INFO  (jetty-launcher-20338-thread-2) [n:127.0.0.1:40263_solr     ] o.a.s.c.ZkController Publish node=127.0.0.1:40263_solr as DOWN
   [junit4]   2> 1598461 INFO  (jetty-launcher-20338-thread-2) [n:127.0.0.1:40263_solr     ] o.a.s.c.TransientSolrCoreCacheDefault Allocating transient cache for 2147483647 transient cores
   [junit4]   2> 1598461 INFO  (jetty-launcher-20338-thread-2) [n:127.0.0.1:40263_solr     ] o.a.s.c.ZkController Register node as live in ZooKeeper:/live_nodes/127.0.0.1:40263_solr
   [junit4]   2> 1598462 DEBUG (OverseerStateUpdate-72830822984384518-127.0.0.1:41305_solr-n_0000000000) [n:127.0.0.1:41305_solr     ] o.a.s.c.o.NodeMutator DownNode state invoked for node: 127.0.0.1:40263_solr
   [junit4]   2> 1598462 INFO  (zkCallback-20357-thread-1) [     ] o.a.s.c.c.ZkStateReader Updated live nodes from ZooKeeper... (1) -> (2)
   [junit4]   2> 1598463 INFO  (zkCallback-20379-thread-1) [     ] o.a.s.c.c.ZkStateReader Updated live nodes from ZooKeeper... (1) -> (2)
   [junit4]   2> 1598464 INFO  (jetty-launcher-20338-thread-2) [n:127.0.0.1:40263_solr     ] o.a.s.p.PackageLoader /packages.json updated to version -1
   [junit4]   2> 1598464 WARN  (jetty-launcher-20338-thread-2) [n:127.0.0.1:40263_solr     ] o.a.s.c.CoreContainer Not all security plugins configured!  authentication=disabled authorization=disabled.  Solr is only as secure as you make it. Consider configuring authentication/authorization before exposing Solr to users internal or external.  See https://s.apache.org/solrsecurity for more info
   [junit4]   2> 1598475 INFO  (jetty-launcher-20338-thread-2) [n:127.0.0.1:40263_solr     ] o.a.s.h.a.MetricsHistoryHandler No .system collection, keeping metrics history in memory.
   [junit4]   2> 1598494 INFO  (jetty-launcher-20338-thread-2) [n:127.0.0.1:40263_solr     ] o.a.s.m.r.SolrJmxReporter JMX monitoring for 'solr_40263.solr.node' (registry 'solr.node') enabled at server: com.sun.jmx.mbeanserver.JmxMBeanServer@26a139b5
   [junit4]   2> 1598502 INFO  (jetty-launcher-20338-thread-2) [n:127.0.0.1:40263_solr     ] o.a.s.m.r.SolrJmxReporter JMX monitoring for 'solr_40263.solr.jvm' (registry 'solr.jvm') enabled at server: com.sun.jmx.mbeanserver.JmxMBeanServer@26a139b5
   [junit4]   2> 1598502 INFO  (jetty-launcher-20338-thread-2) [n:127.0.0.1:40263_solr     ] o.a.s.m.r.SolrJmxReporter JMX monitoring for 'solr_40263.solr.jetty' (registry 'solr.jetty') enabled at server: com.sun.jmx.mbeanserver.JmxMBeanServer@26a139b5
   [junit4]   2> 1598503 INFO  (jetty-launcher-20338-thread-2) [n:127.0.0.1:40263_solr     ] o.a.s.c.CorePropertiesLocator Found 0 core definitions underneath /home/jenkins/jenkins-slave/workspace/Lucene/Lucene-Solr-Tests-8.8/solr/build/solr-core/test/J1/temp/solr.cloud.TestWithCollection_36DCEFC297F441B-001/tempDir-001/node2
   [junit4]   2> 1598518 INFO  (TEST-TestWithCollection.testMoveReplicaMainCollection-seed#[36DCEFC297F441B]) [     ] o.a.s.c.MiniSolrCloudCluster waitForAllNodes: numServers=2
   [junit4]   2> 1598519 INFO  (TEST-TestWithCollection.testMoveReplicaMainCollection-seed#[36DCEFC297F441B]) [     ] o.a.s.c.c.ConnectionManager Waiting for client to connect to ZooKeeper
   [junit4]   2> 1598520 INFO  (zkConnectionManagerCallback-20393-thread-1) [     ] o.a.s.c.c.ConnectionManager zkClient has connected
   [junit4]   2> 1598520 INFO  (TEST-TestWithCollection.testMoveReplicaMainCollection-seed#[36DCEFC297F441B]) [     ] o.a.s.c.c.ConnectionManager Client is connected to ZooKeeper
   [junit4]   2> 1598521 INFO  (TEST-TestWithCollection.testMoveReplicaMainCollection-seed#[36DCEFC297F441B]) [     ] o.a.s.c.c.ZkStateReader Updated live nodes from ZooKeeper... (0) -> (2)
   [junit4]   2> 1598522 INFO  (TEST-TestWithCollection.testMoveReplicaMainCollection-seed#[36DCEFC297F441B]) [     ] o.a.s.c.s.i.ZkClientClusterStateProvider Cluster at 127.0.0.1:40377/solr ready
   [junit4]   2> 1598525 DEBUG (zkCallback-20357-thread-1) [     ] o.a.s.c.a.OverseerTriggerThread Refreshing /autoscaling.json with znode version 2
   [junit4]   2> 1598525 DEBUG (OverseerAutoScalingTriggerThread-72830822984384518-127.0.0.1:41305_solr-n_0000000000) [     ] o.a.s.c.a.OverseerTriggerThread Processed trigger updates upto znodeVersion 2
   [junit4]   2> 1598527 DEBUG (OverseerAutoScalingTriggerThread-72830822984384518-127.0.0.1:41305_solr-n_0000000000) [     ] o.a.s.c.a.OverseerTriggerThread -- deactivating old nodeLost / nodeAdded markers
   [junit4]   2> 1598530 DEBUG (OverseerAutoScalingTriggerThread-72830822984384518-127.0.0.1:41305_solr-n_0000000000) [     ] o.a.s.c.a.OverseerTriggerThread Current znodeVersion 2, lastZnodeVersion 2
   [junit4]   2> 1598553 INFO  (qtp303780785-32472) [n:127.0.0.1:40263_solr     ] o.a.s.s.HttpSolrCall [admin] webapp=null path=/admin/metrics params={prefix=CONTAINER.fs.usableSpace,CONTAINER.cores&wt=javabin&version=2&group=solr.node} status=0 QTime=0
   [junit4]   2> 1598576 INFO  (qtp194324746-32471) [n:127.0.0.1:41305_solr     ] o.a.s.c.TransientSolrCoreCacheDefault Allocating transient cache for 2147483647 transient cores
   [junit4]   2> 1598576 INFO  (qtp194324746-32471) [n:127.0.0.1:41305_solr     ] o.a.s.s.HttpSolrCall [admin] webapp=null path=/admin/metrics params={prefix=CONTAINER.fs.usableSpace,CONTAINER.cores&wt=javabin&version=2&group=solr.node} status=0 QTime=0
   [junit4]   2> 1598577 DEBUG (qtp303780785-32475) [n:127.0.0.1:40263_solr     ] o.a.s.c.a.AutoScalingHandler Verified autoscaling configuration
   [junit4]   2> 1598577 INFO  (qtp303780785-32475) [n:127.0.0.1:40263_solr     ] o.a.s.s.HttpSolrCall [admin] webapp=null path=/cluster/autoscaling params={wt=javabin&version=2} status=0 QTime=28
   [junit4]   2> 1598578 INFO  (TEST-TestWithCollection.testMoveReplicaMainCollection-seed#[36DCEFC297F441B]) [     ] o.a.s.c.TestWithCollection Chosen node 127.0.0.1:41305_solr for collection testMoveReplicaMainCollection_abc
   [junit4]   2> 1598578 DEBUG (zkCallback-20357-thread-1) [     ] o.a.s.c.a.OverseerTriggerThread Refreshing /autoscaling.json with znode version 3
   [junit4]   2> 1598578 DEBUG (OverseerAutoScalingTriggerThread-72830822984384518-127.0.0.1:41305_solr-n_0000000000) [     ] o.a.s.c.a.OverseerTriggerThread Processed trigger updates upto znodeVersion 3
   [junit4]   2> 1598578 DEBUG (OverseerAutoScalingTriggerThread-72830822984384518-127.0.0.1:41305_solr-n_0000000000) [     ] o.a.s.c.a.OverseerTriggerThread -- deactivating old nodeLost / nodeAdded markers
   [junit4]   2> 1598578 DEBUG (OverseerAutoScalingTriggerThread-72830822984384518-127.0.0.1:41305_solr-n_0000000000) [     ] o.a.s.c.a.OverseerTriggerThread Current znodeVersion 3, lastZnodeVersion 3
   [junit4]   2> 1598581 INFO  (OverseerThreadFactory-20365-thread-1-processing-n:127.0.0.1:41305_solr) [n:127.0.0.1:41305_solr     ] o.a.s.c.a.c.CreateCollectionCmd Create collection testMoveReplicaMainCollection_abc
   [junit4]   2> 1598581 INFO  (OverseerThreadFactory-20365-thread-1-processing-n:127.0.0.1:41305_solr) [n:127.0.0.1:41305_solr     ] o.a.s.c.c.ZkConfigManager Copying zk node /configs/_default to /configs/testMoveReplicaMainCollection_abc.AUTOCREATED
   [junit4]   2> 1598583 INFO  (OverseerThreadFactory-20365-thread-1-processing-n:127.0.0.1:41305_solr) [n:127.0.0.1:41305_solr     ] o.a.s.c.c.ZkConfigManager Copying zk node /configs/_default/protwords.txt to /configs/testMoveReplicaMainCollection_abc.AUTOCREATED/protwords.txt
   [junit4]   2> 1598584 INFO  (OverseerThreadFactory-20365-thread-1-processing-n:127.0.0.1:41305_solr) [n:127.0.0.1:41305_solr     ] o.a.s.c.c.ZkConfigManager Copying zk node /configs/_default/managed-schema to /configs/testMoveReplicaMainCollection_abc.AUTOCREATED/managed-schema
   [junit4]   2> 1598586 INFO  (OverseerThreadFactory-20365-thread-1-processing-n:127.0.0.1:41305_solr) [n:127.0.0.1:41305_solr     ] o.a.s.c.c.ZkConfigManager Copying zk node /configs/_default/solrconfig.xml to /configs/testMoveReplicaMainCollection_abc.AUTOCREATED/solrconfig.xml
   [junit4]   2> 1598588 INFO  (OverseerThreadFactory-20365-thread-1-processing-n:127.0.0.1:41305_solr) [n:127.0.0.1:41305_solr     ] o.a.s.c.c.ZkConfigManager Copying zk node /configs/_default/lang/contractions_it.txt to /configs/testMoveReplicaMainCollection_abc.AUTOCREATED/lang/contractions_it.txt
   [junit4]   2> 1598590 INFO  (OverseerThreadFactory-20365-thread-1-processing-n:127.0.0.1:41305_solr) [n:127.0.0.1:41305_solr     ] o.a.s.c.c.ZkConfigManager Copying zk node /configs/_default/lang/stopwords_no.txt to /configs/testMoveReplicaMainCollection_abc.AUTOCREATED/lang/stopwords_no.txt
   [junit4]   2> 1598592 INFO  (OverseerThreadFactory-20365-thread-1-processing-n:127.0.0.1:41305_solr) [n:127.0.0.1:41305_solr     ] o.a.s.c.c.ZkConfigManager Copying zk node /configs/_default/lang/contractions_ca.txt to /configs/testMoveReplicaMainCollection_abc.AUTOCREATED/lang/contractions_ca.txt
   [junit4]   2> 1598593 INFO  (OverseerThreadFactory-20365-thread-1-processing-n:127.0.0.1:41305_solr) [n:127.0.0.1:41305_solr     ] o.a.s.c.c.ZkConfigManager Copying zk node /configs/_default/lang/stemdict_nl.txt to /configs/testMoveReplicaMainCollection_abc.AUTOCREATED/lang/stemdict_nl.txt
   [junit4]   2> 1598595 INFO  (OverseerThreadFactory-20365-thread-1-processing-n:127.0.0.1:41305_solr) [n:127.0.0.1:41305_solr     ] o.a.s.c.c.ZkConfigManager Copying zk node /configs/_default/lang/stopwords_hy.txt to /configs/testMoveReplicaMainCollection_abc.AUTOCREATED/lang/stopwords_hy.txt
   [junit4]   2> 1598597 INFO  (OverseerThreadFactory-20365-thread-1-processing-n:127.0.0.1:41305_solr) [n:127.0.0.1:41305_solr     ] o.a.s.c.c.ZkConfigManager Copying zk node /configs/_default/lang/stopwords_id.txt to /configs/testMoveReplicaMainCollection_abc.AUTOCREATED/lang/stopwords_id.txt
   [junit4]   2> 1598599 INFO  (OverseerThreadFactory-20365-thread-1-processing-n:127.0.0.1:41305_solr) [n:127.0.0.1:41305_solr     ] o.a.s.c.c.ZkConfigManager Copying zk node /configs/_default/lang/stopwords_et.txt to /configs/testMoveReplicaMainCollection_abc.AUTOCREATED/lang/stopwords_et.txt
   [junit4]   2> 1598601 INFO  (OverseerThreadFactory-20365-thread-1-processing-n:127.0.0.1:41305_solr) [n:127.0.0.1:41305_solr     ] o.a.s.c.c.ZkConfigManager Copying zk node /configs/_default/lang/stopwords_ga.txt to /configs/testMoveReplicaMainCollection_abc.AUTOCREATED/lang/stopwords_ga.txt
   [junit4]   2> 1598602 INFO  (OverseerThreadFactory-20365-thread-1-processing-n:127.0.0.1:41305_solr) [n:127.0.0.1:41305_solr     ] o.a.s.c.c.ZkConfigManager Copying zk node /configs/_default/lang/stopwords_da.txt to /configs/testMoveReplicaMainCollection_abc.AUTOCREATED/lang/stopwords_da.txt
   [junit4]   2> 1598605 INFO  (OverseerThreadFactory-20365-thread-1-processing-n:127.0.0.1:41305_solr) [n:127.0.0.1:41305_solr     ] o.a.s.c.c.ZkConfigManager Copying zk node /configs/_default/lang/stopwords_hi.txt to /configs/testMoveReplicaMainCollection_abc.AUTOCREATED/lang/stopwords_hi.txt
   [junit4]   2> 1598609 INFO  (OverseerThreadFactory-20365-thread-1-processing-n:127.0.0.1:41305_solr) [n:127.0.0.1:41305_solr     ] o.a.s.c.c.ZkConfigManager Copying zk node /configs/_default/lang/stopwords_ja.txt to /configs/testMoveReplicaMainCollection_abc.AUTOCREATED/lang/stopwords_ja.txt
   [junit4]   2> 1598614 INFO  (OverseerThreadFactory-20365-thread-1-processing-n:127.0.0.1:41305_solr) [n:127.0.0.1:41305_solr     ] o.a.s.c.c.ZkConfigManager Copying zk node /configs/_default/lang/stopwords_pt.txt to /configs/testMoveReplicaMainCollection_abc.AUTOCREATED/lang/stopwords_pt.txt
   [junit4]   2> 1598616 INFO  (OverseerThreadFactory-20365-thread-1-processing-n:127.0.0.1:41305_solr) [n:127.0.0.1:41305_solr     ] o.a.s.c.c.ZkConfigManager Copying zk node /configs/_default/lang/stopwords_hu.txt to /configs/testMoveReplicaMainCollection_abc.AUTOCREATED/lang/stopwords_hu.txt
   [junit4]   2> 1598617 INFO  (OverseerThreadFactory-20365-thread-1-processing-n:127.0.0.1:41305_solr) [n:127.0.0.1:41305_solr     ] o.a.s.c.c.ZkConfigManager Copying zk node /configs/_default/lang/stopwords_el.txt to /configs/testMoveReplicaMainCollection_abc.AUTOCREATED/lang/stopwords_el.txt
   [junit4]   2> 1598619 INFO  (OverseerThreadFactory-20365-thread-1-processing-n:127.0.0.1:41305_solr) [n:127.0.0.1:41305_solr     ] o.a.s.c.c.ZkConfigManager Copying zk node /configs/_default/lang/stopwords_ru.txt to /configs/testMoveReplicaMainCollection_abc.AUTOCREATED/lang/stopwords_ru.txt
   [junit4]   2> 1598620 INFO  (OverseerThreadFactory-20365-thread-1-processing-n:127.0.0.1:41305_solr) [n:127.0.0.1:41305_solr     ] o.a.s.c.c.ZkConfigManager Copying zk node /configs/_default/lang/stopwords_tr.txt to /configs/testMoveReplicaMainCollection_abc.AUTOCREATED/lang/stopwords_tr.txt
   [junit4]   2> 1598621 INFO  (OverseerThreadFactory-20365-thread-1-processing-n:127.0.0.1:41305_solr) [n:127.0.0.1:41305_solr     ] o.a.s.c.c.ZkConfigManager Copying zk node /configs/_default/lang/stopwords_ar.txt to /configs/testMoveReplicaMainCollection_abc.AUTOCREATED/lang/stopwords_ar.txt
   [junit4]   2> 1598623 INFO  (OverseerThreadFactory-20365-thread-1-processing-n:127.0.0.1:41305_solr) [n:127.0.0.1:41305_solr     ] o.a.s.c.c.ZkConfigManager Copying zk node /configs/_default/lang/userdict_ja.txt to /configs/testMoveReplicaMainCollection_abc.AUTOCREATED/lang/userdict_ja.txt
   [junit4]   2> 1598624 INFO  (OverseerThreadFactory-20365-thread-1-processing-n:127.0.0.1:41305_solr) [n:127.0.0.1:41305_solr     ] o.a.s.c.c.ZkConfigManager Copying zk node /configs/_default/lang/stopwords_it.txt to /configs/testMoveReplicaMainCollection_abc.AUTOCREATED/lang/stopwords_it.txt
   [junit4]   2> 1598625 INFO  (OverseerThreadFactory-20365-thread-1-processing-n:127.0.0.1:41305_solr) [n:127.0.0.1:41305_solr     ] o.a.s.c.c.ZkConfigManager Copying zk node /configs/_default/lang/stopwords_eu.txt to /configs/testMoveReplicaMainCollection_abc.AUTOCREATED/lang/stopwords_eu.txt
   [junit4]   2> 1598627 INFO  (OverseerThreadFactory-20365-thread-1-processing-n:127.0.0.1:41305_solr) [n:127.0.0.1:41305_solr     ] o.a.s.c.c.ZkConfigManager Copying zk node /configs/_default/lang/stopwords_cz.txt to /configs/testMoveReplicaMainCollection_abc.AUTOCREATED/lang/stopwords_cz.txt
   [junit4]   2> 1598630 INFO  (OverseerThreadFactory-20365-thread-1-processing-n:127.0.0.1:41305_solr) [n:127.0.0.1:41305_solr     ] o.a.s.c.c.ZkConfigManager Copying zk node /configs/_default/lang/stoptags_ja.txt to /configs/testMoveReplicaMainCollection_abc.AUTOCREATED/lang/stoptags_ja.txt
   [junit4]   2> 1598632 INFO  (OverseerThreadFactory-20365-thread-1-processing-n:127.0.0.1:41305_solr) [n:127.0.0.1:41305_solr     ] o.a.s.c.c.ZkConfigManager Copying zk node /configs/_default/lang/contractions_fr.txt to /configs/testMoveReplicaMainCollection_abc.AUTOCREATED/lang/contractions_fr.txt
   [junit4]   2> 1598634 INFO  (OverseerThreadFactory-20365-thread-1-processing-n:127.0.0.1:41305_solr) [n:127.0.0.1:41305_solr     ] o.a.s.c.c.ZkConfigManager Copying zk node /configs/_default/lang/stopwords_de.txt to /configs/testMoveReplicaMainCollection_abc.AUTOCREATED/lang/stopwords_de.txt
   [junit4]   2> 1598635 INFO  (OverseerThreadFactory-20365-thread-1-processing-n:127.0.0.1:41305_solr) [n:127.0.0.1:41305_solr     ] o.a.s.c.c.ZkConfigManager Copying zk node /configs/_default/lang/stopwords_fa.txt to /configs/testMoveReplicaMainCollection_abc.AUTOCREATED/lang/stopwords_fa.txt
   [junit4]   2> 1598636 INFO  (OverseerThreadFactory-20365-thread-1-processing-n:127.0.0.1:41305_solr) [n:127.0.0.1:41305_solr     ] o.a.s.c.c.ZkConfigManager Copying zk node /configs/_default/lang/contractions_ga.txt to /configs/testMoveReplicaMainCollection_abc.AUTOCREATED/lang/contractions_ga.txt
   [junit4]   2> 1598638 INFO  (OverseerThreadFactory-20365-thread-1-processing-n:127.0.0.1:41305_solr) [n:127.0.0.1:41305_solr     ] o.a.s.c.c.ZkConfigManager Copying zk node /configs/_default/lang/stopwords_ca.txt to /configs/testMoveReplicaMainCollection_abc.AUTOCREATED/lang/stopwords_ca.txt
   [junit4]   2> 1598639 INFO  (OverseerThreadFactory-20365-thread-1-processing-n:127.0.0.1:41305_solr) [n:127.0.0.1:41305_solr     ] o.a.s.c.c.ZkConfigManager Copying zk node /configs/_default/lang/stopwords_nl.txt to /configs/testMoveReplicaMainCollection_abc.AUTOCREATED/lang/stopwords_nl.txt
   [junit4]   2> 1598640 INFO  (OverseerThreadFactory-20365-thread-1-processing-n:127.0.0.1:41305_solr) [n:127.0.0.1:41305_solr     ] o.a.s.c.c.ZkConfigManager Copying zk node /configs/_default/lang/stopwords_bg.txt to /configs/testMoveReplicaMainCollection_abc.AUTOCREATED/lang/stopwords_bg.txt
   [junit4]   2> 1598642 INFO  (OverseerThreadFactory-20365-thread-1-processing-n:127.0.0.1:41305_solr) [n:127.0.0.1:41305_solr     ] o.a.s.c.c.ZkConfigManager Copying zk node /configs/_default/lang/stopwords_en.txt to /configs/testMoveReplicaMainCollection_abc.AUTOCREATED/lang/stopwords_en.txt
   [junit4]   2> 1598644 INFO  (OverseerThreadFactory-20365-thread-1-processing-n:127.0.0.1:41305_solr) [n:127.0.0.1:41305_solr     ] o.a.s.c.c.ZkConfigManager Copying zk node /configs/_default/lang/stopwords_lv.txt to /configs/testMoveReplicaMainCollection_abc.AUTOCREATED/lang/stopwords_lv.txt
   [junit4]   2> 1598645 INFO  (OverseerThreadFactory-20365-thread-1-processing-n:127.0.0.1:41305_solr) [n:127.0.0.1:41305_solr     ] o.a.s.c.c.ZkConfigManager Copying zk node /configs/_default/lang/stopwords_es.txt to /configs/testMoveReplicaMainCollection_abc.AUTOCREATED/lang/stopwords_es.txt
   [junit4]   2> 1598647 INFO  (OverseerThreadFactory-20365-thread-1-processing-n:127.0.0.1:41305_solr) [n:127.0.0.1:41305_solr     ] o.a.s.c.c.ZkConfigManager Copying zk node /configs/_default/lang/stopwords_th.txt to /configs/testMoveReplicaMainCollection_abc.AUTOCREATED/lang/stopwords_th.txt
   [junit4]   2> 1598648 INFO  (OverseerThreadFactory-20365-thread-1-processing-n:127.0.0.1:41305_solr) [n:127.0.0.1:41305_solr     ] o.a.s.c.c.ZkConfigManager Copying zk node /configs/_default/lang/stopwords_ro.txt to /configs/testMoveReplicaMainCollection_abc.AUTOCREATED/lang/stopwords_ro.txt
   [junit4]   2> 1598654 INFO  (OverseerThreadFactory-20365-thread-1-processing-n:127.0.0.1:41305_solr) [n:127.0.0.1:41305_solr     ] o.a.s.c.c.ZkConfigManager Copying zk node /configs/_default/lang/stopwords_fr.txt to /configs/testMoveReplicaMainCollection_abc.AUTOCREATED/lang/stopwords_fr.txt
   [junit4]   2> 1598655 INFO  (OverseerThreadFactory-20365-thread-1-processing-n:127.0.0.1:41305_solr) [n:127.0.0.1:41305_solr     ] o.a.s.c.c.ZkConfigManager Copying zk node /configs/_default/lang/stopwords_sv.txt to /configs/testMoveReplicaMainCollection_abc.AUTOCREATED/lang/stopwords_sv.txt
   [junit4]   2> 1598656 INFO  (OverseerThreadFactory-20365-thread-1-processing-n:127.0.0.1:41305_solr) [n:127.0.0.1:41305_solr     ] o.a.s.c.c.ZkConfigManager Copying zk node /configs/_default/lang/stopwords_fi.txt to /configs/testMoveReplicaMainCollection_abc.AUTOCREATED/lang/stopwords_fi.txt
   [junit4]   2> 1598657 INFO  (OverseerThreadFactory-20365-thread-1-processing-n:127.0.0.1:41305_solr) [n:127.0.0.1:41305_solr     ] o.a.s.c.c.ZkConfigManager Copying zk node /configs/_default/lang/hyphenations_ga.txt to /configs/testMoveReplicaMainCollection_abc.AUTOCREATED/lang/hyphenations_ga.txt
   [junit4]   2> 1598659 INFO  (OverseerThreadFactory-20365-thread-1-processing-n:127.0.0.1:41305_solr) [n:127.0.0.1:41305_solr     ] o.a.s.c.c.ZkConfigManager Copying zk node /configs/_default/lang/stopwords_gl.txt to /configs/testMoveReplicaMainCollection_abc.AUTOCREATED/lang/stopwords_gl.txt
   [junit4]   2> 1598660 INFO  (OverseerThreadFactory-20365-thread-1-processing-n:127.0.0.1:41305_solr) [n:127.0.0.1:41305_solr     ] o.a.s.c.c.ZkConfigManager Copying zk node /configs/_default/synonyms.txt to /configs/testMoveReplicaMainCollection_abc.AUTOCREATED/synonyms.txt
   [junit4]   2> 1598661 INFO  (OverseerThreadFactory-20365-thread-1-processing-n:127.0.0.1:41305_solr) [n:127.0.0.1:41305_solr     ] o.a.s.c.c.ZkConfigManager Copying zk node /configs/_default/stopwords.txt to /configs/testMoveReplicaMainCollection_abc.AUTOCREATED/stopwords.txt
   [junit4]   2> 1598665 DEBUG (OverseerStateUpdate-72830822984384518-127.0.0.1:41305_solr-n_0000000000) [n:127.0.0.1:41305_solr     ] o.a.s.c.o.ClusterStateMutator building a new cName: testMoveReplicaMainCollection_abc
   [junit4]   2> 1598665 DEBUG (OverseerStateUpdate-72830822984384518-127.0.0.1:41305_solr-n_0000000000) [n:127.0.0.1:41305_solr     ] o.a.s.c.o.ZkStateWriter going to create_collection /collections/testMoveReplicaMainCollection_abc/state.json
   [junit4]   2> 1598766 DEBUG (OverseerThreadFactory-20365-thread-1-processing-n:127.0.0.1:41305_solr) [n:127.0.0.1:41305_solr     ] o.a.s.c.s.c.a.PolicyHelper Creating a new session
   [junit4]   2> 1598769 INFO  (qtp303780785-32468) [n:127.0.0.1:40263_solr     ] o.a.s.s.HttpSolrCall [admin] webapp=null path=/admin/metrics params={prefix=CONTAINER.fs.usableSpace,CONTAINER.fs.totalSpace,CONTAINER.cores&wt=javabin&version=2&group=solr.node} status=0 QTime=0
   [junit4]   2> 1598776 INFO  (qtp194324746-32469) [n:127.0.0.1:41305_solr     ] o.a.s.s.HttpSolrCall [admin] webapp=null path=/admin/metrics params={prefix=CONTAINER.fs.usableSpace,CONTAINER.fs.totalSpace,CONTAINER.cores&wt=javabin&version=2&group=solr.node} status=0 QTime=0
   [junit4]   2> 1598776 DEBUG (OverseerThreadFactory-20365-thread-1-processing-n:127.0.0.1:41305_solr) [n:127.0.0.1:41305_solr     ] o.a.s.c.s.c.a.PolicyHelper New session created, 11798538855128806
   [junit4]   2> 1598778 DEBUG (OverseerThreadFactory-20365-thread-1-processing-n:127.0.0.1:41305_solr) [n:127.0.0.1:41305_solr     ] o.a.s.c.s.c.a.PolicyHelper returnSession 11798538855128806
   [junit4]   2> 1598788 INFO  (OverseerStateUpdate-72830822984384518-127.0.0.1:41305_solr-n_0000000000) [n:127.0.0.1:41305_solr     ] o.a.s.c.o.SliceMutator createReplica() {
   [junit4]   2>   "operation":"ADDREPLICA",
   [junit4]   2>   "collection":"testMoveReplicaMainCollection_abc",
   [junit4]   2>   "shard":"shard1",
   [junit4]   2>   "core":"testMoveReplicaMainCollection_abc_shard1_replica_n1",
   [junit4]   2>   "state":"down",
   [junit4]   2>   "node_name":"127.0.0.1:41305_solr",
   [junit4]   2>   "type":"NRT",
   [junit4]   2>   "waitForFinalState":"false"} 
   [junit4]   2> 1598789 DEBUG (OverseerStateUpdate-72830822984384518-127.0.0.1:41305_solr-n_0000000000) [n:127.0.0.1:41305_solr     ] o.a.s.c.o.SliceMutator Old Slice: shard1:{
   [junit4]   2>   "range":"80000000-7fffffff",
   [junit4]   2>   "state":"active",
   [junit4]   2>   "replicas":{}}
   [junit4]   2> 1598789 DEBUG (OverseerStateUpdate-72830822984384518-127.0.0.1:41305_solr-n_0000000000) [n:127.0.0.1:41305_solr     ] o.a.s.c.o.SliceMutator New Slice: shard1:{
   [junit4]   2>   "range":"80000000-7fffffff",
   [junit4]   2>   "state":"active",
   [junit4]   2>   "replicas":{"core_node2":{
   [junit4]   2>       "core":"testMoveReplicaMainCollection_abc_shard1_replica_n1",
   [junit4]   2>       "node_name":"127.0.0.1:41305_solr",
   [junit4]   2>       "state":"down",
   [junit4]   2>       "type":"NRT"}}}
   [junit4]   2> 1598890 DEBUG (OverseerStateUpdate-72830822984384518-127.0.0.1:41305_solr-n_0000000000) [n:127.0.0.1:41305_solr     ] o.a.s.c.o.ZkStateWriter going to update_collection /collections/testMoveReplicaMainCollection_abc/state.json version: 0
   [junit4]   2> 1598991 INFO  (qtp194324746-32470) [n:127.0.0.1:41305_solr    x:testMoveReplicaMainCollection_abc_shard1_replica_n1 ] o.a.s.h.a.CoreAdminOperation core create command qt=/admin/cores&coreNodeName=core_node2&collection.configName=testMoveReplicaMainCollection_abc.AUTOCREATED&newCollection=true&name=testMoveReplicaMainCollection_abc_shard1_replica_n1&action=CREATE&numShards=1&collection=testMoveReplicaMainCollection_abc&shard=shard1&wt=javabin&version=2&replicaType=NRT
   [junit4]   2> 1598993 INFO  (qtp194324746-32470) [n:127.0.0.1:41305_solr c:testMoveReplicaMainCollection_abc s:shard1 r:core_node2 x:testMoveReplicaMainCollection_abc_shard1_replica_n1 ] o.a.s.c.c.ZkStateReader already watching , added to stateWatchers
   [junit4]   2> 1598996 DEBUG (OverseerStateUpdate-72830822984384518-127.0.0.1:41305_solr-n_0000000000) [n:127.0.0.1:41305_solr     ] o.a.s.c.o.ReplicaMutator Update state numShards=1 message={
   [junit4]   2>   "core":"testMoveReplicaMainCollection_abc_shard1_replica_n1",
   [junit4]   2>   "core_node_name":"core_node2",
   [junit4]   2>   "roles":null,
   [junit4]   2>   "node_name":"127.0.0.1:41305_solr",
   [junit4]   2>   "numShards":"1",
   [junit4]   2>   "state":"down",
   [junit4]   2>   "shard":"shard1",
   [junit4]   2>   "collection":"testMoveReplicaMainCollection_abc",
   [junit4]   2>   "type":"NRT",
   [junit4]   2>   "force_set_state":"false",
   [junit4]   2>   "operation":"state"}
   [junit4]   2> 1598996 DEBUG (OverseerStateUpdate-72830822984384518-127.0.0.1:41305_solr-n_0000000000) [n:127.0.0.1:41305_solr     ] o.a.s.c.o.ReplicaMutator Will update state for replica: core_node2:{
   [junit4]   2>   "core":"testMoveReplicaMainCollection_abc_shard1_replica_n1",
   [junit4]   2>   "node_name":"127.0.0.1:41305_solr",
   [junit4]   2>   "state":"down",
   [junit4]   2>   "type":"NRT",
   [junit4]   2>   "force_set_state":"false",
   [junit4]   2>   "base_url":"https://127.0.0.1:41305/solr"}
   [junit4]   2> 1598996 DEBUG (OverseerStateUpdate-72830822984384518-127.0.0.1:41305_solr-n_0000000000) [n:127.0.0.1:41305_solr     ] o.a.s.c.o.ReplicaMutator Collection is now: DocCollection(testMoveReplicaMainCollection_abc//collections/testMoveReplicaMainCollection_abc/state.json/1 )={
   [junit4]   2>   "pullReplicas":"0",
   [junit4]   2>   "replicationFactor":"1",
   [junit4]   2>   "router":{"name":"compositeId"},
   [junit4]   2>   "maxShardsPerNode":"1",
   [junit4]   2>   "autoAddReplicas":"false",
   [junit4]   2>   "nrtReplicas":"1",
   [junit4]   2>   "tlogReplicas":"0",
   [junit4]   2>   "shards":{"shard1":{
   [junit4]   2>       "range":"80000000-7fffffff",
   [junit4]   2>       "state":"active",
   [junit4]   2>       "replicas":{"core_node2":{
   [junit4]   2>           "core":"testMoveReplicaMainCollection_abc_shard1_replica_n1",
   [junit4]   2>           "node_name":"127.0.0.1:41305_solr",
   [junit4]   2>           "state":"down",
   [junit4]   2>           "type":"NRT",
   [junit4]   2>           "force_set_state":"false"}}}}}
   [junit4]   2> 1599004 INFO  (qtp194324746-32470) [n:127.0.0.1:41305_solr c:testMoveReplicaMainCollection_abc s:shard1 r:core_node2 x:testMoveReplicaMainCollection_abc_shard1_replica_n1 ] o.a.s.c.SolrConfig Using Lucene MatchVersion: 8.8.0
   [junit4]   2> 1599024 INFO  (qtp194324746-32470) [n:127.0.0.1:41305_solr c:testMoveReplicaMainCollection_abc s:shard1 r:core_node2 x:testMoveReplicaMainCollection_abc_shard1_replica_n1 ] o.a.s.s.IndexSchema Schema name=default-config
   [junit4]   2> 1599068 INFO  (qtp194324746-32470) [n:127.0.0.1:41305_solr c:testMoveReplicaMainCollection_abc s:shard1 r:core_node2 x:testMoveReplicaMainCollection_abc_shard1_replica_n1 ] o.a.s.s.IndexSchema Loaded schema default-config/1.6 with uniqueid field id
   [junit4]   2> 1599097 DEBUG (OverseerStateUpdate-72830822984384518-127.0.0.1:41305_solr-n_0000000000) [n:127.0.0.1:41305_solr     ] o.a.s.c.o.ZkStateWriter going to update_collection /collections/testMoveReplicaMainCollection_abc/state.json version: 1
   [junit4]   2> 1599100 INFO  (qtp194324746-32470) [n:127.0.0.1:41305_solr c:testMoveReplicaMainCollection_abc s:shard1 r:core_node2 x:testMoveReplicaMainCollection_abc_shard1_replica_n1 ] o.a.s.c.CoreContainer Creating SolrCore 'testMoveReplicaMainCollection_abc_shard1_replica_n1' using configuration from configset testMoveReplicaMainCollection_abc.AUTOCREATED, trusted=true
   [junit4]   2> 1599100 INFO  (qtp194324746-32470) [n:127.0.0.1:41305_solr c:testMoveReplicaMainCollection_abc s:shard1 r:core_node2 x:testMoveReplicaMainCollection_abc_shard1_replica_n1 ] o.a.s.m.r.SolrJmxReporter JMX monitoring for 'solr_41305.solr.core.testMoveReplicaMainCollection_abc.shard1.replica_n1' (registry 'solr.core.testMoveReplicaMainCollection_abc.shard1.replica_n1') enabled at server: com.sun.jmx.mbeanserver.JmxMBeanServer@26a139b5
   [junit4]   2> 1599101 INFO  (qtp194324746-32470) [n:127.0.0.1:41305_solr c:testMoveReplicaMainCollection_abc s:shard1 r:core_node2 x:testMoveReplicaMainCollection_abc_shard1_replica_n1 ] o.a.s.c.SolrCore [[testMoveReplicaMainCollection_abc_shard1_replica_n1] ] Opening new SolrCore at [/home/jenkins/jenkins-slave/workspace/Lucene/Lucene-Solr-Tests-8.8/solr/build/solr-core/test/J1/temp/solr.cloud.TestWithCollection_36DCEFC297F441B-001/tempDir-001/node1/testMoveReplicaMainCollection_abc_shard1_replica_n1], dataDir=[/home/jenkins/jenkins-slave/workspace/Lucene/Lucene-Solr-Tests-8.8/solr/build/solr-core/test/J1/temp/solr.cloud.TestWithCollection_36DCEFC297F441B-001/tempDir-001/node1/testMoveReplicaMainCollection_abc_shard1_replica_n1/data/]
   [junit4]   2> 1599177 INFO  (qtp194324746-32470) [n:127.0.0.1:41305_solr c:testMoveReplicaMainCollection_abc s:shard1 r:core_node2 x:testMoveReplicaMainCollection_abc_shard1_replica_n1 ] o.a.s.u.UpdateHandler Using UpdateLog implementation: org.apache.solr.update.UpdateLog
   [junit4]   2> 1599177 INFO  (qtp194324746-32470) [n:127.0.0.1:41305_solr c:testMoveReplicaMainCollection_abc s:shard1 r:core_node2 x:testMoveReplicaMainCollection_abc_shard1_replica_n1 ] o.a.s.u.UpdateLog Initializing UpdateLog: dataDir= defaultSyncLevel=FLUSH numRecordsToKeep=100 maxNumLogsToKeep=10 numVersionBuckets=65536
   [junit4]   2> 1599178 INFO  (qtp194324746-32470) [n:127.0.0.1:41305_solr c:testMoveReplicaMainCollection_abc s:shard1 r:core_node2 x:testMoveReplicaMainCollection_abc_shard1_replica_n1 ] o.a.s.u.CommitTracker Hard AutoCommit: if uncommitted for 15000ms; 
   [junit4]   2> 1599178 INFO  (qtp194324746-32470) [n:127.0.0.1:41305_solr c:testMoveReplicaMainCollection_abc s:shard1 r:core_node2 x:testMoveReplicaMainCollection_abc_shard1_replica_n1 ] o.a.s.u.CommitTracker Soft AutoCommit: disabled
   [junit4]   2> 1599181 INFO  (qtp194324746-32470) [n:127.0.0.1:41305_solr c:testMoveReplicaMainCollection_abc s:shard1 r:core_node2 x:testMoveReplicaMainCollection_abc_shard1_replica_n1 ] o.a.s.r.ManagedResourceStorage Configured ZooKeeperStorageIO with znodeBase: /configs/testMoveReplicaMainCollection_abc.AUTOCREATED
   [junit4]   2> 1599181 INFO  (qtp194324746-32470) [n:127.0.0.1:41305_solr c:testMoveReplicaMainCollection_abc s:shard1 r:core_node2 x:testMoveReplicaMainCollection_abc_shard1_replica_n1 ] o.a.s.r.ManagedResourceStorage Loaded null at path _rest_managed.json using ZooKeeperStorageIO:path=/configs/testMoveReplicaMainCollection_abc.AUTOCREATED
   [junit4]   2> 1599181 INFO  (qtp194324746-32470) [n:127.0.0.1:41305_solr c:testMoveReplicaMainCollection_abc s:shard1 r:core_node2 x:testMoveReplicaMainCollection_abc_shard1_replica_n1 ] o.a.s.s.ZkIndexSchemaReader Creating ZooKeeper watch for the managed schema at /configs/testMoveReplicaMainCollection_abc.AUTOCREATED/managed-schema
   [junit4]   2> 1599182 INFO  (qtp194324746-32470) [n:127.0.0.1:41305_solr c:testMoveReplicaMainCollection_abc s:shard1 r:core_node2 x:testMoveReplicaMainCollection_abc_shard1_replica_n1 ] o.a.s.s.ZkIndexSchemaReader Current schema version 0 is already the latest
   [junit4]   2> 1599182 INFO  (qtp194324746-32470) [n:127.0.0.1:41305_solr c:testMoveReplicaMainCollection_abc s:shard1 r:core_node2 x:testMoveReplicaMainCollection_abc_shard1_replica_n1 ] o.a.s.h.c.SpellCheckComponent Initializing spell checkers
   [junit4]   2> 1599182 INFO  (qtp194324746-32470) [n:127.0.0.1:41305_solr c:testMoveReplicaMainCollection_abc s:shard1 r:core_node2 x:testMoveReplicaMainCollection_abc_shard1_replica_n1 ] o.a.s.s.DirectSolrSpellChecker init: {name=default,field=_text_,classname=solr.DirectSolrSpellChecker,distanceMeasure=internal,accuracy=0.5,maxEdits=2,minPrefix=1,maxInspections=5,minQueryLength=4,maxQueryFrequency=0.01}
   [junit4]   2> 1599184 INFO  (qtp194324746-32470) [n:127.0.0.1:41305_solr c:testMoveReplicaMainCollection_abc s:shard1 r:core_node2 x:testMoveReplicaMainCollection_abc_shard1_replica_n1 ] o.a.s.h.ReplicationHandler Commits will be reserved for 10000 ms
   [junit4]   2> 1599184 INFO  (qtp194324746-32470) [n:127.0.0.1:41305_solr c:testMoveReplicaMainCollection_abc s:shard1 r:core_node2 x:testMoveReplicaMainCollection_abc_shard1_replica_n1 ] o.a.s.u.UpdateLog Could not find max version in index or recent updates, using new clock 1688996402869305344
   [junit4]   2> 1599186 INFO  (searcherExecutor-20395-thread-1-processing-n:127.0.0.1:41305_solr x:testMoveReplicaMainCollection_abc_shard1_replica_n1 c:testMoveReplicaMainCollection_abc s:shard1 r:core_node2) [n:127.0.0.1:41305_solr c:testMoveReplicaMainCollection_abc s:shard1 r:core_node2 x:testMoveReplicaMainCollection_abc_shard1_replica_n1 ] o.a.s.c.QuerySenderListener QuerySenderListener done.
   [junit4]   2> 1599186 INFO  (qtp194324746-32470) [n:127.0.0.1:41305_solr c:testMoveReplicaMainCollection_abc s:shard1 r:core_node2 x:testMoveReplicaMainCollection_abc_shard1_replica_n1 ] o.a.s.c.c.ZkStateReader already watching , added to stateWatchers
   [junit4]   2> 1599186 INFO  (searcherExecutor-20395-thread-1-processing-n:127.0.0.1:41305_solr x:testMoveReplicaMainCollection_abc_shard1_replica_n1 c:testMoveReplicaMainCollection_abc s:shard1 r:core_node2) [n:127.0.0.1:41305_solr c:testMoveReplicaMainCollection_abc s:shard1 r:core_node2 x:testMoveReplicaMainCollection_abc_shard1_replica_n1 ] o.a.s.h.c.SpellCheckComponent Loading spell index for spellchecker: default
   [junit4]   2> 1599187 INFO  (searcherExecutor-20395-thread-1-processing-n:127.0.0.1:41305_solr x:testMoveReplicaMainCollection_abc_shard1_replica_n1 c:testMoveReplicaMainCollection_abc s:shard1 r:core_node2) [n:127.0.0.1:41305_solr c:testMoveReplicaMainCollection_abc s:shard1 r:core_node2 x:testMoveReplicaMainCollection_abc_shard1_replica_n1 ] o.a.s.c.SolrCore [testMoveReplicaMainCollection_abc_shard1_replica_n1]  Registered new searcher autowarm time: 0 ms
   [junit4]   2> 1599190 INFO  (qtp194324746-32470) [n:127.0.0.1:41305_solr c:testMoveReplicaMainCollection_abc s:shard1 r:core_node2 x:testMoveReplicaMainCollection_abc_shard1_replica_n1 ] o.a.s.c.ZkShardTerms Successful update of terms at /collections/testMoveReplicaMainCollection_abc/terms/shard1 to Terms{values={core_node2=0}, version=0}
   [junit4]   2> 1599190 INFO  (qtp194324746-32470) [n:127.0.0.1:41305_solr c:testMoveReplicaMainCollection_abc s:shard1 r:core_node2 x:testMoveReplicaMainCollection_abc_shard1_replica_n1 ] o.a.s.c.ShardLeaderElectionContextBase make sure parent is created /collections/testMoveReplicaMainCollection_abc/leaders/shard1
   [junit4]   2> 1599193 INFO  (qtp194324746-32470) [n:127.0.0.1:41305_solr c:testMoveReplicaMainCollection_abc s:shard1 r:core_node2 x:testMoveReplicaMainCollection_abc_shard1_replica_n1 ] o.a.s.c.ShardLeaderElectionContext Enough replicas found to continue.
   [junit4]   2> 1599193 INFO  (qtp194324746-32470) [n:127.0.0.1:41305_solr c:testMoveReplicaMainCollection_abc s:shard1 r:core_node2 x:testMoveReplicaMainCollection_abc_shard1_replica_n1 ] o.a.s.c.ShardLeaderElectionContext I may be the new leader - try and sync
   [junit4]   2> 1599193 INFO  (qtp194324746-32470) [n:127.0.0.1:41305_solr c:testMoveReplicaMainCollection_abc s:shard1 r:core_node2 x:testMoveReplicaMainCollection_abc_shard1_replica_n1 ] o.a.s.c.SyncStrategy Sync replicas to https://127.0.0.1:41305/solr/testMoveReplicaMainCollection_abc_shard1_replica_n1/
   [junit4]   2> 1599194 INFO  (qtp194324746-32470) [n:127.0.0.1:41305_solr c:testMoveReplicaMainCollection_abc s:shard1 r:core_node2 x:testMoveReplicaMainCollection_abc_shard1_replica_n1 ] o.a.s.c.SyncStrategy Sync Success - now sync replicas to me
   [junit4]   2> 1599194 INFO  (qtp194324746-32470) [n:127.0.0.1:41305_solr c:testMoveReplicaMainCollection_abc s:shard1 r:core_node2 x:testMoveReplicaMainCollection_abc_shard1_replica_n1 ] o.a.s.c.SyncStrategy https://127.0.0.1:41305/solr/testMoveReplicaMainCollection_abc_shard1_replica_n1/ has no replicas
   [junit4]   2> 1599194 INFO  (qtp194324746-32470) [n:127.0.0.1:41305_solr c:testMoveReplicaMainCollection_abc s:shard1 r:core_node2 x:testMoveReplicaMainCollection_abc_shard1_replica_n1 ] o.a.s.c.ShardLeaderElectionContextBase Creating leader registration node /collections/testMoveReplicaMainCollection_abc/leaders/shard1/leader after winning as /collections/testMoveReplicaMainCollection_abc/leader_elect/shard1/election/72830822984384518-core_node2-n_0000000000
   [junit4]   2> 1599196 INFO  (qtp194324746-32470) [n:127.0.0.1:41305_solr c:testMoveReplicaMainCollection_abc s:shard1 r:core_node2 x:testMoveReplicaMainCollection_abc_shard1_replica_n1 ] o.a.s.c.ShardLeaderElectionContext I am the new leader: https://127.0.0.1:41305/solr/testMoveReplicaMainCollection_abc_shard1_replica_n1/ shard1
   [junit4]   2> 1599197 INFO  (qtp194324746-32470) [n:127.0.0.1:41305_solr c:testMoveReplicaMainCollection_abc s:shard1 r:core_node2 x:testMoveReplicaMainCollection_abc_shard1_replica_n1 ] o.a.s.c.c.ZkStateReader already watching , added to stateWatchers
   [junit4]   2> 1599298 DEBUG (OverseerStateUpdate-72830822984384518-127.0.0.1:41305_solr-n_0000000000) [n:127.0.0.1:41305_solr     ] o.a.s.c.o.ZkStateWriter going to update_collection /collections/testMoveReplicaMainCollection_abc/state.json version: 2
   [junit4]   2> 1599298 INFO  (zkCallback-20357-thread-1) [     ] o.a.s.c.c.ZkStateReader A cluster state change: [WatchedEvent state:SyncConnected type:NodeDataChanged path:/collections/testMoveReplicaMainCollection_abc/state.json] for collection [testMoveReplicaMainCollection_abc] has occurred - updating... (live nodes size: [2])
   [junit4]   2> 1599298 INFO  (zkCallback-20357-thread-2) [     ] o.a.s.c.c.ZkStateReader A cluster state change: [WatchedEvent state:SyncConnected type:NodeDataChanged path:/collections/testMoveReplicaMainCollection_abc/state.json] for collection [testMoveReplicaMainCollection_abc] has occurred - updating... (live nodes size: [2])
   [junit4]   2> 1599299 INFO  (qtp194324746-32470) [n:127.0.0.1:41305_solr c:testMoveReplicaMainCollection_abc s:shard1 r:core_node2 x:testMoveReplicaMainCollection_abc_shard1_replica_n1 ] o.a.s.c.ZkController I am the leader, no recovery necessary
   [junit4]   2> 1599300 DEBUG (OverseerStateUpdate-72830822984384518-127.0.0.1:41305_solr-n_0000000000) [n:127.0.0.1:41305_solr     ] o.a.s.c.o.ReplicaMutator Update state numShards=1 message={
   [junit4]   2>   "core":"testMoveReplicaMainCollection_abc_shard1_replica_n1",
   [junit4]   2>   "core_node_name":"core_node2",
   [junit4]   2>   "roles":null,
   [junit4]   2>   "node_name":"127.0.0.1:41305_solr",
   [junit4]   2>   "numShards":"1",
   [junit4]   2>   "state":"active",
   [junit4]   2>   "shard":"shard1",
   [junit4]   2>   "collection":"testMoveReplicaMainCollection_abc",
   [junit4]   2>   "type":"NRT",
   [junit4]   2>   "force_set_state":"false",
   [junit4]   2>   "operation":"state"}
   [junit4]   2> 1599300 DEBUG (OverseerStateUpdate-72830822984384518-127.0.0.1:41305_solr-n_0000000000) [n:127.0.0.1:41305_solr     ] o.a.s.c.o.ReplicaMutator Will update state for replica: core_node2:{
   [junit4]   2>   "core":"testMoveReplicaMainCollection_abc_shard1_replica_n1",
   [junit4]   2>   "node_name":"127.0.0.1:41305_solr",
   [junit4]   2>   "state":"active",
   [junit4]   2>   "type":"NRT",
   [junit4]   2>   "force_set_state":"false",
   [junit4]   2>   "leader":"true",
   [junit4]   2>   "base_url":"https://127.0.0.1:41305/solr"}
   [junit4]   2> 1599300 DEBUG (OverseerStateUpdate-72830822984384518-127.0.0.1:41305_solr-n_0000000000) [n:127.0.0.1:41305_solr     ] o.a.s.c.o.ReplicaMutator Collection is now: DocCollection(testMoveReplicaMainCollection_abc//collections/testMoveReplicaMainCollection_abc/state.json/3 )={
   [junit4]   2>   "pullReplicas":"0",
   [junit4]   2>   "replicationFactor":"1",
   [junit4]   2>   "router":{"name":"compositeId"},
   [junit4]   2>   "maxShardsPerNode":"1",
   [junit4]   2>   "autoAddReplicas":"false",
   [junit4]   2>   "nrtReplicas":"1",
   [junit4]   2>   "tlogReplicas":"0",
   [junit4]   2>   "shards":{"shard1":{
   [junit4]   2>       "range":"80000000-7fffffff",
   [junit4]   2>       "state":"active",
   [junit4]   2>       "replicas":{"core_node2":{
   [junit4]   2>           "core":"testMoveReplicaMainCollection_abc_shard1_replica_n1",
   [junit4]   2>           "leader":"true",
   [junit4]   2>           "node_name":"127.0.0.1:41305_solr",
   [junit4]   2>           "state":"active",
   [junit4]   2>           "type":"NRT",
   [junit4]   2>           "force_set_state":"false"}}}}}
   [junit4]   2> 1599301 INFO  (qtp194324746-32470) [n:127.0.0.1:41305_solr c:testMoveReplicaMainCollection_abc s:shard1 r:core_node2 x:testMoveReplicaMainCollection_abc_shard1_replica_n1 ] o.a.s.c.c.ZkStateReader already watching , added to stateWatchers
   [junit4]   2> 1599302 INFO  (qtp194324746-32470) [n:127.0.0.1:41305_solr     ] o.a.s.s.HttpSolrCall [admin] webapp=null path=/admin/cores params={qt=/admin/cores&coreNodeName=core_node2&collection.configName=testMoveReplicaMainCollection_abc.AUTOCREATED&newCollection=true&name=testMoveReplicaMainCollection_abc_shard1_replica_n1&action=CREATE&numShards=1&collection=testMoveReplicaMainCollection_abc&shard=shard1&wt=javabin&version=2&replicaType=NRT} status=0 QTime=311
   [junit4]   2> 1599303 DEBUG (OverseerThreadFactory-20365-thread-1-processing-n:127.0.0.1:41305_solr) [n:127.0.0.1:41305_solr     ] o.a.s.c.s.c.a.PolicyHelper final release, session 11798538855128806 lived a total of 526ms, 
   [junit4]   2> 1599310 INFO  (qtp303780785-32475) [n:127.0.0.1:40263_solr     ] o.a.s.h.a.CollectionsHandler Wait for new collection to be active for at most 45 seconds. Check all shard replicas
   [junit4]   2> 1599310 INFO  (qtp303780785-32475) [n:127.0.0.1:40263_solr     ] o.a.s.c.c.ZkStateReader already watching , added to stateWatchers
   [junit4]   2> 1599401 DEBUG (OverseerStateUpdate-72830822984384518-127.0.0.1:41305_solr-n_0000000000) [n:127.0.0.1:41305_solr     ] o.a.s.c.o.ZkStateWriter going to update_collection /collections/testMoveReplicaMainCollection_abc/state.json version: 3
   [junit4]   2> 1599402 INFO  (zkCallback-20379-thread-1) [     ] o.a.s.c.c.ZkStateReader A cluster state change: [WatchedEvent state:SyncConnected type:NodeDataChanged path:/collections/testMoveReplicaMainCollection_abc/state.json] for collection [testMoveReplicaMainCollection_abc] has occurred - updating... (live nodes size: [2])
   [junit4]   2> 1599402 INFO  (zkCallback-20357-thread-1) [     ] o.a.s.c.c.ZkStateReader A cluster state change: [WatchedEvent state:SyncConnected type:NodeDataChanged path:/collections/testMoveReplicaMainCollection_abc/state.json] for collection [testMoveReplicaMainCollection_abc] has occurred - updating... (live nodes size: [2])
   [junit4]   2> 1599402 INFO  (zkCallback-20357-thread-2) [     ] o.a.s.c.c.ZkStateReader A cluster state change: [WatchedEvent state:SyncConnected type:NodeDataChanged path:/collections/testMoveReplicaMainCollection_abc/state.json] for collection [testMoveReplicaMainCollection_abc] has occurred - updating... (live nodes size: [2])
   [junit4]   2> 1599402 INFO  (qtp303780785-32475) [n:127.0.0.1:40263_solr     ] o.a.s.s.HttpSolrCall [admin] webapp=null path=/admin/collections params={pullReplicas=0&name=testMoveReplicaMainCollection_abc&nrtReplicas=1&action=CREATE&numShards=1&tlogReplicas=0&createNodeSet=127.0.0.1:41305_solr&wt=javabin&version=2} status=0 QTime=824
   [junit4]   2> 1599402 INFO  (zkCallback-20357-thread-3) [     ] o.a.s.c.c.ZkStateReader A cluster state change: [WatchedEvent state:SyncConnected type:NodeDataChanged path:/collections/testMoveReplicaMainCollection_abc/state.json] for collection [testMoveReplicaMainCollection_abc] has occurred - updating... (live nodes size: [2])
   [junit4]   2> 1599405 INFO  (OverseerThreadFactory-20365-thread-2-processing-n:127.0.0.1:41305_solr) [n:127.0.0.1:41305_solr     ] o.a.s.c.a.c.CreateCollectionCmd Create collection testMoveReplicaMainCollection_xyz
   [junit4]   2> 1599406 INFO  (OverseerCollectionConfigSetProcessor-72830822984384518-127.0.0.1:41305_solr-n_0000000000) [n:127.0.0.1:41305_solr     ] o.a.s.c.OverseerTaskQueue Response ZK path: /overseer/collection-queue-work/qnr-0000000000 doesn't exist. Requestor may have disconnected from ZooKeeper
   [junit4]   2> 1599406 INFO  (OverseerThreadFactory-20365-thread-2-processing-n:127.0.0.1:41305_solr) [n:127.0.0.1:41305_solr     ] o.a.s.c.c.ZkConfigManager Copying zk node /configs/_default to /configs/testMoveReplicaMainCollection_xyz.AUTOCREATED
   [junit4]   2> 1599407 INFO  (OverseerThreadFactory-20365-thread-2-processing-n:127.0.0.1:41305_solr) [n:127.0.0.1:41305_solr     ] o.a.s.c.c.ZkConfigManager Copying zk node /configs/_default/protwords.txt to /configs/testMoveReplicaMainCollection_xyz.AUTOCREATED/protwords.txt
   [junit4]   2> 1599408 INFO  (OverseerThreadFactory-20365-thread-2-processing-n:127.0.0.1:41305_solr) [n:127.0.0.1:41305_solr     ] o.a.s.c.c.ZkConfigManager Copying zk node /configs/_default/managed-schema to /configs/testMoveReplicaMainCollection_xyz.AUTOCREATED/managed-schema
   [junit4]   2> 1599410 INFO  (OverseerThreadFactory-20365-thread-2-processing-n:127.0.0.1:41305_solr) [n:127.0.0.1:41305_solr     ] o.a.s.c.c.ZkConfigManager Copying zk node /configs/_default/solrconfig.xml to /configs/testMoveReplicaMainCollection_xyz.AUTOCREATED/solrconfig.xml
   [junit4]   2> 1599412 INFO  (OverseerThreadFactory-20365-thread-2-processing-n:127.0.0.1:41305_solr) [n:127.0.0.1:41305_solr     ] o.a.s.c.c.ZkConfigManager Copying zk node /configs/_default/lang/contractions_it.txt to /configs/testMoveReplicaMainCollection_xyz.AUTOCREATED/lang/contractions_it.txt
   [junit4]   2> 1599413 INFO  (OverseerThreadFactory-20365-thread-2-processing-n:127.0.0.1:41305_solr) [n:127.0.0.1:41305_solr     ] o.a.s.c.c.ZkConfigManager Copying zk node /configs/_default/lang/stopwords_no.txt to /configs/testMoveReplicaMainCollection_xyz.AUTOCREATED/lang/stopwords_no.txt
   [junit4]   2> 1599414 INFO  (OverseerThreadFactory-20365-thread-2-processing-n:127.0.0.1:41305_solr) [n:127.0.0.1:41305_solr     ] o.a.s.c.c.ZkConfigManager Copying zk node /configs/_default/lang/contractions_ca.txt to /configs/testMoveReplicaMainCollection_xyz.AUTOCREATED/lang/contractions_ca.txt
   [junit4]   2> 1599416 INFO  (OverseerThreadFactory-20365-thread-2-processing-n:127.0.0.1:41305_solr) [n:127.0.0.1:41305_solr     ] o.a.s.c.c.ZkConfigManager Copying zk node /configs/_default/lang/stemdict_nl.txt to /configs/testMoveReplicaMainCollection_xyz.AUTOCREATED/lang/stemdict_nl.txt
   [junit4]   2> 1599417 INFO  (OverseerThreadFactory-20365-thread-2-processing-n:127.0.0.1:41305_solr) [n:127.0.0.1:41305_solr     ] o.a.s.c.c.ZkConfigManager Copying zk node /configs/_default/lang/stopwords_hy.txt to /configs/testMoveReplicaMainCollection_xyz.AUTOCREATED/lang/stopwords_hy.txt
   [junit4]   2> 1599418 INFO  (OverseerThreadFactory-20365-thread-2-processing-n:127.0.0.1:41305_solr) [n:127.0.0.1:41305_solr     ] o.a.s.c.c.ZkConfigManager Copying zk node /configs/_default/lang/stopwords_id.txt to /configs/testMoveReplicaMainCollection_xyz.AUTOCREATED/lang/stopwords_id.txt
   [junit4]   2> 1599419 INFO  (OverseerThreadFactory-20365-thread-2-processing-n:127.0.0.1:41305_solr) [n:127.0.0.1:41305_solr     ] o.a.s.c.c.ZkConfigManager Copying zk node /configs/_default/lang/stopwords_et.txt to /configs/testMoveReplicaMainCollection_xyz.AUTOCREATED/lang/stopwords_et.txt
   [junit4]   2> 1599421 INFO  (OverseerThreadFactory-20365-thread-2-processing-n:127.0.0.1:41305_solr) [n:127.0.0.1:41305_solr     ] o.a.s.c.c.ZkConfigManager Copying zk node /configs/_default/lang/stopwords_ga.txt to /configs/testMoveReplicaMainCollection_xyz.AUTOCREATED/lang/stopwords_ga.txt
   [junit4]   2> 1599422 INFO  (OverseerThreadFactory-20365-thread-2-processing-n:127.0.0.1:41305_solr) [n:127.0.0.1:41305_solr     ] o.a.s.c.c.ZkConfigManager Copying zk node /configs/_default/lang/stopwords_da.txt to /configs/testMoveReplicaMainCollection_xyz.AUTOCREATED/lang/stopwords_da.txt
   [junit4]   2> 1599423 INFO  (OverseerThreadFactory-20365-thread-2-processing-n:127.0.0.1:41305_solr) [n:127.0.0.1:41305_solr     ] o.a.s.c.c.ZkConfigManager Copying zk node /configs/_default/lang/stopwords_hi.txt to /configs/testMoveReplicaMainCollection_xyz.AUTOCREATED/lang/stopwords_hi.txt
   [junit4]   2> 1599424 INFO  (OverseerThreadFactory-20365-thread-2-processing-n:127.0.0.1:41305_solr) [n:127.0.0.1:41305_solr     ] o.a.s.c.c.ZkConfigManager Copying zk node /configs/_default/lang/stopwords_ja.txt to /configs/testMoveReplicaMainCollection_xyz.AUTOCREATED/lang/stopwords_ja.txt
   [junit4]   2> 1599425 INFO  (OverseerThreadFactory-20365-thread-2-processing-n:127.0.0.1:41305_solr) [n:127.0.0.1:41305_solr     ] o.a.s.c.c.ZkConfigManager Copying zk node /configs/_default/lang/stopwords_pt.txt to /configs/testMoveReplicaMainCollection_xyz.AUTOCREATED/lang/stopwords_pt.txt
   [junit4]   2> 1599427 INFO  (OverseerThreadFactory-20365-thread-2-processing-n:127.0.0.1:41305_solr) [n:127.0.0.1:41305_solr     ] o.a.s.c.c.ZkConfigManager Copying zk node /configs/_default/lang/stopwords_hu.txt to /configs/testMoveReplicaMainCollection_xyz.AUTOCREATED/lang/stopwords_hu.txt
   [junit4]   2> 1599428 INFO  (OverseerThreadFactory-20365-thread-2-processing-n:127.0.0.1:41305_solr) [n:127.0.0.1:41305_solr     ] o.a.s.c.c.ZkConfigManager Copying zk node /configs/_default/lang/stopwords_el.txt to /configs/testMoveReplicaMainCollection_xyz.AUTOCREATED/lang/stopwords_el.txt
   [junit4]   2> 1599429 INFO  (OverseerThreadFactory-20365-thread-2-processing-n:127.0.0.1:41305_solr) [n:127.0.0.1:41305_solr     ] o.a.s.c.c.ZkConfigManager Copying zk node /configs/_default/lang/stopwords_ru.txt to /configs/testMoveReplicaMainCollection_xyz.AUTOCREATED/lang/stopwords_ru.txt
   [junit4]   2> 1599431 INFO  (OverseerThreadFactory-20365-thread-2-processing-n:127.0.0.1:41305_solr) [n:127.0.0.1:41305_solr     ] o.a.s.c.c.ZkConfigManager Copying zk node /configs/_default/lang/stopwords_tr.txt to /configs/testMoveReplicaMainCollection_xyz.AUTOCREATED/lang/stopwords_tr.txt
   [junit4]   2> 1599432 INFO  (OverseerThreadFactory-20365-thread-2-processing-n:127.0.0.1:41305_solr) [n:127.0.0.1:41305_solr     ] o.a.s.c.c.ZkConfigManager Copying zk node /configs/_default/lang/stopwords_ar.txt to /configs/testMoveReplicaMainCollection_xyz.AUTOCREATED/lang/stopwords_ar.txt
   [junit4]   2> 1599433 INFO  (OverseerThreadFactory-20365-thread-2-processing-n:127.0.0.1:41305_solr) [n:127.0.0.1:41305_solr     ] o.a.s.c.c.ZkConfigManager Copying zk node /configs/_default/lang/userdict_ja.txt to /configs/testMoveReplicaMainCollection_xyz.AUTOCREATED/lang/userdict_ja.txt
   [junit4]   2> 1599435 INFO  (OverseerThreadFactory-20365-thread-2-processing-n:127.0.0.1:41305_solr) [n:127.0.0.1:41305_solr     ] o.a.s.c.c.ZkConfigManager Copying zk node /configs/_default/lang/stopwords_it.txt to /configs/testMoveReplicaMainCollection_xyz.AUTOCREATED/lang/stopwords_it.txt
   [junit4]   2> 1599436 INFO  (OverseerThreadFactory-20365-thread-2-processing-n:127.0.0.1:41305_solr) [n:127.0.0.1:41305_solr     ] o.a.s.c.c.ZkConfigManager Copying zk node /configs/_default/lang/stopwords_eu.txt to /configs/testMoveReplicaMainCollection_xyz.AUTOCREATED/lang/stopwords_eu.txt
   [junit4]   2> 1599437 INFO  (OverseerThreadFactory-20365-thread-2-processing-n:127.0.0.1:41305_solr) [n:127.0.0.1:41305_solr     ] o.a.s.c.c.ZkConfigManager Copying zk node /configs/_default/lang/stopwords_cz.txt to /configs/testMoveReplicaMainCollection_xyz.AUTOCREATED/lang/stopwords_cz.txt
   [junit4]   2> 1599438 INFO  (OverseerThreadFactory-20365-thread-2-processing-n:127.0.0.1:41305_solr) [n:127.0.0.1:41305_solr     ] o.a.s.c.c.ZkConfigManager Copying zk node /configs/_default/lang/stoptags_ja.txt to /configs/testMoveReplicaMainCollection_xyz.AUTOCREATED/lang/stoptags_ja.txt
   [junit4]   2> 1599440 INFO  (OverseerThreadFactory-20365-thread-2-processing-n:127.0.0.1:41305_solr) [n:127.0.0.1:41305_solr     ] o.a.s.c.c.ZkConfigManager Copying zk node /configs/_default/lang/contractions_fr.txt to /configs/testMoveReplicaMainCollection_xyz.AUTOCREATED/lang/contractions_fr.txt
   [junit4]   2> 1599441 INFO  (OverseerThreadFactory-20365-thread-2-processing-n:127.0.0.1:41305_solr) [n:127.0.0.1:41305_solr     ] o.a.s.c.c.ZkConfigManager Copying zk node /configs/_default/lang/stopwords_de.txt to /configs/testMoveReplicaMainCollection_xyz.AUTOCREATED/lang/stopwords_de.txt
   [junit4]   2> 1599442 INFO  (OverseerThreadFactory-20365-thread-2-processing-n:127.0.0.1:41305_solr) [n:127.0.0.1:41305_solr     ] o.a.s.c.c.ZkConfigManager Copying zk node /configs/_default/lang/stopwords_fa.txt to /configs/testMoveReplicaMainCollection_xyz.AUTOCREATED/lang/stopwords_fa.txt
   [junit4]   2> 1599443 INFO  (OverseerThreadFactory-20365-thread-2-processing-n:127.0.0.1:41305_solr) [n:127.0.0.1:41305_solr     ] o.a.s.c.c.ZkConfigManager Copying zk node /configs/_default/lang/contractions_ga.txt to /configs/testMoveReplicaMainCollection_xyz.AUTOCREATED/lang/contractions_ga.txt
   [junit4]   2> 1599445 INFO  (OverseerThreadFactory-20365-thread-2-processing-n:127.0.0.1:41305_solr) [n:127.0.0.1:41305_solr     ] o.a.s.c.c.ZkConfigManager Copying zk node /configs/_default/lang/stopwords_ca.txt to /configs/testMoveReplicaMainCollection_xyz.AUTOCREATED/lang/stopwords_ca.txt
   [junit4]   2> 1599446 INFO  (OverseerThreadFactory-20365-thread-2-processing-n:127.0.0.1:41305_solr) [n:127.0.0.1:41305_solr     ] o.a.s.c.c.ZkConfigManager Copying zk node /configs/_default/lang/stopwords_nl.txt to /configs/testMoveReplicaMainCollection_xyz.AUTOCREATED/lang/stopwords_nl.txt
   [junit4]   2> 1599447 INFO  (OverseerThreadFactory-20365-thread-2-processing-n:127.0.0.1:41305_solr) [n:127.0.0.1:41305_solr     ] o.a.s.c.c.ZkConfigManager Copying zk node /configs/_default/lang/stopwords_bg.txt to /configs/testMoveReplicaMainCollection_xyz.AUTOCREATED/lang/stopwords_bg.txt
   [junit4]   2> 1599448 INFO  (OverseerThreadFactory-20365-thread-2-processing-n:127.0.0.1:41305_solr) [n:127.0.0.1:41305_solr     ] o.a.s.c.c.ZkConfigManager Copying zk node /configs/_default/lang/stopwords_en.txt to /configs/testMoveReplicaMainCollection_xyz.AUTOCREATED/lang/stopwords_en.txt
   [junit4]   2> 1599450 INFO  (OverseerThreadFactory-20365-thread-2-processing-n:127.0.0.1:41305_solr) [n:127.0.0.1:41305_solr     ] o.a.s.c.c.ZkConfigManager Copying zk node /configs/_default/lang/stopwords_lv.txt to /configs/testMoveReplicaMainCollection_xyz.AUTOCREATED/lang/stopwords_lv.txt
   [junit4]   2> 1599451 INFO  (OverseerThreadFactory-20365-thread-2-processing-n:127.0.0.1:41305_solr) [n:127.0.0.1:41305_solr     ] o.a.s.c.c.ZkConfigManager Copying zk node /configs/_default/lang/stopwords_es.txt to /configs/testMoveReplicaMainCollection_xyz.AUTOCREATED/lang/stopwords_es.txt
   [junit4]   2> 1599453 INFO  (OverseerThreadFactory-20365-thread-2-processing-n:127.0.0.1:41305_solr) [n:127.0.0.1:41305_solr     ] o.a.s.c.c.ZkConfigManager Copying zk node /configs/_default/lang/stopwords_th.txt to /configs/testMoveReplicaMainCollection_xyz.AUTOCREATED/lang/stopwords_th.txt
   [junit4]   2> 1599454 INFO  (OverseerThreadFactory-20365-thread-2-processing-n:127.0.0.1:41305_solr) [n:127.0.0.1:41305_solr     ] o.a.s.c.c.ZkConfigManager Copying zk node /configs/_default/lang/stopwords_ro.txt to /configs/testMoveReplicaMainCollection_xyz.AUTOCREATED/lang/stopwords_ro.txt
   [junit4]   2> 1599456 INFO  (OverseerThreadFactory-20365-thread-2-processing-n:127.0.0.1:41305_solr) [n:127.0.0.1:41305_solr     ] o.a.s.c.c.ZkConfigManager Copying zk node /configs/_default/lang/stopwords_fr.txt to /configs/testMoveReplicaMainCollection_xyz.AUTOCREATED/lang/stopwords_fr.txt
   [junit4]   2> 1599457 INFO  (OverseerThreadFactory-20365-thread-2-processing-n:127.0.0.1:41305_solr) [n:127.0.0.1:41305_solr     ] o.a.s.c.c.ZkConfigManager Copying zk node /configs/_default/lang/stopwords_sv.txt to /configs/testMoveReplicaMainCollection_xyz.AUTOCREATED/lang/stopwords_sv.txt
   [junit4]   2> 1599458 INFO  (OverseerThreadFactory-20365-thread-2-processing-n:127.0.0.1:41305_solr) [n:127.0.0.1:41305_solr     ] o.a.s.c.c.ZkConfigManager Copying zk node /configs/_default/lang/stopwords_fi.txt to /configs/testMoveReplicaMainCollection_xyz.AUTOCREATED/lang/stopwords_fi.txt
   [junit4]   2> 1599459 INFO  (OverseerThreadFactory-20365-thread-2-processing-n:127.0.0.1:41305_solr) [n:127.0.0.1:41305_solr     ] o.a.s.c.c.ZkConfigManager Copying zk node /configs/_default/lang/hyphenations_ga.txt to /configs/testMoveReplicaMainCollection_xyz.AUTOCREATED/lang/hyphenations_ga.txt
   [junit4]   2> 1599460 INFO  (OverseerThreadFactory-20365-thread-2-processing-n:127.0.0.1:41305_solr) [n:127.0.0.1:41305_solr     ] o.a.s.c.c.ZkConfigManager Copying zk node /configs/_default/lang/stopwords_gl.txt to /configs/testMoveReplicaMainCollection_xyz.AUTOCREATED/lang/stopwords_gl.txt
   [junit4]   2> 1599462 INFO  (OverseerThreadFactory-20365-thread-2-processing-n:127.0.0.1:41305_solr) [n:127.0.0.1:41305_solr     ] o.a.s.c.c.ZkConfigManager Copying zk node /configs/_default/synonyms.txt to /configs/testMoveReplicaMainCollection_xyz.AUTOCREATED/synonyms.txt
   [junit4]   2> 1599463 INFO  (OverseerThreadFactory-20365-thread-2-processing-n:127.0.0.1:41305_solr) [n:127.0.0.1:41305_solr     ] o.a.s.c.c.ZkConfigManager Copying zk node /configs/_default/stopwords.txt to /configs/testMoveReplicaMainCollection_xyz.AUTOCREATED/stopwords.txt
   [junit4]   2> 1599466 DEBUG (OverseerStateUpdate-72830822984384518-127.0.0.1:41305_solr-n_0000000000) [n:127.0.0.1:41305_solr     ] o.a.s.c.o.ClusterStateMutator building a new cName: testMoveReplicaMainCollection_xyz
   [junit4]   2> 1599567 DEBUG (OverseerStateUpdate-72830822984384518-127.0.0.1:41305_solr-n_0000000000) [n:127.0.0.1:41305_solr     ] o.a.s.c.o.ZkStateWriter going to create_collection /collections/testMoveReplicaMainCollection_xyz/state.json
   [junit4]   2> 1599670 DEBUG (OverseerThreadFactory-20365-thread-2-processing-n:127.0.0.1:41305_solr) [n:127.0.0.1:41305_solr     ] o.a.s.c.s.c.a.PolicyHelper Creating a new session
   [junit4]   2> 1599672 INFO  (qtp303780785-32474) [n:127.0.0.1:40263_solr     ] o.a.s.s.HttpSolrCall [admin] webapp=null path=/admin/metrics params={prefix=CONTAINER.fs.usableSpace,CONTAINER.fs.totalSpace,CONTAINER.cores&wt=javabin&version=2&group=solr.node} status=0 QTime=0
   [junit4]   2> 1599673 INFO  (qtp194324746-32471) [n:127.0.0.1:41305_solr     ] o.a.s.s.HttpSolrCall [admin] webapp=null path=/admin/metrics params={wt=javabin&version=2&key=solr.core.testMoveReplicaMainCollection_abc.shard1.replica_n1:INDEX.sizeInBytes} status=0 QTime=0
   [junit4]   2> 1599674 INFO  (qtp194324746-32473) [n:127.0.0.1:41305_solr     ] o.a.s.s.HttpSolrCall [admin] webapp=null path=/admin/metrics params={prefix=CONTAINER.fs.usableSpace,CONTAINER.fs.totalSpace,CONTAINER.cores&wt=javabin&version=2&group=solr.node} status=0 QTime=0
   [junit4]   2> 1599675 DEBUG (OverseerThreadFactory-20365-thread-2-processing-n:127.0.0.1:41305_solr) [n:127.0.0.1:41305_solr     ] o.a.s.c.s.c.a.PolicyHelper New session created, 11798539754104119
   [junit4]   2> 1599681 DEBUG (OverseerThreadFactory-20365-thread-2-processing-n:127.0.0.1:41305_solr) [n:127.0.0.1:41305_solr     ] o.a.s.c.s.c.a.PolicyHelper returnSession 11798539754104119
   [junit4]   2> 1599687 INFO  (OverseerStateUpdate-72830822984384518-127.0.0.1:41305_solr-n_0000000000) [n:127.0.0.1:41305_solr     ] o.a.s.c.o.SliceMutator createReplica() {
   [junit4]   2>   "operation":"ADDREPLICA",
   [junit4]   2>   "collection":"testMoveReplicaMainCollection_xyz",
   [junit4]   2>   "shard":"shard1",
   [junit4]   2>   "core":"testMoveReplicaMainCollection_xyz_shard1_replica_n1",
   [junit4]   2>   "state":"down",
   [junit4]   2>   "node_name":"127.0.0.1:41305_solr",
   [junit4]   2>   "type":"NRT",
   [junit4]   2>   "waitForFinalState":"false"} 
   [junit4]   2> 1599688 DEBUG (OverseerStateUpdate-72830822984384518-127.0.0.1:41305_solr-n_0000000000) [n:127.0.0.1:41305_solr     ] o.a.s.c.o.SliceMutator Old Slice: shard1:{
   [junit4]   2>   "range":"80000000-7fffffff",
   [junit4]   2>   "state":"active",
   [junit4]   2>   "replicas":{}}
   [junit4]   2> 1599688 DEBUG (OverseerStateUpdate-72830822984384518-127.0.0.1:41305_solr-n_0000000000) [n:127.0.0.1:41305_solr     ] o.a.s.c.o.SliceMutator New Slice: shard1:{
   [junit4]   2>   "range":"80000000-7fffffff",
   [junit4]   2>   "state":"active",
   [junit4]   2>   "replicas":{"core_node2":{
   [junit4]   2>       "core":"testMoveReplicaMainCollection_xyz_shard1_replica_n1",
   [junit4]   2>       "node_name":"127.0.0.1:41305_solr",
   [junit4]   2>       "state":"down",
   [junit4]   2>       "type":"NRT"}}}
   [junit4]   2> 1599789 DEBUG (OverseerStateUpdate-72830822984384518-127.0.0.1:41305_solr-n_0000000000) [n:127.0.0.1:41305_solr     ] o.a.s.c.o.ZkStateWriter going to update_collection /collections/testMoveReplicaMainCollection_xyz/state.json version: 0
   [junit4]   2> 1599890 INFO  (qtp194324746-32466) [n:127.0.0.1:41305_solr    x:testMoveReplicaMainCollection_xyz_shard1_replica_n1 ] o.a.s.h.a.CoreAdminOperation core create command qt=/admin/cores&coreNodeName=core_node2&collection.configName=testMoveReplicaMainCollection_xyz.AUTOCREATED&newCollection=true&name=testMoveReplicaMainCollection_xyz_shard1_replica_n1&action=CREATE&numShards=1&collection=testMoveReplicaMainCollection_xyz&shard=shard1&wt=javabin&version=2&replicaType=NRT
   [j

[...truncated too long message...]

m.r.SolrJmxReporter Closing reporter [org.apache.solr.metrics.reporters.SolrJmxReporter@5812733f: rootName = SolrJmxReporterTest-izztrq, domain = solr.core.collection1, service url = null, agent id = localhost_1610752921846] for registry solr.core.collection1/com.codahale.metrics.MetricRegistry@3d76c3d5
   [junit4]   2> 2037121 INFO  (TEST-SolrJmxReporterTest.testClosedCore-seed#[36DCEFC297F441B]) [     ] o.a.s.c.SolrCore [collection1]  CLOSING SolrCore org.apache.solr.core.SolrCore@66ea3646
   [junit4]   2> 2037121 INFO  (TEST-SolrJmxReporterTest.testClosedCore-seed#[36DCEFC297F441B]) [     ] o.a.s.m.SolrMetricManager Closing metric reporters for registry=solr.core.collection1 tag=SolrCore@66ea3646
   [junit4]   2> 2037121 INFO  (TEST-SolrJmxReporterTest.testClosedCore-seed#[36DCEFC297F441B]) [     ] o.a.s.u.DirectUpdateHandler2 Committing on IndexWriter.close()  ... SKIPPED (unnecessary).
   [junit4]   2> Jan 16, 2021 8:22:07 AM com.carrotsearch.randomizedtesting.RandomizedRunner$QueueUncaughtExceptionsHandler uncaughtException
   [junit4]   2> WARNUNG: Uncaught exception in thread: Thread[Thread-5673,5,TGRP-SolrJmxReporterTest]
   [junit4]   2> java.lang.AssertionError
   [junit4]   2> 	at __randomizedtesting.SeedInfo.seed([36DCEFC297F441B]:0)
   [junit4]   2> 	at org.junit.Assert.fail(Assert.java:87)
   [junit4]   2> 	at org.junit.Assert.assertTrue(Assert.java:42)
   [junit4]   2> 	at org.junit.Assert.assertNotNull(Assert.java:713)
   [junit4]   2> 	at org.junit.Assert.assertNotNull(Assert.java:723)
   [junit4]   2> 	at org.apache.solr.metrics.reporters.SolrJmxReporterTest$1.run(SolrJmxReporterTest.java:213)
   [junit4]   2> 
   [junit4]   2> 2039122 INFO  (TEST-SolrJmxReporterTest.testClosedCore-seed#[36DCEFC297F441B]) [     ] o.a.s.m.SolrMetricManager Closing metric reporters for registry=solr.core.collection1 tag=null
   [junit4]   2> 2039122 INFO  (TEST-SolrJmxReporterTest.testClosedCore-seed#[36DCEFC297F441B]) [     ] o.a.s.m.SolrMetricManager Closing metric reporters for registry=solr.core.collection1 tag=SolrCore@66ea3646
   [junit4]   2> 2039122 INFO  (TEST-SolrJmxReporterTest.testClosedCore-seed#[36DCEFC297F441B]) [     ] o.a.s.SolrTestCaseJ4 ###deleteCore
   [junit4]   2> 2039122 INFO  (TEST-SolrJmxReporterTest.testClosedCore-seed#[36DCEFC297F441B]) [     ] o.a.s.c.CoreContainer Shutting down CoreContainer instance=2045233952
   [junit4]   2> 2039132 INFO  (TEST-SolrJmxReporterTest.testClosedCore-seed#[36DCEFC297F441B]) [     ] o.a.s.m.SolrMetricManager Closing metric reporters for registry=solr.node tag=null
   [junit4]   2> 2039132 INFO  (TEST-SolrJmxReporterTest.testClosedCore-seed#[36DCEFC297F441B]) [     ] o.a.s.m.r.SolrJmxReporter Closing reporter [org.apache.solr.metrics.reporters.SolrJmxReporter@36ae5dc6: rootName = null, domain = solr.node, service url = null, agent id = null] for registry solr.node/com.codahale.metrics.MetricRegistry@45e5b3c1
   [junit4]   2> 2039138 INFO  (TEST-SolrJmxReporterTest.testClosedCore-seed#[36DCEFC297F441B]) [     ] o.a.s.m.SolrMetricManager Closing metric reporters for registry=solr.jvm tag=null
   [junit4]   2> 2039138 INFO  (TEST-SolrJmxReporterTest.testClosedCore-seed#[36DCEFC297F441B]) [     ] o.a.s.m.r.SolrJmxReporter Closing reporter [org.apache.solr.metrics.reporters.SolrJmxReporter@3c429d80: rootName = null, domain = solr.jvm, service url = null, agent id = null] for registry solr.jvm/com.codahale.metrics.MetricRegistry@60af9853
   [junit4]   2> 2039147 INFO  (TEST-SolrJmxReporterTest.testClosedCore-seed#[36DCEFC297F441B]) [     ] o.a.s.m.SolrMetricManager Closing metric reporters for registry=solr.jetty tag=null
   [junit4]   2> 2039147 INFO  (TEST-SolrJmxReporterTest.testClosedCore-seed#[36DCEFC297F441B]) [     ] o.a.s.m.r.SolrJmxReporter Closing reporter [org.apache.solr.metrics.reporters.SolrJmxReporter@6177ade4: rootName = null, domain = solr.jetty, service url = null, agent id = null] for registry solr.jetty/com.codahale.metrics.MetricRegistry@6300dcf8
   [junit4]   2> 2039179 INFO  (TEST-SolrJmxReporterTest.testClosedCore-seed#[36DCEFC297F441B]) [     ] o.a.s.SolrTestCaseJ4 ###Ending testClosedCore
   [junit4]   2> NOTE: reproduce with: ant test  -Dtestcase=SolrJmxReporterTest -Dtests.method=testClosedCore -Dtests.seed=36DCEFC297F441B -Dtests.multiplier=2 -Dtests.slow=true -Dtests.locale=de -Dtests.timezone=Japan -Dtests.asserts=true -Dtests.file.encoding=UTF-8
   [junit4] ERROR   4.23s J2 | SolrJmxReporterTest.testClosedCore <<<
   [junit4]    > Throwable #1: com.carrotsearch.randomizedtesting.UncaughtExceptionError: Captured an uncaught exception in thread: Thread[id=31146, name=Thread-5673, state=RUNNABLE, group=TGRP-SolrJmxReporterTest]
   [junit4]    > 	at __randomizedtesting.SeedInfo.seed([36DCEFC297F441B:741018DC09E626EB]:0)
   [junit4]    > Caused by: java.lang.AssertionError
   [junit4]    > 	at __randomizedtesting.SeedInfo.seed([36DCEFC297F441B]:0)
   [junit4]    > 	at org.apache.solr.metrics.reporters.SolrJmxReporterTest$1.run(SolrJmxReporterTest.java:213)
   [junit4]   2> 2039182 INFO  (SUITE-SolrJmxReporterTest-seed#[36DCEFC297F441B]-worker) [     ] o.a.s.SolrTestCaseJ4 ------------------------------------------------------- Done waiting for tracked resources to be released
   [junit4]   2> NOTE: test params are: codec=Asserting(Lucene87): {}, docValues:{}, maxPointsInLeafNode=715, maxMBSortInHeap=6.832499589941876, sim=Asserting(RandomSimilarity(queryNorm=false): {}), locale=de, timezone=Japan
   [junit4]   2> NOTE: Linux 4.15.0-112-generic amd64/Oracle Corporation 1.8.0_252 (64-bit)/cpus=4,threads=1,free=111157584,total=530055168
   [junit4]   2> NOTE: All tests run in this JVM: [SpatialFilterTest, TestExternalRoleRuleBasedAuthorizationPlugin, SolrMetricsIntegrationTest, TestFieldTypeResource, DistribJoinFromCollectionTest, TestGraphMLResponseWriter, FileBasedSpellCheckerTest, ForceLeaderTest, TestBadConfig, TestSafeXMLParsing, TestCharFilters, TestSimGenericDistributedQueue, QueryEqualityTest, MetricsDisabledCloudTest, TestRecoveryHdfs, ExplicitHLLTest, ScheduledTriggerIntegrationTest, BlockJoinFacetRandomTest, TestDistribPackageStore, ConcurrentCreateCollectionTest, SolrCloudExampleTest, SortByFunctionTest, TestReloadAndDeleteDocs, TestSchemaField, TestRestManager, V2StandaloneTest, SecurityConfHandlerTest, TestStressVersions, ReturnFieldsTest, TestXIncludeConfig, TestCloudRecovery, TestConfigReload, TestLegacyTerms, XMLAtomicUpdateMultivalueTest, TestJsonFacetsStatsParsing, TestSchemaVersionResource, TestSolrDeletionPolicy1, CloneFieldUpdateProcessorFactoryTest, PeerSyncReplicationTest, TestInitParams, TestEmbeddedSolrServerConstructors, TestManagedSynonymFilterFactory, TestTolerantSearch, HighlighterConfigTest, TestConfigSetsAPI, TestNamedUpdateProcessors, DateFieldTest, DistributedSuggestComponentTest, TestStressLucene, TestCollationField, SolrInfoBeanTest, TestCloudInspectUtil, TestSimDistribStateManager, TestUninvertingReader, CachingDirectoryFactoryTest, TestManagedSchemaAPI, HttpPartitionTest, PeerSyncWithLeaderTest, TestCollectionsAPIViaSolrCloudCluster, CdcrOpsAndBoundariesTest, TestRequestStatusCollectionAPI, TestExceedMaxTermLength, TestCryptoKeys, LeaderVoteWaitTimeoutTest, MoveReplicaTest, ImplicitSnitchTest, TestDownShardTolerantSearch, DeleteInactiveReplicaTest, DistributedExpandComponentTest, VersionInfoTest, AlternateDirectoryTest, TestSolrConfigHandlerConcurrent, TestDynamicLoadingUrl, RemoteQueryErrorTest, StatsComponentTest, TestFieldCacheReopen, CdcrWithNodesRestartsTest, TestMacroExpander, UninvertDocValuesMergePolicyTest, MetricTriggerTest, ComputePlanActionTest, TestSolr4Spatial2, ZookeeperReadAPITest, DistributedFacetPivotSmallAdvancedTest, ShardTermsTest, SolrLogPostToolTest, SubstringBytesRefFilterTest, TestFieldCacheWithThreads, TestOnReconnectListenerSupport, TestPostingsSolrHighlighter, TestValueSourceCache, TestLeaderElectionWithEmptyReplica, CustomHighlightComponentTest, TestCollectionAPIs, DocExpirationUpdateProcessorFactoryTest, TestRangeQuery, OverseerModifyCollectionTest, SystemCollectionCompatTest, EchoParamsTest, TestTlogReplayVsRecovery, ActionThrottleTest, TestBinaryField, HdfsTlogReplayBufferedWhileIndexingTest, IndexSchemaTest, SystemLogListenerTest, NodeMutatorTest, DataDrivenBlockJoinTest, HdfsChaosMonkeyNothingIsSafeTest, BlockCacheTest, OverseerStatusTest, RegexBoostProcessorTest, DocValuesTest, TestDocumentBuilder, TestGroupingSearch, TestHighlightDedupGrouping, TestJoin, TestRandomDVFaceting, TestTrie, TestDeprecatedFilters, TestLuceneMatchVersion, TestReversedWildcardFilterFactory, TestWordDelimiterFilterFactory, AddReplicaTest, AssignBackwardCompatibilityTest, BasicDistributedZk2Test, ChaosMonkeyNothingIsSafeWithPullReplicasTest, CleanupOldIndexTest, ClusterStateMockUtilTest, ClusterStateTest, ClusterStateUpdateTest, CollectionStateFormat2Test, ConcurrentCreateRoutedAliasTest, ConnectionManagerTest, DeleteNodeTest, DeleteShardTest, DeleteStatusTest, ForceLeaderWithTlogReplicasTest, HttpPartitionWithTlogReplicasTest, MultiSolrCloudTestCaseTest, OverseerTaskQueueTest, ReplicationFactorTest, TestRequestForwarding, TestSegmentSorting, TestSolrCloudWithSecureImpersonation, TestTolerantUpdateProcessorCloud, TestWaitForStateWithJettyShutdowns, TlogReplayBufferedWhileIndexingTest, TriLevelCompositeIdRoutingTest, UnloadDistributedZkTest, ZkNodePropsTest, ZkShardTermsTest, CollectionReloadTest, HdfsCollectionsAPIDistributedZkTest, ShardSplitTest, HdfsRecoveryZkTest, HdfsRestartWhileUpdatingTest, HdfsUnloadDistributedZkTest, HdfsWriteToMultipleCollectionsTest, StressHdfsTest, ZkCollectionPropsCachingTest, TestConfigOverlay, TestConfigSetImmutable, TestCorePropertiesReload, TestJmxIntegration, TestLazyCores, TestReplicationHandler, JavabinLoaderTest, Tagger2Test, HighlighterMaxOffsetTest, TestNumericTokenStream, TestLogWatcher, SolrCoreMetricManagerTest, SolrJmxReporterTest]
   [junit4] Completed [698/923 (2!)] on J2 in 8.44s, 4 tests, 1 error <<< FAILURES!

[...truncated 51440 lines...]

[JENKINS] Lucene » Lucene-Solr-Tests-8.8 - Build # 86 - Still Unstable!

Posted by Apache Jenkins Server <je...@builds.apache.org>.
Build: https://ci-builds.apache.org/job/Lucene/job/Lucene-Solr-Tests-8.8/86/

1 tests failed.
FAILED:  org.apache.solr.cloud.api.collections.ShardSplitTest.testSplitMixedReplicaTypesLink

Error Message:
Error from server at http://127.0.0.1:32887: ADDREPLICA failed to create replica

Stack Trace:
org.apache.solr.client.solrj.impl.HttpSolrClient$RemoteSolrException: Error from server at http://127.0.0.1:32887: ADDREPLICA failed to create replica
	at __randomizedtesting.SeedInfo.seed([A4CFB4BD235B78CF:98A17DE48683D356]:0)
	at org.apache.solr.client.solrj.impl.HttpSolrClient.executeMethod(HttpSolrClient.java:681)
	at org.apache.solr.client.solrj.impl.HttpSolrClient.request(HttpSolrClient.java:266)
	at org.apache.solr.client.solrj.impl.HttpSolrClient.request(HttpSolrClient.java:248)
	at org.apache.solr.client.solrj.impl.LBSolrClient.doRequest(LBSolrClient.java:369)
	at org.apache.solr.client.solrj.impl.LBSolrClient.request(LBSolrClient.java:297)
	at org.apache.solr.client.solrj.impl.BaseCloudSolrClient.sendRequest(BaseCloudSolrClient.java:1171)
	at org.apache.solr.client.solrj.impl.BaseCloudSolrClient.requestWithRetryOnStaleState(BaseCloudSolrClient.java:934)
	at org.apache.solr.client.solrj.impl.BaseCloudSolrClient.request(BaseCloudSolrClient.java:866)
	at org.apache.solr.client.solrj.SolrRequest.process(SolrRequest.java:214)
	at org.apache.solr.client.solrj.SolrRequest.process(SolrRequest.java:231)
	at org.apache.solr.cloud.api.collections.ShardSplitTest.doSplitMixedReplicaTypes(ShardSplitTest.java:379)
	at org.apache.solr.cloud.api.collections.ShardSplitTest.testSplitMixedReplicaTypesLink(ShardSplitTest.java:356)
	at sun.reflect.NativeMethodAccessorImpl.invoke0(Native Method)
	at sun.reflect.NativeMethodAccessorImpl.invoke(NativeMethodAccessorImpl.java:62)
	at sun.reflect.DelegatingMethodAccessorImpl.invoke(DelegatingMethodAccessorImpl.java:43)
	at java.lang.reflect.Method.invoke(Method.java:498)
	at com.carrotsearch.randomizedtesting.RandomizedRunner.invoke(RandomizedRunner.java:1750)
	at com.carrotsearch.randomizedtesting.RandomizedRunner$8.evaluate(RandomizedRunner.java:938)
	at com.carrotsearch.randomizedtesting.RandomizedRunner$9.evaluate(RandomizedRunner.java:974)
	at com.carrotsearch.randomizedtesting.RandomizedRunner$10.evaluate(RandomizedRunner.java:988)
	at org.apache.solr.BaseDistributedSearchTestCase$ShardsRepeatRule$ShardsFixedStatement.callStatement(BaseDistributedSearchTestCase.java:1090)
	at org.apache.solr.BaseDistributedSearchTestCase$ShardsRepeatRule$ShardsStatement.evaluate(BaseDistributedSearchTestCase.java:1061)
	at com.carrotsearch.randomizedtesting.rules.SystemPropertiesRestoreRule$1.evaluate(SystemPropertiesRestoreRule.java:57)
	at org.junit.rules.RunRules.evaluate(RunRules.java:20)
	at org.apache.lucene.util.TestRuleSetupTeardownChained$1.evaluate(TestRuleSetupTeardownChained.java:49)
	at org.apache.lucene.util.AbstractBeforeAfterRule$1.evaluate(AbstractBeforeAfterRule.java:45)
	at org.apache.lucene.util.TestRuleThreadAndTestName$1.evaluate(TestRuleThreadAndTestName.java:48)
	at org.apache.lucene.util.TestRuleIgnoreAfterMaxFailures$1.evaluate(TestRuleIgnoreAfterMaxFailures.java:64)
	at org.apache.lucene.util.TestRuleMarkFailure$1.evaluate(TestRuleMarkFailure.java:47)
	at org.junit.rules.RunRules.evaluate(RunRules.java:20)
	at com.carrotsearch.randomizedtesting.rules.StatementAdapter.evaluate(StatementAdapter.java:36)
	at com.carrotsearch.randomizedtesting.ThreadLeakControl$StatementRunner.run(ThreadLeakControl.java:368)
	at com.carrotsearch.randomizedtesting.ThreadLeakControl.forkTimeoutingTask(ThreadLeakControl.java:817)
	at com.carrotsearch.randomizedtesting.ThreadLeakControl$3.evaluate(ThreadLeakControl.java:468)
	at com.carrotsearch.randomizedtesting.RandomizedRunner.runSingleTest(RandomizedRunner.java:947)
	at com.carrotsearch.randomizedtesting.RandomizedRunner$5.evaluate(RandomizedRunner.java:832)
	at com.carrotsearch.randomizedtesting.RandomizedRunner$6.evaluate(RandomizedRunner.java:883)
	at com.carrotsearch.randomizedtesting.RandomizedRunner$7.evaluate(RandomizedRunner.java:894)
	at com.carrotsearch.randomizedtesting.rules.StatementAdapter.evaluate(StatementAdapter.java:36)
	at com.carrotsearch.randomizedtesting.rules.SystemPropertiesRestoreRule$1.evaluate(SystemPropertiesRestoreRule.java:57)
	at org.junit.rules.RunRules.evaluate(RunRules.java:20)
	at org.apache.lucene.util.AbstractBeforeAfterRule$1.evaluate(AbstractBeforeAfterRule.java:45)
	at com.carrotsearch.randomizedtesting.rules.StatementAdapter.evaluate(StatementAdapter.java:36)
	at org.apache.lucene.util.TestRuleStoreClassName$1.evaluate(TestRuleStoreClassName.java:41)
	at com.carrotsearch.randomizedtesting.rules.NoShadowingOrOverridesOnMethodsRule$1.evaluate(NoShadowingOrOverridesOnMethodsRule.java:40)
	at com.carrotsearch.randomizedtesting.rules.NoShadowingOrOverridesOnMethodsRule$1.evaluate(NoShadowingOrOverridesOnMethodsRule.java:40)
	at com.carrotsearch.randomizedtesting.rules.StatementAdapter.evaluate(StatementAdapter.java:36)
	at com.carrotsearch.randomizedtesting.rules.StatementAdapter.evaluate(StatementAdapter.java:36)
	at com.carrotsearch.randomizedtesting.rules.StatementAdapter.evaluate(StatementAdapter.java:36)
	at org.apache.lucene.util.TestRuleAssertionsRequired$1.evaluate(TestRuleAssertionsRequired.java:53)
	at org.apache.lucene.util.TestRuleMarkFailure$1.evaluate(TestRuleMarkFailure.java:47)
	at org.apache.lucene.util.TestRuleIgnoreAfterMaxFailures$1.evaluate(TestRuleIgnoreAfterMaxFailures.java:64)
	at org.apache.lucene.util.TestRuleIgnoreTestSuites$1.evaluate(TestRuleIgnoreTestSuites.java:54)
	at org.junit.rules.RunRules.evaluate(RunRules.java:20)
	at com.carrotsearch.randomizedtesting.rules.StatementAdapter.evaluate(StatementAdapter.java:36)
	at com.carrotsearch.randomizedtesting.ThreadLeakControl$StatementRunner.run(ThreadLeakControl.java:368)
	at java.lang.Thread.run(Thread.java:748)




Build Log:
[...truncated 15454 lines...]
   [junit4] Suite: org.apache.solr.cloud.api.collections.ShardSplitTest
   [junit4]   2> 1636416 INFO  (SUITE-ShardSplitTest-seed#[A4CFB4BD235B78CF]-worker) [     ] o.a.s.SolrTestCase Setting 'solr.default.confdir' system property to test-framework derived value of '/home/jenkins/jenkins-slave/workspace/Lucene/Lucene-Solr-Tests-8.8/solr/server/solr/configsets/_default/conf'
   [junit4]   2> 1636416 INFO  (SUITE-ShardSplitTest-seed#[A4CFB4BD235B78CF]-worker) [     ] o.a.s.SolrTestCaseJ4 SecureRandom sanity checks: test.solr.allowed.securerandom=null & java.security.egd=file:/dev/./urandom
   [junit4]   2> 1636417 INFO  (SUITE-ShardSplitTest-seed#[A4CFB4BD235B78CF]-worker) [     ] o.a.s.SolrTestCaseJ4 Created dataDir: /home/jenkins/jenkins-slave/workspace/Lucene/Lucene-Solr-Tests-8.8/solr/build/solr-core/test/J3/temp/solr.cloud.api.collections.ShardSplitTest_A4CFB4BD235B78CF-001/data-dir-139-001
   [junit4]   2> 1636417 WARN  (SUITE-ShardSplitTest-seed#[A4CFB4BD235B78CF]-worker) [     ] o.a.s.SolrTestCaseJ4 startTrackingSearchers: numOpens=156 numCloses=156
   [junit4]   2> 1636417 INFO  (SUITE-ShardSplitTest-seed#[A4CFB4BD235B78CF]-worker) [     ] o.a.s.SolrTestCaseJ4 Using PointFields (NUMERIC_POINTS_SYSPROP=true) w/NUMERIC_DOCVALUES_SYSPROP=true
   [junit4]   2> 1636419 INFO  (SUITE-ShardSplitTest-seed#[A4CFB4BD235B78CF]-worker) [     ] o.a.s.SolrTestCaseJ4 Randomized ssl (false) and clientAuth (false) via: @org.apache.solr.SolrTestCaseJ4$SuppressSSL(bugUrl=https://issues.apache.org/jira/browse/SOLR-5776)
   [junit4]   2> 1636419 INFO  (SUITE-ShardSplitTest-seed#[A4CFB4BD235B78CF]-worker) [     ] o.a.s.BaseDistributedSearchTestCase Setting hostContext system property: /
   [junit4] IGNOR/A 0.00s J3 | ShardSplitTest.testSplitAfterFailedSplit2
   [junit4]    > Assumption #1: 'nightly' test group is disabled (@Nightly())
   [junit4]   2> 1636424 INFO  (TEST-ShardSplitTest.testSplitStaticIndexReplicationLink-seed#[A4CFB4BD235B78CF]) [     ] o.a.s.c.ZkTestServer STARTING ZK TEST SERVER
   [junit4]   2> 1636424 INFO  (ZkTestServer Run Thread) [     ] o.a.s.c.ZkTestServer client port: 0.0.0.0/0.0.0.0:0
   [junit4]   2> 1636424 INFO  (ZkTestServer Run Thread) [     ] o.a.s.c.ZkTestServer Starting server
   [junit4]   2> 1636425 WARN  (ZkTestServer Run Thread) [     ] o.a.z.s.ServerCnxnFactory maxCnxns is not configured, using default value 0.
   [junit4]   2> 1636524 INFO  (TEST-ShardSplitTest.testSplitStaticIndexReplicationLink-seed#[A4CFB4BD235B78CF]) [     ] o.a.s.c.ZkTestServer start zk server on port: 35151
   [junit4]   2> 1636524 INFO  (TEST-ShardSplitTest.testSplitStaticIndexReplicationLink-seed#[A4CFB4BD235B78CF]) [     ] o.a.s.c.ZkTestServer waitForServerUp: 127.0.0.1:35151
   [junit4]   2> 1636524 INFO  (TEST-ShardSplitTest.testSplitStaticIndexReplicationLink-seed#[A4CFB4BD235B78CF]) [     ] o.a.s.c.ZkTestServer parse host and port list: 127.0.0.1:35151
   [junit4]   2> 1636524 INFO  (TEST-ShardSplitTest.testSplitStaticIndexReplicationLink-seed#[A4CFB4BD235B78CF]) [     ] o.a.s.c.ZkTestServer connecting to 127.0.0.1 35151
   [junit4]   2> 1636525 DEBUG (TEST-ShardSplitTest.testSplitStaticIndexReplicationLink-seed#[A4CFB4BD235B78CF]) [     ] o.a.s.c.c.SolrZkClient Using default ZkCredentialsProvider
   [junit4]   2> 1636526 INFO  (TEST-ShardSplitTest.testSplitStaticIndexReplicationLink-seed#[A4CFB4BD235B78CF]) [     ] o.a.s.c.c.ConnectionManager Waiting for client to connect to ZooKeeper
   [junit4]   2> 1636529 DEBUG (TEST-ShardSplitTest.testSplitStaticIndexReplicationLink-seed#[A4CFB4BD235B78CF]-EventThread) [     ] o.a.s.c.c.SolrZkClient Submitting job to respond to event WatchedEvent state:SyncConnected type:None path:null
   [junit4]   2> 1636529 DEBUG (zkConnectionManagerCallback-14694-thread-1) [     ] o.a.s.c.c.ConnectionManager Watcher org.apache.solr.common.cloud.ConnectionManager@78edc531 name: ZooKeeperConnection Watcher:127.0.0.1:35151 got event WatchedEvent state:SyncConnected type:None path:null path: null type: None
   [junit4]   2> 1636529 INFO  (zkConnectionManagerCallback-14694-thread-1) [     ] o.a.s.c.c.ConnectionManager zkClient has connected
   [junit4]   2> 1636529 INFO  (TEST-ShardSplitTest.testSplitStaticIndexReplicationLink-seed#[A4CFB4BD235B78CF]) [     ] o.a.s.c.c.ConnectionManager Client is connected to ZooKeeper
   [junit4]   2> 1636529 DEBUG (TEST-ShardSplitTest.testSplitStaticIndexReplicationLink-seed#[A4CFB4BD235B78CF]) [     ] o.a.s.c.c.SolrZkClient Using default ZkACLProvider
   [junit4]   2> 1636530 DEBUG (TEST-ShardSplitTest.testSplitStaticIndexReplicationLink-seed#[A4CFB4BD235B78CF]) [     ] o.a.s.c.c.SolrZkClient makePath: /solr
   [junit4]   2> 1636533 DEBUG (TEST-ShardSplitTest.testSplitStaticIndexReplicationLink-seed#[A4CFB4BD235B78CF]) [     ] o.a.s.c.c.SolrZkClient Using default ZkCredentialsProvider
   [junit4]   2> 1636534 INFO  (TEST-ShardSplitTest.testSplitStaticIndexReplicationLink-seed#[A4CFB4BD235B78CF]) [     ] o.a.s.c.c.ConnectionManager Waiting for client to connect to ZooKeeper
   [junit4]   2> 1636539 DEBUG (TEST-ShardSplitTest.testSplitStaticIndexReplicationLink-seed#[A4CFB4BD235B78CF]-EventThread) [     ] o.a.s.c.c.SolrZkClient Submitting job to respond to event WatchedEvent state:SyncConnected type:None path:null
   [junit4]   2> 1636539 DEBUG (zkConnectionManagerCallback-14696-thread-1) [     ] o.a.s.c.c.ConnectionManager Watcher org.apache.solr.common.cloud.ConnectionManager@7bf06968 name: ZooKeeperConnection Watcher:127.0.0.1:35151/solr got event WatchedEvent state:SyncConnected type:None path:null path: null type: None
   [junit4]   2> 1636539 INFO  (zkConnectionManagerCallback-14696-thread-1) [     ] o.a.s.c.c.ConnectionManager zkClient has connected
   [junit4]   2> 1636539 INFO  (TEST-ShardSplitTest.testSplitStaticIndexReplicationLink-seed#[A4CFB4BD235B78CF]) [     ] o.a.s.c.c.ConnectionManager Client is connected to ZooKeeper
   [junit4]   2> 1636539 DEBUG (TEST-ShardSplitTest.testSplitStaticIndexReplicationLink-seed#[A4CFB4BD235B78CF]) [     ] o.a.s.c.c.SolrZkClient Using default ZkACLProvider
   [junit4]   2> 1636540 DEBUG (TEST-ShardSplitTest.testSplitStaticIndexReplicationLink-seed#[A4CFB4BD235B78CF]) [     ] o.a.s.c.c.SolrZkClient makePath: /clusterprops.json
   [junit4]   2> 1636540 INFO  (TEST-ShardSplitTest.testSplitStaticIndexReplicationLink-seed#[A4CFB4BD235B78CF]) [     ] o.a.s.c.ZkTestServer put /home/jenkins/jenkins-slave/workspace/Lucene/Lucene-Solr-Tests-8.8/solr/core/src/test-files/solr/collection1/conf/solrconfig-tlog.xml to /configs/conf1/solrconfig.xml
   [junit4]   2> 1636540 DEBUG (TEST-ShardSplitTest.testSplitStaticIndexReplicationLink-seed#[A4CFB4BD235B78CF]) [     ] o.a.s.c.c.SolrZkClient makePath: /configs/conf1/solrconfig.xml
   [junit4]   2> 1636541 INFO  (TEST-ShardSplitTest.testSplitStaticIndexReplicationLink-seed#[A4CFB4BD235B78CF]) [     ] o.a.s.c.ZkTestServer put /home/jenkins/jenkins-slave/workspace/Lucene/Lucene-Solr-Tests-8.8/solr/core/src/test-files/solr/collection1/conf/schema15.xml to /configs/conf1/schema.xml
   [junit4]   2> 1636541 DEBUG (TEST-ShardSplitTest.testSplitStaticIndexReplicationLink-seed#[A4CFB4BD235B78CF]) [     ] o.a.s.c.c.SolrZkClient makePath: /configs/conf1/schema.xml
   [junit4]   2> 1636542 INFO  (TEST-ShardSplitTest.testSplitStaticIndexReplicationLink-seed#[A4CFB4BD235B78CF]) [     ] o.a.s.c.ZkTestServer put /home/jenkins/jenkins-slave/workspace/Lucene/Lucene-Solr-Tests-8.8/solr/core/src/test-files/solr/collection1/conf/solrconfig.snippet.randomindexconfig.xml to /configs/conf1/solrconfig.snippet.randomindexconfig.xml
   [junit4]   2> 1636542 DEBUG (TEST-ShardSplitTest.testSplitStaticIndexReplicationLink-seed#[A4CFB4BD235B78CF]) [     ] o.a.s.c.c.SolrZkClient makePath: /configs/conf1/solrconfig.snippet.randomindexconfig.xml
   [junit4]   2> 1636543 INFO  (TEST-ShardSplitTest.testSplitStaticIndexReplicationLink-seed#[A4CFB4BD235B78CF]) [     ] o.a.s.c.ZkTestServer put /home/jenkins/jenkins-slave/workspace/Lucene/Lucene-Solr-Tests-8.8/solr/core/src/test-files/solr/collection1/conf/stopwords.txt to /configs/conf1/stopwords.txt
   [junit4]   2> 1636543 DEBUG (TEST-ShardSplitTest.testSplitStaticIndexReplicationLink-seed#[A4CFB4BD235B78CF]) [     ] o.a.s.c.c.SolrZkClient makePath: /configs/conf1/stopwords.txt
   [junit4]   2> 1636544 INFO  (TEST-ShardSplitTest.testSplitStaticIndexReplicationLink-seed#[A4CFB4BD235B78CF]) [     ] o.a.s.c.ZkTestServer put /home/jenkins/jenkins-slave/workspace/Lucene/Lucene-Solr-Tests-8.8/solr/core/src/test-files/solr/collection1/conf/protwords.txt to /configs/conf1/protwords.txt
   [junit4]   2> 1636544 DEBUG (TEST-ShardSplitTest.testSplitStaticIndexReplicationLink-seed#[A4CFB4BD235B78CF]) [     ] o.a.s.c.c.SolrZkClient makePath: /configs/conf1/protwords.txt
   [junit4]   2> 1636546 INFO  (TEST-ShardSplitTest.testSplitStaticIndexReplicationLink-seed#[A4CFB4BD235B78CF]) [     ] o.a.s.c.ZkTestServer put /home/jenkins/jenkins-slave/workspace/Lucene/Lucene-Solr-Tests-8.8/solr/core/src/test-files/solr/collection1/conf/currency.xml to /configs/conf1/currency.xml
   [junit4]   2> 1636546 DEBUG (TEST-ShardSplitTest.testSplitStaticIndexReplicationLink-seed#[A4CFB4BD235B78CF]) [     ] o.a.s.c.c.SolrZkClient makePath: /configs/conf1/currency.xml
   [junit4]   2> 1636548 INFO  (TEST-ShardSplitTest.testSplitStaticIndexReplicationLink-seed#[A4CFB4BD235B78CF]) [     ] o.a.s.c.ZkTestServer put /home/jenkins/jenkins-slave/workspace/Lucene/Lucene-Solr-Tests-8.8/solr/core/src/test-files/solr/collection1/conf/enumsConfig.xml to /configs/conf1/enumsConfig.xml
   [junit4]   2> 1636549 DEBUG (TEST-ShardSplitTest.testSplitStaticIndexReplicationLink-seed#[A4CFB4BD235B78CF]) [     ] o.a.s.c.c.SolrZkClient makePath: /configs/conf1/enumsConfig.xml
   [junit4]   2> 1636549 INFO  (TEST-ShardSplitTest.testSplitStaticIndexReplicationLink-seed#[A4CFB4BD235B78CF]) [     ] o.a.s.c.ZkTestServer put /home/jenkins/jenkins-slave/workspace/Lucene/Lucene-Solr-Tests-8.8/solr/core/src/test-files/solr/collection1/conf/open-exchange-rates.json to /configs/conf1/open-exchange-rates.json
   [junit4]   2> 1636550 DEBUG (TEST-ShardSplitTest.testSplitStaticIndexReplicationLink-seed#[A4CFB4BD235B78CF]) [     ] o.a.s.c.c.SolrZkClient makePath: /configs/conf1/open-exchange-rates.json
   [junit4]   2> 1636551 INFO  (TEST-ShardSplitTest.testSplitStaticIndexReplicationLink-seed#[A4CFB4BD235B78CF]) [     ] o.a.s.c.ZkTestServer put /home/jenkins/jenkins-slave/workspace/Lucene/Lucene-Solr-Tests-8.8/solr/core/src/test-files/solr/collection1/conf/mapping-ISOLatin1Accent.txt to /configs/conf1/mapping-ISOLatin1Accent.txt
   [junit4]   2> 1636551 DEBUG (TEST-ShardSplitTest.testSplitStaticIndexReplicationLink-seed#[A4CFB4BD235B78CF]) [     ] o.a.s.c.c.SolrZkClient makePath: /configs/conf1/mapping-ISOLatin1Accent.txt
   [junit4]   2> 1636552 INFO  (TEST-ShardSplitTest.testSplitStaticIndexReplicationLink-seed#[A4CFB4BD235B78CF]) [     ] o.a.s.c.ZkTestServer put /home/jenkins/jenkins-slave/workspace/Lucene/Lucene-Solr-Tests-8.8/solr/core/src/test-files/solr/collection1/conf/old_synonyms.txt to /configs/conf1/old_synonyms.txt
   [junit4]   2> 1636552 DEBUG (TEST-ShardSplitTest.testSplitStaticIndexReplicationLink-seed#[A4CFB4BD235B78CF]) [     ] o.a.s.c.c.SolrZkClient makePath: /configs/conf1/old_synonyms.txt
   [junit4]   2> 1636552 INFO  (TEST-ShardSplitTest.testSplitStaticIndexReplicationLink-seed#[A4CFB4BD235B78CF]) [     ] o.a.s.c.ZkTestServer put /home/jenkins/jenkins-slave/workspace/Lucene/Lucene-Solr-Tests-8.8/solr/core/src/test-files/solr/collection1/conf/synonyms.txt to /configs/conf1/synonyms.txt
   [junit4]   2> 1636553 DEBUG (TEST-ShardSplitTest.testSplitStaticIndexReplicationLink-seed#[A4CFB4BD235B78CF]) [     ] o.a.s.c.c.SolrZkClient makePath: /configs/conf1/synonyms.txt
   [junit4]   2> 1636553 INFO  (TEST-ShardSplitTest.testSplitStaticIndexReplicationLink-seed#[A4CFB4BD235B78CF]) [     ] o.a.s.c.AbstractFullDistribZkTestBase Will use NRT replicas unless explicitly asked otherwise
   [junit4]   2> 1636681 INFO  (TEST-ShardSplitTest.testSplitStaticIndexReplicationLink-seed#[A4CFB4BD235B78CF]) [     ] o.a.s.c.s.e.JettySolrRunner Start Jetty (configured port=0, binding port=0)
   [junit4]   2> 1636681 INFO  (TEST-ShardSplitTest.testSplitStaticIndexReplicationLink-seed#[A4CFB4BD235B78CF]) [     ] o.a.s.c.s.e.JettySolrRunner Trying to start Jetty on port 0 try number 2 ...
   [junit4]   2> 1636681 INFO  (TEST-ShardSplitTest.testSplitStaticIndexReplicationLink-seed#[A4CFB4BD235B78CF]) [     ] o.e.j.s.Server jetty-9.4.34.v20201102; built: 2020-11-02T14:15:39.302Z; git: e46af88704a893fc12cb0e3bf46e2c7b48a009e7; jvm 1.8.0_252-b09
   [junit4]   2> 1636685 INFO  (TEST-ShardSplitTest.testSplitStaticIndexReplicationLink-seed#[A4CFB4BD235B78CF]) [     ] o.e.j.s.session DefaultSessionIdManager workerName=node0
   [junit4]   2> 1636685 INFO  (TEST-ShardSplitTest.testSplitStaticIndexReplicationLink-seed#[A4CFB4BD235B78CF]) [     ] o.e.j.s.session No SessionScavenger set, using defaults
   [junit4]   2> 1636686 INFO  (TEST-ShardSplitTest.testSplitStaticIndexReplicationLink-seed#[A4CFB4BD235B78CF]) [     ] o.e.j.s.session node0 Scavenging every 600000ms
   [junit4]   2> 1636690 INFO  (TEST-ShardSplitTest.testSplitStaticIndexReplicationLink-seed#[A4CFB4BD235B78CF]) [     ] o.e.j.s.h.ContextHandler Started o.e.j.s.ServletContextHandler@1de7d3e9{/,null,AVAILABLE}
   [junit4]   2> 1636691 INFO  (TEST-ShardSplitTest.testSplitStaticIndexReplicationLink-seed#[A4CFB4BD235B78CF]) [     ] o.e.j.s.AbstractConnector Started ServerConnector@1a35311b{HTTP/1.1, (http/1.1, h2c)}{127.0.0.1:41179}
   [junit4]   2> 1636691 INFO  (TEST-ShardSplitTest.testSplitStaticIndexReplicationLink-seed#[A4CFB4BD235B78CF]) [     ] o.e.j.s.Server Started @1636730ms
   [junit4]   2> 1636691 INFO  (TEST-ShardSplitTest.testSplitStaticIndexReplicationLink-seed#[A4CFB4BD235B78CF]) [     ] o.a.s.c.s.e.JettySolrRunner Jetty properties: {solr.data.dir=/home/jenkins/jenkins-slave/workspace/Lucene/Lucene-Solr-Tests-8.8/solr/build/solr-core/test/J3/temp/solr.cloud.api.collections.ShardSplitTest_A4CFB4BD235B78CF-001/tempDir-001/control/data, hostContext=/, hostPort=41179, coreRootDirectory=/home/jenkins/jenkins-slave/workspace/Lucene/Lucene-Solr-Tests-8.8/solr/build/solr-core/test/J3/../../../../../../../../../../../home/jenkins/jenkins-slave/workspace/Lucene/Lucene-Solr-Tests-8.8/solr/build/solr-core/test/J3/temp/solr.cloud.api.collections.ShardSplitTest_A4CFB4BD235B78CF-001/control-001/cores}
   [junit4]   2> 1636691 ERROR (TEST-ShardSplitTest.testSplitStaticIndexReplicationLink-seed#[A4CFB4BD235B78CF]) [     ] o.a.s.u.StartupLoggingUtils Missing Java Option solr.log.dir. Logging may be missing or incomplete.
   [junit4]   2> 1636691 INFO  (TEST-ShardSplitTest.testSplitStaticIndexReplicationLink-seed#[A4CFB4BD235B78CF]) [     ] o.a.s.s.SolrDispatchFilter Using logger factory org.apache.logging.slf4j.Log4jLoggerFactory
   [junit4]   2> 1636691 INFO  (TEST-ShardSplitTest.testSplitStaticIndexReplicationLink-seed#[A4CFB4BD235B78CF]) [     ] o.a.s.s.SolrDispatchFilter  ___      _       Welcome to Apache Solr? version 8.8.0
   [junit4]   2> 1636691 INFO  (TEST-ShardSplitTest.testSplitStaticIndexReplicationLink-seed#[A4CFB4BD235B78CF]) [     ] o.a.s.s.SolrDispatchFilter / __| ___| |_ _   Starting in cloud mode on port null
   [junit4]   2> 1636691 INFO  (TEST-ShardSplitTest.testSplitStaticIndexReplicationLink-seed#[A4CFB4BD235B78CF]) [     ] o.a.s.s.SolrDispatchFilter \__ \/ _ \ | '_|  Install dir: /home/jenkins/jenkins-slave/workspace/Lucene/Lucene-Solr-Tests-8.8/solr
   [junit4]   2> 1636691 INFO  (TEST-ShardSplitTest.testSplitStaticIndexReplicationLink-seed#[A4CFB4BD235B78CF]) [     ] o.a.s.s.SolrDispatchFilter |___/\___/_|_|    Start time: 2021-01-16T02:34:11.263Z
   [junit4]   2> 1636691 DEBUG (TEST-ShardSplitTest.testSplitStaticIndexReplicationLink-seed#[A4CFB4BD235B78CF]) [     ] o.a.s.c.c.SolrZkClient Using default ZkCredentialsProvider
   [junit4]   2> 1636692 INFO  (TEST-ShardSplitTest.testSplitStaticIndexReplicationLink-seed#[A4CFB4BD235B78CF]) [     ] o.a.s.c.c.ConnectionManager Waiting for client to connect to ZooKeeper
   [junit4]   2> 1636692 DEBUG (TEST-ShardSplitTest.testSplitStaticIndexReplicationLink-seed#[A4CFB4BD235B78CF]-EventThread) [     ] o.a.s.c.c.SolrZkClient Submitting job to respond to event WatchedEvent state:SyncConnected type:None path:null
   [junit4]   2> 1636694 DEBUG (zkConnectionManagerCallback-14698-thread-1) [     ] o.a.s.c.c.ConnectionManager Watcher org.apache.solr.common.cloud.ConnectionManager@4a6ebc28 name: ZooKeeperConnection Watcher:127.0.0.1:35151/solr got event WatchedEvent state:SyncConnected type:None path:null path: null type: None
   [junit4]   2> 1636694 INFO  (zkConnectionManagerCallback-14698-thread-1) [     ] o.a.s.c.c.ConnectionManager zkClient has connected
   [junit4]   2> 1636694 INFO  (TEST-ShardSplitTest.testSplitStaticIndexReplicationLink-seed#[A4CFB4BD235B78CF]) [     ] o.a.s.c.c.ConnectionManager Client is connected to ZooKeeper
   [junit4]   2> 1636694 DEBUG (TEST-ShardSplitTest.testSplitStaticIndexReplicationLink-seed#[A4CFB4BD235B78CF]) [     ] o.a.s.c.c.SolrZkClient Using default ZkACLProvider
   [junit4]   2> 1636795 INFO  (TEST-ShardSplitTest.testSplitStaticIndexReplicationLink-seed#[A4CFB4BD235B78CF]) [     ] o.a.s.s.SolrDispatchFilter Loading solr.xml from SolrHome (not found in ZooKeeper)
   [junit4]   2> 1636795 DEBUG (TEST-ShardSplitTest.testSplitStaticIndexReplicationLink-seed#[A4CFB4BD235B78CF]-EventThread) [     ] o.a.s.c.c.SolrZkClient Submitting job to respond to event WatchedEvent state:Closed type:None path:null
   [junit4]   2> 1636795 INFO  (TEST-ShardSplitTest.testSplitStaticIndexReplicationLink-seed#[A4CFB4BD235B78CF]) [     ] o.a.s.c.SolrXmlConfig Loading container configuration from /home/jenkins/jenkins-slave/workspace/Lucene/Lucene-Solr-Tests-8.8/solr/build/solr-core/test/J3/../../../../../../../../../../../home/jenkins/jenkins-slave/workspace/Lucene/Lucene-Solr-Tests-8.8/solr/build/solr-core/test/J3/temp/solr.cloud.api.collections.ShardSplitTest_A4CFB4BD235B78CF-001/control-001/solr.xml
   [junit4]   2> 1636798 INFO  (TEST-ShardSplitTest.testSplitStaticIndexReplicationLink-seed#[A4CFB4BD235B78CF]) [     ] o.a.s.c.SolrXmlConfig Configuration parameter autoReplicaFailoverWorkLoopDelay is ignored
   [junit4]   2> 1636798 INFO  (TEST-ShardSplitTest.testSplitStaticIndexReplicationLink-seed#[A4CFB4BD235B78CF]) [     ] o.a.s.c.SolrXmlConfig Configuration parameter autoReplicaFailoverBadNodeExpiration is ignored
   [junit4]   2> 1636800 INFO  (TEST-ShardSplitTest.testSplitStaticIndexReplicationLink-seed#[A4CFB4BD235B78CF]) [     ] o.a.s.c.SolrXmlConfig MBean server found: com.sun.jmx.mbeanserver.JmxMBeanServer@f90f437, but no JMX reporters were configured - adding default JMX reporter.
   [junit4]   2> 1637043 INFO  (TEST-ShardSplitTest.testSplitStaticIndexReplicationLink-seed#[A4CFB4BD235B78CF]) [     ] o.a.s.h.c.HttpShardHandlerFactory Host whitelist initialized: WhitelistHostChecker [whitelistHosts=null, whitelistHostCheckingEnabled=false]
   [junit4]   2> 1637044 WARN  (TEST-ShardSplitTest.testSplitStaticIndexReplicationLink-seed#[A4CFB4BD235B78CF]) [     ] o.e.j.u.s.S.config Trusting all certificates configured for Client@6e42ef84[provider=null,keyStore=null,trustStore=null]
   [junit4]   2> 1637044 WARN  (TEST-ShardSplitTest.testSplitStaticIndexReplicationLink-seed#[A4CFB4BD235B78CF]) [     ] o.e.j.u.s.S.config No Client EndPointIdentificationAlgorithm configured for Client@6e42ef84[provider=null,keyStore=null,trustStore=null]
   [junit4]   2> 1637047 WARN  (TEST-ShardSplitTest.testSplitStaticIndexReplicationLink-seed#[A4CFB4BD235B78CF]) [     ] o.e.j.u.s.S.config Trusting all certificates configured for Client@4a58bf57[provider=null,keyStore=null,trustStore=null]
   [junit4]   2> 1637047 WARN  (TEST-ShardSplitTest.testSplitStaticIndexReplicationLink-seed#[A4CFB4BD235B78CF]) [     ] o.e.j.u.s.S.config No Client EndPointIdentificationAlgorithm configured for Client@4a58bf57[provider=null,keyStore=null,trustStore=null]
   [junit4]   2> 1637048 INFO  (TEST-ShardSplitTest.testSplitStaticIndexReplicationLink-seed#[A4CFB4BD235B78CF]) [     ] o.a.s.c.ZkContainer Zookeeper client=127.0.0.1:35151/solr
   [junit4]   2> 1637048 DEBUG (TEST-ShardSplitTest.testSplitStaticIndexReplicationLink-seed#[A4CFB4BD235B78CF]) [     ] o.a.s.c.c.SolrZkClient Using default ZkCredentialsProvider
   [junit4]   2> 1637048 INFO  (TEST-ShardSplitTest.testSplitStaticIndexReplicationLink-seed#[A4CFB4BD235B78CF]) [     ] o.a.s.c.c.ConnectionManager Waiting for client to connect to ZooKeeper
   [junit4]   2> 1637049 DEBUG (TEST-ShardSplitTest.testSplitStaticIndexReplicationLink-seed#[A4CFB4BD235B78CF]-EventThread) [     ] o.a.s.c.c.SolrZkClient Submitting job to respond to event WatchedEvent state:SyncConnected type:None path:null
   [junit4]   2> 1637049 DEBUG (zkConnectionManagerCallback-14709-thread-1) [     ] o.a.s.c.c.ConnectionManager Watcher org.apache.solr.common.cloud.ConnectionManager@36cf1d71 name: ZooKeeperConnection Watcher:127.0.0.1:35151 got event WatchedEvent state:SyncConnected type:None path:null path: null type: None
   [junit4]   2> 1637049 INFO  (zkConnectionManagerCallback-14709-thread-1) [     ] o.a.s.c.c.ConnectionManager zkClient has connected
   [junit4]   2> 1637049 INFO  (TEST-ShardSplitTest.testSplitStaticIndexReplicationLink-seed#[A4CFB4BD235B78CF]) [     ] o.a.s.c.c.ConnectionManager Client is connected to ZooKeeper
   [junit4]   2> 1637050 DEBUG (TEST-ShardSplitTest.testSplitStaticIndexReplicationLink-seed#[A4CFB4BD235B78CF]) [     ] o.a.s.c.c.SolrZkClient Using default ZkACLProvider
   [junit4]   2> 1637050 WARN  (TEST-ShardSplitTest.testSplitStaticIndexReplicationLink-seed#[A4CFB4BD235B78CF]-SendThread(127.0.0.1:35151)) [     ] o.a.z.ClientCnxn An exception was thrown while closing send thread for session 0x102bff821ea0003.
   [junit4]   2>           => EndOfStreamException: Unable to read additional data from server sessionid 0x102bff821ea0003, likely server has closed socket
   [junit4]   2> 	at org.apache.zookeeper.ClientCnxnSocketNIO.doIO(ClientCnxnSocketNIO.java:77)
   [junit4]   2> org.apache.zookeeper.ClientCnxn$EndOfStreamException: Unable to read additional data from server sessionid 0x102bff821ea0003, likely server has closed socket
   [junit4]   2> 	at org.apache.zookeeper.ClientCnxnSocketNIO.doIO(ClientCnxnSocketNIO.java:77) ~[zookeeper-3.6.2.jar:3.6.2]
   [junit4]   2> 	at org.apache.zookeeper.ClientCnxnSocketNIO.doTransport(ClientCnxnSocketNIO.java:350) ~[zookeeper-3.6.2.jar:3.6.2]
   [junit4]   2> 	at org.apache.zookeeper.ClientCnxn$SendThread.run(ClientCnxn.java:1275) [zookeeper-3.6.2.jar:3.6.2]
   [junit4]   2> 1637151 DEBUG (TEST-ShardSplitTest.testSplitStaticIndexReplicationLink-seed#[A4CFB4BD235B78CF]-EventThread) [     ] o.a.s.c.c.SolrZkClient Submitting job to respond to event WatchedEvent state:Closed type:None path:null
   [junit4]   2> 1637152 INFO  (TEST-ShardSplitTest.testSplitStaticIndexReplicationLink-seed#[A4CFB4BD235B78CF]) [n:127.0.0.1:41179_     ] o.a.s.c.c.ConnectionManager Waiting for client to connect to ZooKeeper
   [junit4]   2> 1637152 DEBUG (TEST-ShardSplitTest.testSplitStaticIndexReplicationLink-seed#[A4CFB4BD235B78CF]-EventThread) [     ] o.a.s.c.c.SolrZkClient Submitting job to respond to event WatchedEvent state:SyncConnected type:None path:null
   [junit4]   2> 1637153 DEBUG (zkConnectionManagerCallback-14711-thread-1) [     ] o.a.s.c.c.ConnectionManager Watcher org.apache.solr.common.cloud.ConnectionManager@12885398 name: ZooKeeperConnection Watcher:127.0.0.1:35151/solr got event WatchedEvent state:SyncConnected type:None path:null path: null type: None
   [junit4]   2> 1637153 INFO  (zkConnectionManagerCallback-14711-thread-1) [     ] o.a.s.c.c.ConnectionManager zkClient has connected
   [junit4]   2> 1637153 INFO  (TEST-ShardSplitTest.testSplitStaticIndexReplicationLink-seed#[A4CFB4BD235B78CF]) [n:127.0.0.1:41179_     ] o.a.s.c.c.ConnectionManager Client is connected to ZooKeeper
   [junit4]   2> 1637153 DEBUG (TEST-ShardSplitTest.testSplitStaticIndexReplicationLink-seed#[A4CFB4BD235B78CF]) [n:127.0.0.1:41179_     ] o.a.s.c.c.SolrZkClient makePath: /overseer/collection-map-running
   [junit4]   2> 1637154 DEBUG (TEST-ShardSplitTest.testSplitStaticIndexReplicationLink-seed#[A4CFB4BD235B78CF]) [n:127.0.0.1:41179_     ] o.a.s.c.c.SolrZkClient makePath: /overseer/collection-map-completed
   [junit4]   2> 1637155 DEBUG (TEST-ShardSplitTest.testSplitStaticIndexReplicationLink-seed#[A4CFB4BD235B78CF]) [n:127.0.0.1:41179_     ] o.a.s.c.c.SolrZkClient makePath: /overseer/collection-map-failure
   [junit4]   2> 1637156 DEBUG (TEST-ShardSplitTest.testSplitStaticIndexReplicationLink-seed#[A4CFB4BD235B78CF]) [n:127.0.0.1:41179_     ] o.a.s.c.c.SolrZkClient makePath: /overseer/async_ids
   [junit4]   2> 1637157 DEBUG (TEST-ShardSplitTest.testSplitStaticIndexReplicationLink-seed#[A4CFB4BD235B78CF]) [n:127.0.0.1:41179_     ] o.a.s.c.c.SolrZkClient makePath: /live_nodes
   [junit4]   2> 1637158 DEBUG (TEST-ShardSplitTest.testSplitStaticIndexReplicationLink-seed#[A4CFB4BD235B78CF]) [n:127.0.0.1:41179_     ] o.a.s.c.c.SolrZkClient makePath: /aliases.json
   [junit4]   2> 1637158 DEBUG (TEST-ShardSplitTest.testSplitStaticIndexReplicationLink-seed#[A4CFB4BD235B78CF]) [n:127.0.0.1:41179_     ] o.a.s.c.c.SolrZkClient makePath: /autoscaling/events
   [junit4]   2> 1637159 DEBUG (TEST-ShardSplitTest.testSplitStaticIndexReplicationLink-seed#[A4CFB4BD235B78CF]) [n:127.0.0.1:41179_     ] o.a.s.c.c.SolrZkClient makePath: /autoscaling/triggerState
   [junit4]   2> 1637160 DEBUG (TEST-ShardSplitTest.testSplitStaticIndexReplicationLink-seed#[A4CFB4BD235B78CF]) [n:127.0.0.1:41179_     ] o.a.s.c.c.SolrZkClient makePath: /autoscaling/nodeAdded
   [junit4]   2> 1637161 DEBUG (TEST-ShardSplitTest.testSplitStaticIndexReplicationLink-seed#[A4CFB4BD235B78CF]) [n:127.0.0.1:41179_     ] o.a.s.c.c.SolrZkClient makePath: /autoscaling/nodeLost
   [junit4]   2> 1637162 DEBUG (TEST-ShardSplitTest.testSplitStaticIndexReplicationLink-seed#[A4CFB4BD235B78CF]) [n:127.0.0.1:41179_     ] o.a.s.c.c.SolrZkClient makePath: /clusterstate.json
   [junit4]   2> 1637162 DEBUG (TEST-ShardSplitTest.testSplitStaticIndexReplicationLink-seed#[A4CFB4BD235B78CF]) [n:127.0.0.1:41179_     ] o.a.s.c.c.SolrZkClient makePath: /security.json
   [junit4]   2> 1637163 DEBUG (TEST-ShardSplitTest.testSplitStaticIndexReplicationLink-seed#[A4CFB4BD235B78CF]) [n:127.0.0.1:41179_     ] o.a.s.c.c.SolrZkClient makePath: /autoscaling.json
   [junit4]   2> 1637164 DEBUG (TEST-ShardSplitTest.testSplitStaticIndexReplicationLink-seed#[A4CFB4BD235B78CF]) [n:127.0.0.1:41179_     ] o.a.s.c.c.SolrZkClient makePath: /configs/_default/protwords.txt
   [junit4]   2> 1637165 DEBUG (TEST-ShardSplitTest.testSplitStaticIndexReplicationLink-seed#[A4CFB4BD235B78CF]) [n:127.0.0.1:41179_     ] o.a.s.c.c.SolrZkClient makePath: /configs/_default/solrconfig.xml
   [junit4]   2> 1637166 DEBUG (TEST-ShardSplitTest.testSplitStaticIndexReplicationLink-seed#[A4CFB4BD235B78CF]) [n:127.0.0.1:41179_     ] o.a.s.c.c.SolrZkClient makePath: /configs/_default/synonyms.txt
   [junit4]   2> 1637167 DEBUG (TEST-ShardSplitTest.testSplitStaticIndexReplicationLink-seed#[A4CFB4BD235B78CF]) [n:127.0.0.1:41179_     ] o.a.s.c.c.SolrZkClient makePath: /configs/_default/managed-schema
   [junit4]   2> 1637169 DEBUG (TEST-ShardSplitTest.testSplitStaticIndexReplicationLink-seed#[A4CFB4BD235B78CF]) [n:127.0.0.1:41179_     ] o.a.s.c.c.SolrZkClient makePath: /configs/_default/lang/stopwords_hi.txt
   [junit4]   2> 1637170 DEBUG (TEST-ShardSplitTest.testSplitStaticIndexReplicationLink-seed#[A4CFB4BD235B78CF]) [n:127.0.0.1:41179_     ] o.a.s.c.c.SolrZkClient makePath: /configs/_default/lang/stopwords_fa.txt
   [junit4]   2> 1637172 DEBUG (TEST-ShardSplitTest.testSplitStaticIndexReplicationLink-seed#[A4CFB4BD235B78CF]) [n:127.0.0.1:41179_     ] o.a.s.c.c.SolrZkClient makePath: /configs/_default/lang/stopwords_es.txt
   [junit4]   2> 1637174 DEBUG (TEST-ShardSplitTest.testSplitStaticIndexReplicationLink-seed#[A4CFB4BD235B78CF]) [n:127.0.0.1:41179_     ] o.a.s.c.c.SolrZkClient makePath: /configs/_default/lang/stopwords_sv.txt
   [junit4]   2> 1637180 DEBUG (TEST-ShardSplitTest.testSplitStaticIndexReplicationLink-seed#[A4CFB4BD235B78CF]) [n:127.0.0.1:41179_     ] o.a.s.c.c.SolrZkClient makePath: /configs/_default/lang/contractions_ca.txt
   [junit4]   2> 1637183 DEBUG (TEST-ShardSplitTest.testSplitStaticIndexReplicationLink-seed#[A4CFB4BD235B78CF]) [n:127.0.0.1:41179_     ] o.a.s.c.c.SolrZkClient makePath: /configs/_default/lang/stopwords_it.txt
   [junit4]   2> 1637184 DEBUG (TEST-ShardSplitTest.testSplitStaticIndexReplicationLink-seed#[A4CFB4BD235B78CF]) [n:127.0.0.1:41179_     ] o.a.s.c.c.SolrZkClient makePath: /configs/_default/lang/stopwords_eu.txt
   [junit4]   2> 1637185 DEBUG (TEST-ShardSplitTest.testSplitStaticIndexReplicationLink-seed#[A4CFB4BD235B78CF]) [n:127.0.0.1:41179_     ] o.a.s.c.c.SolrZkClient makePath: /configs/_default/lang/stopwords_no.txt
   [junit4]   2> 1637187 DEBUG (TEST-ShardSplitTest.testSplitStaticIndexReplicationLink-seed#[A4CFB4BD235B78CF]) [n:127.0.0.1:41179_     ] o.a.s.c.c.SolrZkClient makePath: /configs/_default/lang/stopwords_en.txt
   [junit4]   2> 1637189 DEBUG (TEST-ShardSplitTest.testSplitStaticIndexReplicationLink-seed#[A4CFB4BD235B78CF]) [n:127.0.0.1:41179_     ] o.a.s.c.c.SolrZkClient makePath: /configs/_default/lang/stopwords_et.txt
   [junit4]   2> 1637190 DEBUG (TEST-ShardSplitTest.testSplitStaticIndexReplicationLink-seed#[A4CFB4BD235B78CF]) [n:127.0.0.1:41179_     ] o.a.s.c.c.SolrZkClient makePath: /configs/_default/lang/stopwords_ar.txt
   [junit4]   2> 1637192 DEBUG (TEST-ShardSplitTest.testSplitStaticIndexReplicationLink-seed#[A4CFB4BD235B78CF]) [n:127.0.0.1:41179_     ] o.a.s.c.c.SolrZkClient makePath: /configs/_default/lang/stopwords_fi.txt
   [junit4]   2> 1637193 DEBUG (TEST-ShardSplitTest.testSplitStaticIndexReplicationLink-seed#[A4CFB4BD235B78CF]) [n:127.0.0.1:41179_     ] o.a.s.c.c.SolrZkClient makePath: /configs/_default/lang/stopwords_hu.txt
   [junit4]   2> 1637194 DEBUG (TEST-ShardSplitTest.testSplitStaticIndexReplicationLink-seed#[A4CFB4BD235B78CF]) [n:127.0.0.1:41179_     ] o.a.s.c.c.SolrZkClient makePath: /configs/_default/lang/hyphenations_ga.txt
   [junit4]   2> 1637200 DEBUG (TEST-ShardSplitTest.testSplitStaticIndexReplicationLink-seed#[A4CFB4BD235B78CF]) [n:127.0.0.1:41179_     ] o.a.s.c.c.SolrZkClient makePath: /configs/_default/lang/stopwords_nl.txt
   [junit4]   2> 1637202 DEBUG (TEST-ShardSplitTest.testSplitStaticIndexReplicationLink-seed#[A4CFB4BD235B78CF]) [n:127.0.0.1:41179_     ] o.a.s.c.c.SolrZkClient makePath: /configs/_default/lang/stopwords_de.txt
   [junit4]   2> 1637204 DEBUG (TEST-ShardSplitTest.testSplitStaticIndexReplicationLink-seed#[A4CFB4BD235B78CF]) [n:127.0.0.1:41179_     ] o.a.s.c.c.SolrZkClient makePath: /configs/_default/lang/stopwords_th.txt
   [junit4]   2> 1637205 DEBUG (TEST-ShardSplitTest.testSplitStaticIndexReplicationLink-seed#[A4CFB4BD235B78CF]) [n:127.0.0.1:41179_     ] o.a.s.c.c.SolrZkClient makePath: /configs/_default/lang/stemdict_nl.txt
   [junit4]   2> 1637206 DEBUG (TEST-ShardSplitTest.testSplitStaticIndexReplicationLink-seed#[A4CFB4BD235B78CF]) [n:127.0.0.1:41179_     ] o.a.s.c.c.SolrZkClient makePath: /configs/_default/lang/stopwords_ca.txt
   [junit4]   2> 1637211 DEBUG (TEST-ShardSplitTest.testSplitStaticIndexReplicationLink-seed#[A4CFB4BD235B78CF]) [n:127.0.0.1:41179_     ] o.a.s.c.c.SolrZkClient makePath: /configs/_default/lang/stopwords_bg.txt
   [junit4]   2> 1637214 DEBUG (TEST-ShardSplitTest.testSplitStaticIndexReplicationLink-seed#[A4CFB4BD235B78CF]) [n:127.0.0.1:41179_     ] o.a.s.c.c.SolrZkClient makePath: /configs/_default/lang/stopwords_gl.txt
   [junit4]   2> 1637216 DEBUG (TEST-ShardSplitTest.testSplitStaticIndexReplicationLink-seed#[A4CFB4BD235B78CF]) [n:127.0.0.1:41179_     ] o.a.s.c.c.SolrZkClient makePath: /configs/_default/lang/stopwords_da.txt
   [junit4]   2> 1637217 DEBUG (TEST-ShardSplitTest.testSplitStaticIndexReplicationLink-seed#[A4CFB4BD235B78CF]) [n:127.0.0.1:41179_     ] o.a.s.c.c.SolrZkClient makePath: /configs/_default/lang/stopwords_tr.txt
   [junit4]   2> 1637218 DEBUG (TEST-ShardSplitTest.testSplitStaticIndexReplicationLink-seed#[A4CFB4BD235B78CF]) [n:127.0.0.1:41179_     ] o.a.s.c.c.SolrZkClient makePath: /configs/_default/lang/contractions_fr.txt
   [junit4]   2> 1637220 DEBUG (TEST-ShardSplitTest.testSplitStaticIndexReplicationLink-seed#[A4CFB4BD235B78CF]) [n:127.0.0.1:41179_     ] o.a.s.c.c.SolrZkClient makePath: /configs/_default/lang/stopwords_ja.txt
   [junit4]   2> 1637221 DEBUG (TEST-ShardSplitTest.testSplitStaticIndexReplicationLink-seed#[A4CFB4BD235B78CF]) [n:127.0.0.1:41179_     ] o.a.s.c.c.SolrZkClient makePath: /configs/_default/lang/stopwords_hy.txt
   [junit4]   2> 1637222 DEBUG (TEST-ShardSplitTest.testSplitStaticIndexReplicationLink-seed#[A4CFB4BD235B78CF]) [n:127.0.0.1:41179_     ] o.a.s.c.c.SolrZkClient makePath: /configs/_default/lang/stoptags_ja.txt
   [junit4]   2> 1637225 DEBUG (TEST-ShardSplitTest.testSplitStaticIndexReplicationLink-seed#[A4CFB4BD235B78CF]) [n:127.0.0.1:41179_     ] o.a.s.c.c.SolrZkClient makePath: /configs/_default/lang/contractions_it.txt
   [junit4]   2> 1637230 DEBUG (TEST-ShardSplitTest.testSplitStaticIndexReplicationLink-seed#[A4CFB4BD235B78CF]) [n:127.0.0.1:41179_     ] o.a.s.c.c.SolrZkClient makePath: /configs/_default/lang/stopwords_cz.txt
   [junit4]   2> 1637232 DEBUG (TEST-ShardSplitTest.testSplitStaticIndexReplicationLink-seed#[A4CFB4BD235B78CF]) [n:127.0.0.1:41179_     ] o.a.s.c.c.SolrZkClient makePath: /configs/_default/lang/stopwords_id.txt
   [junit4]   2> 1637233 DEBUG (TEST-ShardSplitTest.testSplitStaticIndexReplicationLink-seed#[A4CFB4BD235B78CF]) [n:127.0.0.1:41179_     ] o.a.s.c.c.SolrZkClient makePath: /configs/_default/lang/stopwords_ro.txt
   [junit4]   2> 1637234 DEBUG (TEST-ShardSplitTest.testSplitStaticIndexReplicationLink-seed#[A4CFB4BD235B78CF]) [n:127.0.0.1:41179_     ] o.a.s.c.c.SolrZkClient makePath: /configs/_default/lang/userdict_ja.txt
   [junit4]   2> 1637235 DEBUG (TEST-ShardSplitTest.testSplitStaticIndexReplicationLink-seed#[A4CFB4BD235B78CF]) [n:127.0.0.1:41179_     ] o.a.s.c.c.SolrZkClient makePath: /configs/_default/lang/stopwords_el.txt
   [junit4]   2> 1637237 DEBUG (TEST-ShardSplitTest.testSplitStaticIndexReplicationLink-seed#[A4CFB4BD235B78CF]) [n:127.0.0.1:41179_     ] o.a.s.c.c.SolrZkClient makePath: /configs/_default/lang/stopwords_ga.txt
   [junit4]   2> 1637238 DEBUG (TEST-ShardSplitTest.testSplitStaticIndexReplicationLink-seed#[A4CFB4BD235B78CF]) [n:127.0.0.1:41179_     ] o.a.s.c.c.SolrZkClient makePath: /configs/_default/lang/stopwords_fr.txt
   [junit4]   2> 1637239 DEBUG (TEST-ShardSplitTest.testSplitStaticIndexReplicationLink-seed#[A4CFB4BD235B78CF]) [n:127.0.0.1:41179_     ] o.a.s.c.c.SolrZkClient makePath: /configs/_default/lang/contractions_ga.txt
   [junit4]   2> 1637240 DEBUG (TEST-ShardSplitTest.testSplitStaticIndexReplicationLink-seed#[A4CFB4BD235B78CF]) [n:127.0.0.1:41179_     ] o.a.s.c.c.SolrZkClient makePath: /configs/_default/lang/stopwords_lv.txt
   [junit4]   2> 1637241 DEBUG (TEST-ShardSplitTest.testSplitStaticIndexReplicationLink-seed#[A4CFB4BD235B78CF]) [n:127.0.0.1:41179_     ] o.a.s.c.c.SolrZkClient makePath: /configs/_default/lang/stopwords_ru.txt
   [junit4]   2> 1637242 DEBUG (TEST-ShardSplitTest.testSplitStaticIndexReplicationLink-seed#[A4CFB4BD235B78CF]) [n:127.0.0.1:41179_     ] o.a.s.c.c.SolrZkClient makePath: /configs/_default/lang/stopwords_pt.txt
   [junit4]   2> 1637244 DEBUG (TEST-ShardSplitTest.testSplitStaticIndexReplicationLink-seed#[A4CFB4BD235B78CF]) [n:127.0.0.1:41179_     ] o.a.s.c.c.SolrZkClient makePath: /configs/_default/stopwords.txt
   [junit4]   2> 1637244 DEBUG (TEST-ShardSplitTest.testSplitStaticIndexReplicationLink-seed#[A4CFB4BD235B78CF]) [n:127.0.0.1:41179_     ] o.a.s.c.c.ZkStateReader Updating cluster state from ZooKeeper... 
   [junit4]   2> 1637245 DEBUG (TEST-ShardSplitTest.testSplitStaticIndexReplicationLink-seed#[A4CFB4BD235B78CF]) [n:127.0.0.1:41179_     ] o.a.s.c.c.ZkStateReader Loaded cluster properties: {legacyCloud=true}
   [junit4]   2> 1637245 DEBUG (TEST-ShardSplitTest.testSplitStaticIndexReplicationLink-seed#[A4CFB4BD235B78CF]) [n:127.0.0.1:41179_     ] o.a.s.c.c.ZkStateReader Updated live nodes from ZooKeeper... [] -> []
   [junit4]   2> 1637246 DEBUG (TEST-ShardSplitTest.testSplitStaticIndexReplicationLink-seed#[A4CFB4BD235B78CF]) [n:127.0.0.1:41179_     ] o.a.s.c.c.ZkStateReader clusterStateSet: legacy [0] interesting [0] watched [0] lazy [2] total [2]
   [junit4]   2> 1637246 DEBUG (TEST-ShardSplitTest.testSplitStaticIndexReplicationLink-seed#[A4CFB4BD235B78CF]) [n:127.0.0.1:41179_     ] o.a.s.c.c.ZkStateReader$AliasesManager Checking ZK for most up to date Aliases /aliases.json
   [junit4]   2> 1637246 DEBUG (TEST-ShardSplitTest.testSplitStaticIndexReplicationLink-seed#[A4CFB4BD235B78CF]) [n:127.0.0.1:41179_     ] o.a.s.c.c.ZkStateReader$AliasesManager Aliases: cmp=-1, new definition is: Aliases{collectionAliases={}, collectionAliasProperties={}, zNodeVersion=0}
   [junit4]   2> 1637248 DEBUG (TEST-ShardSplitTest.testSplitStaticIndexReplicationLink-seed#[A4CFB4BD235B78CF]) [n:127.0.0.1:41179_     ] o.a.s.c.c.SolrZkClient makePath: /overseer_elect
   [junit4]   2> 1637248 DEBUG (TEST-ShardSplitTest.testSplitStaticIndexReplicationLink-seed#[A4CFB4BD235B78CF]) [n:127.0.0.1:41179_     ] o.a.s.c.c.SolrZkClient makePath: /overseer_elect/election
   [junit4]   2> 1637249 INFO  (TEST-ShardSplitTest.testSplitStaticIndexReplicationLink-seed#[A4CFB4BD235B78CF]) [n:127.0.0.1:41179_     ] o.a.s.c.OverseerElectionContext I am going to be the leader 127.0.0.1:41179_
   [junit4]   2> 1637249 DEBUG (TEST-ShardSplitTest.testSplitStaticIndexReplicationLink-seed#[A4CFB4BD235B78CF]) [n:127.0.0.1:41179_     ] o.a.s.c.c.SolrZkClient makePath: /overseer_elect/leader
   [junit4]   2> 1637250 INFO  (TEST-ShardSplitTest.testSplitStaticIndexReplicationLink-seed#[A4CFB4BD235B78CF]) [n:127.0.0.1:41179_     ] o.a.s.c.Overseer Overseer (id=72831616433127428-127.0.0.1:41179_-n_0000000000) starting
   [junit4]   2> 1637250 DEBUG (TEST-ShardSplitTest.testSplitStaticIndexReplicationLink-seed#[A4CFB4BD235B78CF]) [n:127.0.0.1:41179_     ] o.a.s.c.c.SolrZkClient makePath: /overseer/queue
   [junit4]   2> 1637251 DEBUG (TEST-ShardSplitTest.testSplitStaticIndexReplicationLink-seed#[A4CFB4BD235B78CF]) [n:127.0.0.1:41179_     ] o.a.s.c.c.SolrZkClient makePath: /overseer/queue-work
   [junit4]   2> 1637252 DEBUG (TEST-ShardSplitTest.testSplitStaticIndexReplicationLink-seed#[A4CFB4BD235B78CF]) [n:127.0.0.1:41179_     ] o.a.s.c.c.SolrZkClient makePath: /overseer/collection-queue-work
   [junit4]   2> 1637254 DEBUG (OverseerCollectionConfigSetProcessor-72831616433127428-127.0.0.1:41179_-n_0000000000) [n:127.0.0.1:41179_     ] o.a.s.c.OverseerTaskProcessor Process current queue of overseer operations
   [junit4]   2> 1637255 INFO  (OverseerStateUpdate-72831616433127428-127.0.0.1:41179_-n_0000000000) [n:127.0.0.1:41179_     ] o.a.s.c.Overseer Starting to work on the main queue : 127.0.0.1:41179_
   [junit4]   2> 1637255 INFO  (TEST-ShardSplitTest.testSplitStaticIndexReplicationLink-seed#[A4CFB4BD235B78CF]) [n:127.0.0.1:41179_     ] o.a.s.c.ZkController Register node as live in ZooKeeper:/live_nodes/127.0.0.1:41179_
   [junit4]   2> 1637256 DEBUG (TEST-ShardSplitTest.testSplitStaticIndexReplicationLink-seed#[A4CFB4BD235B78CF]-EventThread) [     ] o.a.s.c.c.SolrZkClient Submitting job to respond to event WatchedEvent state:SyncConnected type:NodeChildrenChanged path:/live_nodes
   [junit4]   2> 1637256 INFO  (OverseerStateUpdate-72831616433127428-127.0.0.1:41179_-n_0000000000) [n:127.0.0.1:41179_     ] o.a.s.c.c.ZkStateReader Updated live nodes from ZooKeeper... (0) -> (1)
   [junit4]   2> 1637256 DEBUG (OverseerStateUpdate-72831616433127428-127.0.0.1:41179_-n_0000000000) [n:127.0.0.1:41179_     ] o.a.s.c.c.ZkStateReader Updated live nodes from ZooKeeper... [] -> [127.0.0.1:41179_]
   [junit4]   2> 1637256 DEBUG (OverseerCollectionConfigSetProcessor-72831616433127428-127.0.0.1:41179_-n_0000000000) [n:127.0.0.1:41179_     ] o.a.s.c.OverseerTaskProcessor Cleaning up work-queue. #Running tasks: 0 #Completed tasks: 0
   [junit4]   2> 1637256 DEBUG (OverseerCollectionConfigSetProcessor-72831616433127428-127.0.0.1:41179_-n_0000000000) [n:127.0.0.1:41179_     ] o.a.s.c.OverseerTaskProcessor RunningTasks: []
   [junit4]   2> 1637256 DEBUG (OverseerCollectionConfigSetProcessor-72831616433127428-127.0.0.1:41179_-n_0000000000) [n:127.0.0.1:41179_     ] o.a.s.c.OverseerTaskProcessor BlockedTasks: []
   [junit4]   2> 1637256 DEBUG (OverseerCollectionConfigSetProcessor-72831616433127428-127.0.0.1:41179_-n_0000000000) [n:127.0.0.1:41179_     ] o.a.s.c.OverseerTaskProcessor CompletedTasks: []
   [junit4]   2> 1637256 INFO  (OverseerCollectionConfigSetProcessor-72831616433127428-127.0.0.1:41179_-n_0000000000) [n:127.0.0.1:41179_     ] o.a.s.c.OverseerTaskProcessor RunningZKTasks: []
   [junit4]   2> 1637256 DEBUG (zkCallback-14710-thread-1) [     ] o.a.s.c.c.ZkStateReader A live node change: [WatchedEvent state:SyncConnected type:NodeChildrenChanged path:/live_nodes], has occurred - updating... (live nodes size: [1])
   [junit4]   2> 1637256 DEBUG (OverseerStateUpdate-72831616433127428-127.0.0.1:41179_-n_0000000000) [n:127.0.0.1:41179_     ] o.a.s.c.c.ZkStateReader clusterStateSet: legacy [0] interesting [0] watched [0] lazy [2] total [2]
   [junit4]   2> 1637256 DEBUG (zkCallback-14710-thread-1) [     ] o.a.s.c.c.ZkStateReader Updated live nodes from ZooKeeper... [127.0.0.1:41179_] -> [127.0.0.1:41179_]
   [junit4]   2> 1637258 DEBUG (OverseerAutoScalingTriggerThread-72831616433127428-127.0.0.1:41179_-n_0000000000) [     ] o.a.s.c.c.SolrZkClient makePath: /autoscaling/events/.scheduled_maintenance
   [junit4]   2> 1637259 INFO  (TEST-ShardSplitTest.testSplitStaticIndexReplicationLink-seed#[A4CFB4BD235B78CF]) [n:127.0.0.1:41179_     ] o.a.s.p.PackageLoader /packages.json updated to version -1
   [junit4]   2> 1637260 WARN  (TEST-ShardSplitTest.testSplitStaticIndexReplicationLink-seed#[A4CFB4BD235B78CF]) [n:127.0.0.1:41179_     ] o.a.s.c.CoreContainer Not all security plugins configured!  authentication=disabled authorization=disabled.  Solr is only as secure as you make it. Consider configuring authentication/authorization before exposing Solr to users internal or external.  See https://s.apache.org/solrsecurity for more info
   [junit4]   2> 1637266 DEBUG (OverseerAutoScalingTriggerThread-72831616433127428-127.0.0.1:41179_-n_0000000000) [     ] o.a.s.c.c.SolrZkClient makePath: /autoscaling/events/.auto_add_replicas
   [junit4]   2> 1637274 INFO  (TEST-ShardSplitTest.testSplitStaticIndexReplicationLink-seed#[A4CFB4BD235B78CF]) [n:127.0.0.1:41179_     ] o.a.s.h.a.MetricsHistoryHandler No .system collection, keeping metrics history in memory.
   [junit4]   2> 1637294 INFO  (TEST-ShardSplitTest.testSplitStaticIndexReplicationLink-seed#[A4CFB4BD235B78CF]) [n:127.0.0.1:41179_     ] o.a.s.m.r.SolrJmxReporter JMX monitoring for 'solr.node' (registry 'solr.node') enabled at server: com.sun.jmx.mbeanserver.JmxMBeanServer@f90f437
   [junit4]   2> 1637302 INFO  (TEST-ShardSplitTest.testSplitStaticIndexReplicationLink-seed#[A4CFB4BD235B78CF]) [n:127.0.0.1:41179_     ] o.a.s.m.r.SolrJmxReporter JMX monitoring for 'solr.jvm' (registry 'solr.jvm') enabled at server: com.sun.jmx.mbeanserver.JmxMBeanServer@f90f437
   [junit4]   2> 1637302 INFO  (TEST-ShardSplitTest.testSplitStaticIndexReplicationLink-seed#[A4CFB4BD235B78CF]) [n:127.0.0.1:41179_     ] o.a.s.m.r.SolrJmxReporter JMX monitoring for 'solr.jetty' (registry 'solr.jetty') enabled at server: com.sun.jmx.mbeanserver.JmxMBeanServer@f90f437
   [junit4]   2> 1637303 INFO  (TEST-ShardSplitTest.testSplitStaticIndexReplicationLink-seed#[A4CFB4BD235B78CF]) [n:127.0.0.1:41179_     ] o.a.s.c.CorePropertiesLocator Found 0 core definitions underneath /home/jenkins/jenkins-slave/workspace/Lucene/Lucene-Solr-Tests-8.8/solr/build/solr-core/test/J3/temp/solr.cloud.api.collections.ShardSplitTest_A4CFB4BD235B78CF-001/control-001/cores
   [junit4]   2> 1637325 DEBUG (TEST-ShardSplitTest.testSplitStaticIndexReplicationLink-seed#[A4CFB4BD235B78CF]) [     ] o.a.s.c.c.SolrZkClient Using default ZkCredentialsProvider
   [junit4]   2> 1637326 INFO  (TEST-ShardSplitTest.testSplitStaticIndexReplicationLink-seed#[A4CFB4BD235B78CF]) [     ] o.a.s.c.c.ConnectionManager Waiting for client to connect to ZooKeeper
   [junit4]   2> 1637327 DEBUG (TEST-ShardSplitTest.testSplitStaticIndexReplicationLink-seed#[A4CFB4BD235B78CF]-EventThread) [     ] o.a.s.c.c.SolrZkClient Submitting job to respond to event WatchedEvent state:SyncConnected type:None path:null
   [junit4]   2> 1637327 DEBUG (zkConnectionManagerCallback-14728-thread-1) [     ] o.a.s.c.c.ConnectionManager Watcher org.apache.solr.common.cloud.ConnectionManager@40b682dc name: ZooKeeperConnection Watcher:127.0.0.1:35151/solr got event WatchedEvent state:SyncConnected type:None path:null path: null type: None
   [junit4]   2> 1637327 INFO  (zkConnectionManagerCallback-14728-thread-1) [     ] o.a.s.c.c.ConnectionManager zkClient has connected
   [junit4]   2> 1637327 INFO  (TEST-ShardSplitTest.testSplitStaticIndexReplicationLink-seed#[A4CFB4BD235B78CF]) [     ] o.a.s.c.c.ConnectionManager Client is connected to ZooKeeper
   [junit4]   2> 1637327 DEBUG (TEST-ShardSplitTest.testSplitStaticIndexReplicationLink-seed#[A4CFB4BD235B78CF]) [     ] o.a.s.c.c.SolrZkClient Using default ZkACLProvider
   [junit4]   2> 1637327 DEBUG (TEST-ShardSplitTest.testSplitStaticIndexReplicationLink-seed#[A4CFB4BD235B78CF]) [     ] o.a.s.c.c.ZkStateReader Updating cluster state from ZooKeeper... 
   [junit4]   2> 1637328 DEBUG (TEST-ShardSplitTest.testSplitStaticIndexReplicationLink-seed#[A4CFB4BD235B78CF]) [     ] o.a.s.c.c.ZkStateReader Loaded cluster properties: {legacyCloud=true}
   [junit4]   2> 1637329 INFO  (TEST-ShardSplitTest.testSplitStaticIndexReplicationLink-seed#[A4CFB4BD235B78CF]) [     ] o.a.s.c.c.ZkStateReader Updated live nodes from ZooKeeper... (0) -> (1)
   [junit4]   2> 1637329 DEBUG (TEST-ShardSplitTest.testSplitStaticIndexReplicationLink-seed#[A4CFB4BD235B78CF]) [     ] o.a.s.c.c.ZkStateReader Updated live nodes from ZooKeeper... [] -> [127.0.0.1:41179_]
   [junit4]   2> 1637329 DEBUG (TEST-ShardSplitTest.testSplitStaticIndexReplicationLink-seed#[A4CFB4BD235B78CF]) [     ] o.a.s.c.c.ZkStateReader clusterStateSet: legacy [0] interesting [0] watched [0] lazy [2] total [2]
   [junit4]   2> 1637329 DEBUG (TEST-ShardSplitTest.testSplitStaticIndexReplicationLink-seed#[A4CFB4BD235B78CF]) [     ] o.a.s.c.c.ZkStateReader$AliasesManager Checking ZK for most up to date Aliases /aliases.json
   [junit4]   2> 1637330 DEBUG (TEST-ShardSplitTest.testSplitStaticIndexReplicationLink-seed#[A4CFB4BD235B78CF]) [     ] o.a.s.c.c.ZkStateReader$AliasesManager Aliases: cmp=-1, new definition is: Aliases{collectionAliases={}, collectionAliasProperties={}, zNodeVersion=0}
   [junit4]   2> 1637330 INFO  (TEST-ShardSplitTest.testSplitStaticIndexReplicationLink-seed#[A4CFB4BD235B78CF]) [     ] o.a.s.c.s.i.ZkClientClusterStateProvider Cluster at 127.0.0.1:35151/solr ready
   [junit4]   2> 1637336 DEBUG (TEST-ShardSplitTest.testSplitStaticIndexReplicationLink-seed#[A4CFB4BD235B78CF]-EventThread) [     ] o.a.s.c.c.SolrZkClient Submitting job to respond to event WatchedEvent state:SyncConnected type:NodeChildrenChanged path:/overseer/collection-queue-work
   [junit4]   2> 1637337 DEBUG (TEST-ShardSplitTest.testSplitStaticIndexReplicationLink-seed#[A4CFB4BD235B78CF]-EventThread) [     ] o.a.s.c.c.SolrZkClient Submitting job to respond to event WatchedEvent state:SyncConnected type:NodeChildrenChanged path:/overseer/collection-queue-work
   [junit4]   2> 1637338 DEBUG (OverseerCollectionConfigSetProcessor-72831616433127428-127.0.0.1:41179_-n_0000000000) [n:127.0.0.1:41179_     ] o.a.s.c.OverseerTaskProcessor Got 1 tasks from work-queue : [[org.apache.solr.cloud.OverseerTaskQueue$QueueEvent@2e684ecf]]
   [junit4]   2> 1637338 DEBUG (OverseerCollectionConfigSetProcessor-72831616433127428-127.0.0.1:41179_-n_0000000000) [n:127.0.0.1:41179_     ] o.a.s.c.OverseerTaskProcessor Marked task [/overseer/collection-queue-work/qn-0000000000] as running
   [junit4]   2> 1637338 DEBUG (OverseerCollectionConfigSetProcessor-72831616433127428-127.0.0.1:41179_-n_0000000000) [n:127.0.0.1:41179_     ] o.a.s.c.OverseerTaskProcessor Overseer Collection Message Handler: Get the message id: /overseer/collection-queue-work/qn-0000000000 message: {
   [junit4]   2>   "name":"control_collection",
   [junit4]   2>   "fromApi":"true",
   [junit4]   2>   "collection.configName":"conf1",
   [junit4]   2>   "numShards":"1",
   [junit4]   2>   "createNodeSet":"127.0.0.1:41179_",
   [junit4]   2>   "nrtReplicas":"1",
   [junit4]   2>   "stateFormat":"2",
   [junit4]   2>   "replicationFactor":"1",
   [junit4]   2>   "operation":"create"}
   [junit4]   2> 1637339 DEBUG (OverseerThreadFactory-14718-thread-1-processing-n:127.0.0.1:41179_) [n:127.0.0.1:41179_     ] o.a.s.c.OverseerTaskProcessor Runner processing /overseer/collection-queue-work/qn-0000000000
   [junit4]   2> 1637339 DEBUG (OverseerCollectionConfigSetProcessor-72831616433127428-127.0.0.1:41179_-n_0000000000) [n:127.0.0.1:41179_     ] o.a.s.c.OverseerTaskProcessor Cleaning up work-queue. #Running tasks: 1 #Completed tasks: 0
   [junit4]   2> 1637340 DEBUG (OverseerCollectionConfigSetProcessor-72831616433127428-127.0.0.1:41179_-n_0000000000) [n:127.0.0.1:41179_     ] o.a.s.c.OverseerTaskProcessor RunningTasks: [/overseer/collection-queue-work/qn-0000000000]
   [junit4]   2> 1637340 DEBUG (OverseerCollectionConfigSetProcessor-72831616433127428-127.0.0.1:41179_-n_0000000000) [n:127.0.0.1:41179_     ] o.a.s.c.OverseerTaskProcessor BlockedTasks: []
   [junit4]   2> 1637340 DEBUG (OverseerCollectionConfigSetProcessor-72831616433127428-127.0.0.1:41179_-n_0000000000) [n:127.0.0.1:41179_     ] o.a.s.c.OverseerTaskProcessor CompletedTasks: []
   [junit4]   2> 1637340 INFO  (OverseerCollectionConfigSetProcessor-72831616433127428-127.0.0.1:41179_-n_0000000000) [n:127.0.0.1:41179_     ] o.a.s.c.OverseerTaskProcessor RunningZKTasks: [/overseer/collection-queue-work/qn-0000000000]
   [junit4]   2> 1637340 DEBUG (OverseerThreadFactory-14718-thread-1-processing-n:127.0.0.1:41179_) [n:127.0.0.1:41179_     ] o.a.s.c.a.c.OverseerCollectionMessageHandler OverseerCollectionMessageHandler.processMessage : create , {
   [junit4]   2>   "name":"control_collection",
   [junit4]   2>   "fromApi":"true",
   [junit4]   2>   "collection.configName":"conf1",
   [junit4]   2>   "numShards":"1",
   [junit4]   2>   "createNodeSet":"127.0.0.1:41179_",
   [junit4]   2>   "nrtReplicas":"1",
   [junit4]   2>   "stateFormat":"2",
   [junit4]   2>   "replicationFactor":"1",
   [junit4]   2>   "operation":"create"}
   [junit4]   2> 1637340 DEBUG (OverseerThreadFactory-14718-thread-1-processing-n:127.0.0.1:41179_) [n:127.0.0.1:41179_     ] o.a.s.c.c.ZkStateReader$AliasesManager Checking ZK for most up to date Aliases /aliases.json
   [junit4]   2> 1637340 DEBUG (OverseerThreadFactory-14718-thread-1-processing-n:127.0.0.1:41179_) [n:127.0.0.1:41179_     ] o.a.s.c.c.ZkStateReader$AliasesManager Aliases: cmp=0, not overwriting ZK version.
   [junit4]   2> 1637340 INFO  (OverseerThreadFactory-14718-thread-1-processing-n:127.0.0.1:41179_) [n:127.0.0.1:41179_     ] o.a.s.c.a.c.CreateCollectionCmd Create collection control_collection
   [junit4]   2> 1637341 DEBUG (OverseerThreadFactory-14718-thread-1-processing-n:127.0.0.1:41179_) [n:127.0.0.1:41179_     ] o.a.s.c.a.c.OverseerCollectionMessageHandler creating collections conf node /collections/control_collection 
   [junit4]   2> 1637342 DEBUG (OverseerThreadFactory-14718-thread-1-processing-n:127.0.0.1:41179_) [n:127.0.0.1:41179_     ] o.a.s.c.a.c.CreateCollectionCmd Check for collection zkNode: control_collection
   [junit4]   2> 1637343 DEBUG (OverseerThreadFactory-14718-thread-1-processing-n:127.0.0.1:41179_) [n:127.0.0.1:41179_     ] o.a.s.c.a.c.CreateCollectionCmd Collection zkNode exists
   [junit4]   2> 1637344 DEBUG (TEST-ShardSplitTest.testSplitStaticIndexReplicationLink-seed#[A4CFB4BD235B78CF]-EventThread) [     ] o.a.s.c.c.SolrZkClient Submitting job to respond to event WatchedEvent state:SyncConnected type:NodeChildrenChanged path:/overseer/queue
   [junit4]   2> 1637344 DEBUG (OverseerStateUpdate-72831616433127428-127.0.0.1:41179_-n_0000000000) [n:127.0.0.1:41179_     ] o.a.s.c.Overseer processMessage: queueSize: 1, message = {
   [junit4]   2>   "name":"control_collection",
   [junit4]   2>   "fromApi":"true",
   [junit4]   2>   "collection.configName":"conf1",
   [junit4]   2>   "numShards":"1",
   [junit4]   2>   "createNodeSet":"127.0.0.1:41179_",
   [junit4]   2>   "nrtReplicas":"1",
   [junit4]   2>   "stateFormat":"2",
   [junit4]   2>   "replicationFactor":"1",
   [junit4]   2>   "operation":"create"} current state version: 0
   [junit4]   2> 1637344 DEBUG (OverseerStateUpdate-72831616433127428-127.0.0.1:41179_-n_0000000000) [n:127.0.0.1:41179_     ] o.a.s.c.o.ClusterStateMutator building a new cName: control_collection
   [junit4]   2> 1637346 DEBUG (OverseerStateUpdate-72831616433127428-127.0.0.1:41179_-n_0000000000) [n:127.0.0.1:41179_     ] o.a.s.c.o.ZkStateWriter going to create_collection /collections/control_collection/state.json
   [junit4]   2> 1637347 DEBUG (TEST-ShardSplitTest.testSplitStaticIndexReplicationLink-seed#[A4CFB4BD235B78CF]-EventThread) [     ] o.a.s.c.c.SolrZkClient Submitting job to respond to event WatchedEvent state:SyncConnected type:NodeChildrenChanged path:/overseer/queue
   [junit4]   2> 1637446 DEBUG (OverseerThreadFactory-14718-thread-1-processing-n:127.0.0.1:41179_) [n:127.0.0.1:41179_     ] o.a.s.c.a.c.CreateCollectionCmd Creating SolrCores for new collection control_collection, shardNames [shard1] , message : {
   [junit4]   2>   "name":"control_collection",
   [junit4]   2>   "fromApi":"true",
   [junit4]   2>   "collection.configName":"conf1",
   [junit4]   2>   "numShards":"1",
   [junit4]   2>   "createNodeSet":"127.0.0.1:41179_",
   [junit4]   2>   "nrtReplicas":"1",
   [junit4]   2>   "stateFormat":"2",
   [junit4]   2>   "replicationFactor":"1",
   [junit4]   2>   "operation":"create"}
   [junit4]   2> 1637448 DEBUG (OverseerThreadFactory-14718-thread-1-processing-n:127.0.0.1:41179_) [n:127.0.0.1:41179_     ] o.a.s.c.a.c.CreateCollectionCmd Creating core control_collection_shard1_replica_n1 as part of shard shard1 of collection control_collection on 127.0.0.1:41179_
   [junit4]   2> 1637449 INFO  (qtp448280280-23441) [n:127.0.0.1:41179_    x:control_collection_shard1_replica_n1 ] o.a.s.h.a.CoreAdminOperation core create command qt=/admin/cores&collection.configName=conf1&newCollection=true&name=control_collection_shard1_replica_n1&action=CREATE&numShards=1&collection=control_collection&shard=shard1&wt=javabin&version=2&replicaType=NRT
   [junit4]   2> 1637449 INFO  (qtp448280280-23441) [n:127.0.0.1:41179_    x:control_collection_shard1_replica_n1 ] o.a.s.c.TransientSolrCoreCacheDefault Allocating transient cache for 4 transient cores
   [junit4]   2> 1637452 DEBUG (TEST-ShardSplitTest.testSplitStaticIndexReplicationLink-seed#[A4CFB4BD235B78CF]-EventThread) [     ] o.a.s.c.c.SolrZkClient Submitting job to respond to event WatchedEvent state:SyncConnected type:NodeChildrenChanged path:/overseer/queue
   [junit4]   2> 1637452 DEBUG (OverseerStateUpdate-72831616433127428-127.0.0.1:41179_-n_0000000000) [n:127.0.0.1:41179_     ] o.a.s.c.Overseer processMessage: queueSize: 1, message = {
   [junit4]   2>   "core":"control_collection_shard1_replica_n1",
   [junit4]   2>   "roles":null,
   [junit4]   2>   "node_name":"127.0.0.1:41179_",
   [junit4]   2>   "numShards":"1",
   [junit4]   2>   "state":"down",
   [junit4]   2>   "shard":"shard1",
   [junit4]   2>   "collection":"control_collection",
   [junit4]   2>   "type":"NRT",
   [junit4]   2>   "operation":"state"} current state version: 0
   [junit4]   2> 1637452 DEBUG (OverseerStateUpdate-72831616433127428-127.0.0.1:41179_-n_0000000000) [n:127.0.0.1:41179_     ] o.a.s.c.o.ReplicaMutator Update state numShards=1 message={
   [junit4]   2>   "core":"control_collection_shard1_replica_n1",
   [junit4]   2>   "roles":null,
   [junit4]   2>   "node_name":"127.0.0.1:41179_",
   [junit4]   2>   "numShards":"1",
   [junit4]   2>   "state":"down",
   [junit4]   2>   "shard":"shard1",
   [junit4]   2>   "collection":"control_collection",
   [junit4]   2>   "type":"NRT",
   [junit4]   2>   "operation":"state"}
   [junit4]   2> 1637453 DEBUG (OverseerStateUpdate-72831616433127428-127.0.0.1:41179_-n_0000000000) [n:127.0.0.1:41179_     ] o.a.s.c.o.ReplicaMutator Will update state for replica: core_node2:{
   [junit4]   2>   "core":"control_collection_shard1_replica_n1",
   [junit4]   2>   "node_name":"127.0.0.1:41179_",
   [junit4]   2>   "state":"down",
   [junit4]   2>   "type":"NRT",
   [junit4]   2>   "base_url":"http://127.0.0.1:41179"}
   [junit4]   2> 1637453 DEBUG (OverseerStateUpdate-72831616433127428-127.0.0.1:41179_-n_0000000000) [n:127.0.0.1:41179_     ] o.a.s.c.o.ReplicaMutator Collection is now: DocCollection(control_collection//collections/control_collection/state.json/0 )={
   [junit4]   2>   "pullReplicas":"0",
   [junit4]   2>   "replicationFactor":"1",
   [junit4]   2>   "router":{"name":"compositeId"},
   [junit4]   2>   "maxShardsPerNode":"1",
   [junit4]   2>   "autoAddReplicas":"false",
   [junit4]   2>   "nrtReplicas":"1",
   [junit4]   2>   "tlogReplicas":"0",
   [junit4]   2>   "shards":{"shard1":{
   [junit4]   2>       "range":"80000000-7fffffff",
   [junit4]   2>       "state":"active",
   [junit4]   2>       "replicas":{"core_node2":{
   [junit4]   2>           "core":"control_collection_shard1_replica_n1",
   [junit4]   2>           "node_name":"127.0.0.1:41179_",
   [junit4]   2>           "state":"down",
   [junit4]   2>           "type":"NRT"}}}}}
   [junit4]   2> 1637554 DEBUG (OverseerStateUpdate-72831616433127428-127.0.0.1:41179_-n_0000000000) [n:127.0.0.1:41179_     ] o.a.s.c.o.ZkStateWriter going to update_collection /collections/control_collection/state.json version: 0
   [junit4]   2> 1637555 DEBUG (TEST-ShardSplitTest.testSplitStaticIndexReplicationLink-seed#[A4CFB4BD235B78CF]-EventThread) [     ] o.a.s.c.c.SolrZkClient Submitting job to respond to event WatchedEvent state:SyncConnected type:NodeChildrenChanged path:/overseer/queue
   [junit4]   2> 1638455 DEBUG (qtp448280280-23441) [n:127.0.0.1:41179_ c:control_collection s:shard1  x:control_collection_shard1_replica_n1 ] o.a.s.c.c.ZkStateReader Loading collection config from: [/collections/control_collection]
   [junit4]   2> 1638463 INFO  (qtp448280280-23441) [n:127.0.0.1:41179_ c:control_collection s:shard1  x:control_collection_shard1_replica_n1 ] o.a.s.c.SolrConfig Using Lucene MatchVersion: 8.8.0
   [junit4]   2> 1638475 INFO  (qtp448280280-23441) [n:127.0.0.1:41179_ c:control_collection s:shard1  x:control_collection_shard1_replica_n1 ] o.a.s.s.IndexSchema Schema name=test
   [junit4]   2> 1638479 INFO  (qtp448280280-23441) [n:127.0.0.1:41179_ c:control_collection s:shard1  x:control_collection_shard1_replica_n1 ] o.a.s.s.IndexSchema Loaded schema test/1.6 with uniqueid field id
   [junit4]   2> 1638497 INFO  (qtp448280280-23441) [n:127.0.0.1:41179_ c:control_collection s:shard1  x:control_collection_shard1_replica_n1 ] o.a.s.c.CoreContainer Creating SolrCore 'control_collection_shard1_replica_n1' using configuration from configset conf1, trusted=true
   [junit4]   2> 1638497 INFO  (qtp448280280-23441) [n:127.0.0.1:41179_ c:control_collection s:shard1  x:control_collection_shard1_replica_n1 ] o.a.s.m.r.SolrJmxReporter JMX monitoring for 'solr.core.control_collection.shard1.replica_n1' (registry 'solr.core.control_collection.shard1.replica_n1') enabled at server: com.sun.jmx.mbeanserver.JmxMBeanServer@f90f437
   [junit4]   2> 1638497 INFO  (qtp448280280-23441) [n:127.0.0.1:41179_ c:control_collection s:shard1  x:control_collection_shard1_replica_n1 ] o.a.s.c.SolrCore [[control_collection_shard1_replica_n1] ] Opening new SolrCore at [/home/jenkins/jenkins-slave/workspace/Lucene/Lucene-Solr-Tests-8.8/solr/build/solr-core/test/J3/temp/solr.cloud.api.collections.ShardSplitTest_A4CFB4BD235B78CF-001/control-001/cores/control_collection_shard1_replica_n1], dataDir=[/home/jenkins/jenkins-slave/workspace/Lucene/Lucene-Solr-Tests-8.8/solr/build/solr-core/test/J3/temp/solr.cloud.api.collections.ShardSplitTest_A4CFB4BD235B78CF-001/control-001/cores/control_collection_shard1_replica_n1/data/]
   [junit4]   2> 1638500 INFO  (qtp448280280-23441) [n:127.0.0.1:41179_ c:control_collection s:shard1  x:control_collection_shard1_replica_n1 ] o.a.s.u.RandomMergePolicy RandomMergePolicy wrapping class org.apache.lucene.index.TieredMergePolicy: [TieredMergePolicy: maxMergeAtOnce=12, maxMergeAtOnceExplicit=37, maxMergedSegmentMB=106.236328125, floorSegmentMB=1.427734375, forceMergeDeletesPctAllowed=23.57255253472003, segmentsPerTier=44.0, maxCFSSegmentSizeMB=8.796093022207999E12, noCFSRatio=0.0, deletesPctAllowed=37.86078560294408
   [junit4]   2> 1638508 WARN  (qtp448280280-23441) [n:127.0.0.1:41179_ c:control_collection s:shard1  x:control_collection_shard1_replica_n1 ] o.a.s.c.RequestHandlers INVALID paramSet a in requestHandler {type = requestHandler,name = /dump,class = DumpRequestHandler,attributes = {initParams=a, name=/dump, class=DumpRequestHandler},args = {defaults={a=A,b=B}}}
   [junit4]   2> 1638552 INFO  (qtp448280280-23441) [n:127.0.0.1:41179_ c:control_collection s:shard1  x:control_collection_shard1_replica_n1 ] o.a.s.u.UpdateHandler Using UpdateLog implementation: org.apache.solr.update.UpdateLog
   [junit4]   2> 1638552 INFO  (qtp448280280-23441) [n:127.0.0.1:41179_ c:control_collection s:shard1  x:control_collection_shard1_replica_n1 ] o.a.s.u.UpdateLog Initializing UpdateLog: dataDir= defaultSyncLevel=FLUSH numRecordsToKeep=100 maxNumLogsToKeep=10 numVersionBuckets=65536
   [junit4]   2> 1638553 INFO  (qtp448280280-23441) [n:127.0.0.1:41179_ c:control_collection s:shard1  x:control_collection_shard1_replica_n1 ] o.a.s.u.CommitTracker Hard AutoCommit: disabled
   [junit4]   2> 1638554 INFO  (qtp448280280-23441) [n:127.0.0.1:41179_ c:control_collection s:shard1  x:control_collection_shard1_replica_n1 ] o.a.s.u.CommitTracker Soft AutoCommit: disabled
   [junit4]   2> 1638555 INFO  (qtp448280280-23441) [n:127.0.0.1:41179_ c:control_collection s:shard1  x:control_collection_shard1_replica_n1 ] o.a.s.u.RandomMergePolicy RandomMergePolicy wrapping class org.apache.lucene.index.LogDocMergePolicy: [LogDocMergePolicy: minMergeSize=1000, mergeFactor=37, maxMergeSize=9223372036854775807, maxMergeSizeForForcedMerge=9223372036854775807, calibrateSizeByDeletes=true, maxMergeDocs=2147483647, maxCFSSegmentSizeMB=8.796093022207999E12, noCFSRatio=0.6576588552771793]
   [junit4]   2> 1638557 DEBUG (qtp448280280-23441) [n:127.0.0.1:41179_ c:control_collection s:shard1  x:control_collection_shard1_replica_n1 ] o.a.s.c.c.ZkStateReader Loading collection config from: [/collections/control_collection]
   [junit4]   2> 1638558 INFO  (qtp448280280-23441) [n:127.0.0.1:41179_ c:control_collection s:shard1  x:control_collection_shard1_replica_n1 ] o.a.s.r.ManagedResourceStorage Configured ZooKeeperStorageIO with znodeBase: /configs/conf1
   [junit4]   2> 1638558 INFO  (qtp448280280-23441) [n:127.0.0.1:41179_ c:control_collection s:shard1  x:control_collection_shard1_replica_n1 ] o.a.s.r.ManagedResourceStorage Loaded null at path _rest_managed.json using ZooKeeperStorageIO:path=/configs/conf1
   [junit4]   2> 1638559 INFO  (qtp448280280-23441) [n:127.0.0.1:41179_ c:control_collection s:shard1  x:control_collection_shard1_replica_n1 ] o.a.s.h.ReplicationHandler Commits will be reserved for 10000 ms
   [junit4]   2> 1638559 INFO  (qtp448280280-23441) [n:127.0.0.1:41179_ c:control_collection s:shard1  x:control_collection_shard1_replica_n1 ] o.a.s.u.UpdateLog Could not find max version in index or recent updates, using new clock 1689008947206291456
   [junit4]   2> 1638561 INFO  (qtp448280280-23441) [n:127.0.0.1:41179_ c:control_collection s:shard1  x:control_collection_shard1_replica_n1 ] o.a.s.c.c.ZkStateReader already watching , added to stateWatchers
   [junit4]   2> 1638562 DEBUG (qtp448280280-23441) [n:127.0.0.1:41179_ c:control_collection s:shard1  x:control_collection_shard1_replica_n1 ] o.a.s.c.c.ZkStateReader Add data for [control_collection] ver [1]
   [junit4]   2> 1638562 DEBUG (qtp448280280-23441) [n:127.0.0.1:41179_ c:control_collection s:shard1  x:control_collection_shard1_replica_n1 ] o.a.s.c.c.ZkStateReader clusterStateSet: legacy [0] interesting [1] watched [1] lazy [2] total [2]
   [junit4]   2> 1638562 DEBUG (qtp448280280-23441) [n:127.0.0.1:41179_ c:control_collection s:shard1  x:control_collection_shard1_replica_n1 ] o.a.s.c.c.ZkStateReader updated per-replica states changed for: control_collection, ver: 0 , new vals: []
   [junit4]   2> 1638562 DEBUG (watches-14712-thread-1-processing-n:127.0.0.1:41179_ x:control_collection_shard1_replica_n1 c:control_collection s:shard1) [n:127.0.0.1:41179_ c:control_collection s:shard1  x:control_collection_shard1_replica_n1 ] o.a.s.c.c.ZkStateReader clusterStateSet: legacy [0] interesting [0] watched [0] lazy [2] total [2]
   [junit4]   2> 1638562 INFO  (searcherExecutor-14730-thread-1-processing-n:127.0.0.1:41179_ x:control_collection_shard1_replica_n1 c:control_collection s:shard1) [n:127.0.0.1:41179_ c:control_collection s:shard1  x:control_collection_shard1_replica_n1 ] o.a.s.c.SolrCore [control_collection_shard1_replica_n1]  Registered new searcher autowarm time: 0 ms
   [junit4]   2> 1638562 DEBUG (qtp448280280-23441) [n:127.0.0.1:41179_ c:control_collection s:shard1  x:control_collection_shard1_replica_n1 ] o.a.s.c.c.ZkStateReader Removing uninteresting collection [control_collection]
   [junit4]   2> 1638562 DEBUG (qtp448280280-23441) [n:127.0.0.1:41179_ c:control_collection s:shard1  x:control_collection_shard1_replica_n1 ] o.a.s.c.c.ZkStateReader clusterStateSet: legacy [0] interesting [0] watched [0] lazy [2] total [2]
   [junit4]   2> 1638564 DEBUG (qtp448280280-23441) [n:127.0.0.1:41179_ c:control_collection s:shard1  x:control_collection_shard1_replica_n1 ] o.a.s.c.c.SolrZkClient makePath: /collections/control_collection/terms/shard1
   [junit4]   2> 1638566 DEBUG (TEST-ShardSplitTest.testSplitStaticIndexReplicationLink-seed#[A4CFB4BD235B78CF]-EventThread) [     ] o.a.s.c.c.SolrZkClient Submitting job to respond to event WatchedEvent state:SyncConnected type:NodeDataChanged path:/collections/control_collection/terms/shard1
   [junit4]   2> 1638566 INFO  (qtp448280280-23441) [n:127.0.0.1:41179_ c:control_collection s:shard1  x:control_collection_shard1_replica_n1 ] o.a.s.c.ZkShardTerms Successful update of terms at /collections/control_collection/terms/shard1 to Terms{values={core_node2=0}, version=0}
   [junit4]   2> 1638566 INFO  (qtp448280280-23441) [n:127.0.0.1:41179_ c:control_collection s:shard1  x:control_collection_shard1_replica_n1 ] o.a.s.c.ShardLeaderElectionContextBase make sure parent is created /collections/control_collection/leaders/shard1
   [junit4]   2> 1638566 DEBUG (qtp448280280-23441) [n:127.0.0.1:41179_ c:control_collection s:shard1  x:control_collection_shard1_replica_n1 ] o.a.s.c.c.SolrZkClient makePath: /collections/control_collection/leaders/shard1
   [junit4]   2> 1638567 DEBUG (qtp448280280-23441) [n:127.0.0.1:41179_ c:control_collection s:shard1  x:control_collection_shard1_replica_n1 ] o.a.s.c.c.SolrZkClient makePath: /collections/control_collection/leader_elect/shard1/election
   [junit4]   2> 1638570 INFO  (qtp448280280-23441) [n:127.0.0.1:41179_ c:control_collection s:shard1  x:control_collection_shard1_replica_n1 ] o.a.s.c.ShardLeaderElectionContext Enough replicas found to continue.
   [junit4]   2> 1638570 INFO  (qtp448280280-23441) [n:127.0.0.1:41179_ c:control_collection s:shard1  x:control_collection_shard1_replica_n1 ] o.a.s.c.ShardLeaderElectionContext I may be the new leader - try and sync
   [junit4]   2> 1638570 INFO  (qtp448280280-23441) [n:127.0.0.1:41179_ c:control_collection s:shard1  x:control_collection_shard1_replica_n1 ] o.a.s.c.SyncStrategy Sync replicas to http://127.0.0.1:41179/control_collection_shard1_replica_n1/
   [junit4]   2> 1638570 INFO  (qtp448280280-23441) [n:127.0.0.1:41179_ c:control_collection s:shard1  x:control_collection_shard1_replica_n1 ] o.a.s.c.SyncStrategy Sync Success - now sync replicas to me
   [junit4]   2> 1638571 INFO  (qtp448280280-23441) [n:127.0.0.1:41179_ c:control_collection s:shard1  x:control_collection_shard1_replica_n1 ] o.a.s.c.SyncStrategy http://127.0.0.1:41179/control_collection_shard1_replica_n1/ has no replicas
   [junit4]   2> 1638571 INFO  (qtp448280280-23441) [n:127.0.0.1:41179_ c:control_collection s:shard1  x:control_collection_shard1_replica_n1 ] o.a.s.c.ShardLeaderElectionContextBase Creating leader registration node /collections/control_collection/leaders/shard1/leader after winning as /collections/control_collection/leader_elect/shard1/election/72831616433127428-core_node2-n_0000000000
   [junit4]   2> 1638573 DEBUG (TEST-ShardSplitTest.testSplitStaticIndexReplicationLink-seed#[A4CFB4BD235B78CF]-EventThread) [     ] o.a.s.c.c.SolrZkClient Submitting job to respond to event WatchedEvent state:SyncConnected type:NodeChildrenChanged path:/overseer/queue
   [junit4]   2> 1638573 INFO  (qtp448280280-23441) [n:127.0.0.1:41179_ c:control_collection s:shard1  x:control_collection_shard1_replica_n1 ] o.a.s.c.ShardLeaderElectionContext I am the new leader: http://127.0.0.1:41179/control_collection_shard1_replica_n1/ shard1
   [junit4]   2> 1638573 INFO  (qtp448280280-23441) [n:127.0.0.1:41179_ c:control_collection s:shard1  x:control_collection_shard1_replica_n1 ] o.a.s.c.c.ZkStateReader already watching , added to stateWatchers
   [junit4]   2> 1638573 DEBUG (OverseerStateUpdate-72831616433127428-127.0.0.1:41179_-n_0000000000) [n:127.0.0.1:41179_     ] o.a.s.c.Overseer processMessage: queueSize: 1, message = {
   [junit4]   2>   "operation":"leader",
   [junit4]   2>   "shard":"shard1",
   [junit4]   2>   "collection":"control_collection",
   [junit4]   2>   "node_name":"127.0.0.1:41179_",
   [junit4]   2>   "core":"control_collection_shard1_replica_n1",
   [junit4]   2>   "state":"active"} current state version: 0
   [junit4]   2> 1638574 DEBUG (qtp448280280-23441) [n:127.0.0.1:41179_ c:control_collection s:shard1  x:control_collection_shard1_replica_n1 ] o.a.s.c.c.ZkStateReader Add data for [control_collection] ver [1]
   [junit4]   2> 1638574 DEBUG (qtp448280280-23441) [n:127.0.0.1:41179_ c:control_collection s:shard1  x:control_collection_shard1_replica_n1 ] o.a.s.c.c.ZkStateReader clusterStateSet: legacy [0] interesting [1] watched [1] lazy [2] total [2]
   [junit4]   2> 1638574 DEBUG (qtp448280280-23441) [n:127.0.0.1:41179_ c:control_collection s:shard1  x:control_collection_shard1_replica_n1 ] o.a.s.c.c.ZkStateReader updated per-replica states changed for: control_collection, ver: 0 , new vals: []
   [junit4]   2> 1638574 DEBUG (watches-14712-thread-1-processing-n:127.0.0.1:41179_ x:control_collection_shard1_replica_n1 c:control_collection s:shard1) [n:127.0.0.1:41179_ c:control_collection s:shard1  x:control_collection_shard1_replica_n1 ] o.a.s.c.c.ZkStateReader  CollectionStatePredicate failed for control_collection, cversion : -1
   [junit4]   2> 1638574 DEBUG (qtp448280280-23441) [n:127.0.0.1:41179_ c:control_collection s:shard1  x:control_collection_shard1_replica_n1 ] o.a.s.c.c.ZkStateReader clusterStateSet: legacy [0] interesting [1] watched [1] lazy [2] total [2]
   [junit4]   2> 1638574 DEBUG (qtp448280280-23441) [n:127.0.0.1:41179_ c:control_collection s:shard1  x:control_collection_shard1_replica_n1 ] o.a.s.c.c.ZkStateReader  CollectionStatePredicate failed for control_collection, cversion : -1
   [junit4]   2> 1638574 DEBUG (watches-14712-thread-1-processing-n:127.0.0.1:41179_ x:control_collection_shard1_replica_n1 c:control_collection s:shard1) [n:127.0.0.1:41179_ c:control_collection s:shard1  x:control_collection_shard1_replica_n1 ] o.a.s.c.c.ZkStateReader  CollectionStatePredicate failed for control_collection, cversion : -1
   [junit4]   2> 1638574 DEBUG (qtp448280280-23441) [n:127.0.0.1:41179_ c:control_collection s:shard1  x:control_collection_shard1_replica_n1 ] o.a.s.c.c.ZkStateReader  CollectionStatePredicate failed for control_collection, cversion : -1
   [junit4]   2> 1638574 DEBUG (qtp448280280-23441) [n:127.0.0.1:41179_ c:control_collection s:shard1  x:control_collection_shard1_replica_n1 ] o.a.s.c.c.ZkStateReader  CollectionStatePredicate failed for control_collection, cversion : -1
   [junit4]   2> 1638674 DEBUG (OverseerStateUpdate-72831616433127428-127.0.0.1:41179_-n_0000000000) [n:127.0.0.1:41179_     ] o.a.s.c.o.ZkStateWriter going to update_collection /collections/control_collection/state.json version: 1
   [junit4]   2> 1638675 DEBUG (TEST-ShardSplitTest.testSplitStaticIndexReplicationLink-seed#[A4CFB4BD235B78CF]-EventThread) [     ] o.a.s.c.c.SolrZkClient Submitting job to respond to event WatchedEvent state:SyncConnected type:NodeDataChanged path:/collections/control_collection/state.json
   [junit4]   2> 1638675 DEBUG (TEST-ShardSplitTest.testSplitStaticIndexReplicationLink-seed#[A4CFB4BD235B78CF]-EventThread) [     ] o.a.s.c.c.SolrZkClient Submitting job to respond to event WatchedEvent state:SyncConnected type:NodeDataChanged path:/collections/control_collection/state.json
   [junit4]   2> 1638675 INFO  (zkCallback-14710-thread-1) [     ] o.a.s.c.c.ZkStateReader A cluster state change: [WatchedEvent state:SyncConnected type:NodeDataChanged path:/collections/control_collection/state.json] for collection [control_collection] has occurred - updating... (live nodes size: [1])
   [junit4]   2> 1638675 INFO  (zkCallback-14710-thread-2) [     ] o.a.s.c.c.ZkStateReader A cluster state change: [WatchedEvent state:SyncConnected type:NodeDataChanged path:/collections/control_collection/state.json] for collection [control_collection] has occurred - updating... (live nodes size: [1])
   [junit4]   2> 1638675 DEBUG (TEST-ShardSplitTest.testSplitStaticIndexReplicationLink-seed#[A4CFB4BD235B78CF]-EventThread) [     ] o.a.s.c.c.SolrZkClient Submitting job to respond to event WatchedEvent state:SyncConnected type:NodeChildrenChanged path:/overseer/queue
   [junit4]   2> 1638675 DEBUG (zkCallback-14710-thread-1) [     ] o.a.s.c.c.ZkStateReader Updating data for [control_collection] from [1] to [2]
   [junit4]   2> 1638675 DEBUG (zkCallback-14710-thread-1) [     ] o.a.s.c.c.ZkStateReader clusterStateSet: legacy [0] interesting [1] watched [1] lazy [2] total [2]
   [junit4]   2> 1638675 DEBUG (watches-14712-thread-1) [     ] o.a.s.c.c.ZkStateReader leader found for control_collection/shard1 to be core_node2:{
   [junit4]   2>   "core":"control_collection_shard1_replica_n1",
   [junit4]   2>   "leader":"true",
   [junit4]   2>   "node_name":"127.0.0.1:41179_",
   [junit4]   2>   "state":"down",
   [junit4]   2>   "type":"NRT",
   [junit4]   2>   "base_url":"http://127.0.0.1:41179"}
   [junit4]   2> 1638675 DEBUG (watches-14712-thread-1) [     ] o.a.s.c.c.ZkStateReader clusterStateSet: legacy [0] interesting [0] watched [0] lazy [2] total [2]
   [junit4]   2> 1638675 DEBUG (zkCallback-14710-thread-2) [     ] o.a.s.c.c.ZkStateReader Removing uninteresting collection [control_collection]
   [junit4]   2> 1638675 DEBUG (zkCallback-14710-thread-2) [     ] o.a.s.c.c.ZkStateReader clusterStateSet: legacy [0] interesting [0] watched [0] lazy [2] total [2]
   [junit4]   2> 1638676 INFO  (qtp448280280-23441) [n:127.0.0.1:41179_ c:control_collection s:shard1  x:control_collection_shard1_replica_n1 ] o.a.s.c.ZkController I am the leader, no recovery necessary
   [junit4]   2> 1638679 DEBUG (TEST-ShardSplitTest.testSplitStaticIndexReplicationLink-seed#[A4CFB4BD235B78CF]-EventThread) [     ] o.a.s.c.c.SolrZkClient Submitting job to respond to event WatchedEvent state:SyncConnected type:NodeChildrenChanged path:/overseer/queue
   [junit4]   2> 1638679 DEBUG (qtp448280280-23441) [n:127.0.0.1:41179_ c:control_collection s:shard1  x:control_collection_shard1_replica_n1 ] o.a.s.c.c.ZkStateReader Refreshing lazily-loaded state for collection control_collection
   [junit4]   2> 1638679 DEBUG (OverseerStateUpdate-72831616433127428-127.0.0.1:41179_-n_0000000000) [n:127.0.0.1:41179_     ] o.a.s.c.Overseer processMessage: queueSize: 1, message = {
   [junit4]   2>   "core":"control_collection_shard1_replica_n1",
   [junit4]   2>   "core_node_name":"core_node2",
   [junit4]   2>   "roles":null,
   [junit4]   2>   "node_name":"127.0.0.1:41179_",
   [junit4]   2>   "numShards":"1",
   [junit4]   2>   "state":"active",
   [junit4]   2>   "shard":"shard1",
   [junit4]   2>   "collection":"control_collection",
   [junit4]   2>   "type":"NRT",
   [junit4]   2>   "operation":"state"} current state version: 0
   [junit4]   2> 1638679 INFO  (qtp448280280-23441) [n:127.0.0.1:41179_ c:control_collection s:shard1  x:control_collection_shard1_replica_n1 ] o.a.s.c.c.ZkStateReader already watching , added to stateWatchers
   [junit4]   2> 1638679 DEBUG (OverseerStateUpdate-72831616433127428-127.0.0.1:41179_-n_0000000000) [n:127.0.0.1:41179_     ] o.a.s.c.o.ReplicaMutator Update state numShards=1 message={
   [junit4]   2>   "core":"control_collection_shard1_replica_n1",
   [junit4]   2>   "core_node_name":"core_node2",
   [junit4]   2>   "roles":null,
   [junit4]   2>   "node_name":"127.0.0.1:41179_",
   [junit4]   2>   "numShards":"1",
   [junit4]   2>   "state":"active",
   [junit4]   2>   "shard":"shard1",
   [junit4]   2>   "collection":"control_collection",
   [junit4]   2>   "type":"NRT",
   [junit4]   2>   "operation":"state"}
   [junit4]   2> 1638679 DEBUG (OverseerStateUpdate-72831616433127428-127.0.0.1:41179_-n_0000000000) [n:127.0.0.1:41179_     ] o.a.s.c.o.ReplicaMutator Will update state for replica: core_node2:{
   [junit4]   2>   "core":"control_collection_shard1_replica_n1",
   [junit4]   2>   "node_name":"127.0.0.1:41179_",
   [junit4]   2>   "state":"active",
   [junit4]   2>   "type":"NRT",
   [junit4]   2>   "leader":"true",
   [junit4]   2>   "base_url":"http://127.0.0.1:41179"}
   [junit4]   2> 1638679 DEBUG (OverseerStateUpdate-72831616433127428-127.0.0.1:41179_-n_0000000000) [n:127.0.0.1:41179_     ] o.a.s.c.o.ReplicaMutator Collection is now: DocCollection(control_collection//collections/control_collection/state.json/2 )={
   [junit4]   2>   "pullReplicas":"0",
   [junit4]   2>   "replicationFactor":"1",
   [junit4]   2>   "router":{"name":"compositeId"},
   [junit4]   2>   "maxShardsPerNode":"1",
   [junit4]   2>   "autoAddReplicas":"false",
   [junit4]   2>   "nrtReplicas":"1",
   [junit4]   2>   "tlogReplicas":"0",
   [junit4]   2>   "shards":{"shard1":{
   [junit4]   2>       "range":"80000000-7fffffff",
   [junit4]   2>       "state":"active",
   [junit4]   2>       "replicas":{"core_node2":{
   [junit4]   2>           "core":"control_collection_shard1_replica_n1",
   [junit4]   2>           "leader":"true",
   [junit4]   2>           "node_name":"127.0.0.1:41179_",
   [junit4]   2>           "state":"active",
   [junit4]   2>           "type":"NRT"}}}}}
   [junit4]   2> 1638680 DEBUG (qtp448280280-23441) [n:127.0.0.1:41179_ c:control_collection s:shard1  x:control_collection_shard1_replica_n1 ] o.a.s.c.c.ZkStateReader Add data for [control_collection] ver [2]
   [junit4]   2> 1638680 DEBUG (qtp448280280-23441) [n:127.0.0.1:41179_ c:control_collection s:shard1  x:control_collection_shard1_replica_n1 ] o.a.s.c.c.ZkStateReader clusterStateSet: legacy [0] interesting [1] watched [1] lazy [2] total [2]
   [junit4]   2> 1638680 DEBUG (qtp448280280-23441) [n:127.0.0.1:41179_ c:control_collection s:shard1  x:control_collection_shard1_replica_n1 ] o.a.s.c.c.ZkStateReader updated per-replica states changed for: control_collection, ver: 0 , new vals: []
   [junit4]   2> 1638680 DEBUG (qtp448280280-23441) [n:127.0.0.1:41179_ c:control_collection s:shard1  x:control_collection_shard1_replica_n1 ] o.a.s.c.c.ZkStateReader clusterStateSet: legacy [0] interesting [1] watched [1] lazy [2] total [2]
   [junit4]   2> 1638682 INFO  (qtp448280280-23441) [n:127.0.0.1:41179_     ] o.a.s.s.HttpSolrCall [admin] webapp=null path=/admin/cores params={qt=/admin/cores&collection.configName=conf1&newCollection=true&name=control_collection_shard1_replica_n1&action=CREATE&numShards=1&collection=control_collection&shard=shard1&wt=javabin&version=2&replicaType=NRT} status=0 QTime=1232
   [junit4]   2> 1638682 DEBUG (OverseerThreadFactory-14718-thread-1-processing-n:127.0.0.1:41179_) [n:127.0.0.1:41179_     ] o.a.s.c.a.c.CreateCollectionCmd Finished create command on all shards for collection: control_collection
   [junit4]   2> 1638682 DEBUG (OverseerThreadFactory-14718-thread-1-processing-n:127.0.0.1:41179_) [n:127.0.0.1:41179_     ] o.a.s.c.OverseerTaskProcessor Completed task:[/overseer/collection-queue-work/qn-0000000000]
   [junit4]   2> 1638683 DEBUG (TEST-ShardSplitTest.testSplitStaticIndexReplicationLink-seed#[A4CFB4BD235B78CF]-EventThread) [     ] o.a.s.c.c.SolrZkClient Submitting job to respond to event WatchedEvent state:SyncConnected type:NodeDataChanged path:/overseer/collection-queue-work/qnr-0000000000
   [junit4]   2> 1638683 DEBUG (OverseerThreadFactory-14718-thread-1-processing-n:127.0.0.1:41179_) [n:127.0.0.1:41179_     ] o.a.s.c.OverseerTaskProcessor Marked task [/overseer/collection-queue-work/qn-0000000000] as completed.
   [junit4]   2> 1638683 DEBUG (TEST-ShardSplitTest.testSplitStaticIndexReplicationLink-seed#[A4CFB4BD235B78CF]-EventThread) [     ] o.a.s.c.c.SolrZkClient Submitting job to respond to event WatchedEvent state:SyncConnected type:NodeChildrenChanged path:/overseer/collection-queue-work
   [junit4]   2> 1638683 DEBUG (OverseerThreadFactory-14718-thread-1-processing-n:127.0.0.1:41179_) [n:127.0.0.1:41179_     ] o.a.s.c.OverseerTaskProcessor RunningTasks: []
   [junit4]   2> 1638683 DEBUG (OverseerThreadFactory-14718-thread-1-processing-n:127.0.0.1:41179_) [n:127.0.0.1:41179_     ] o.a.s.c.OverseerTaskProcessor BlockedTasks: []
   [junit4]   2> 1638683 DEBUG (OverseerThreadFactory-14718-thread-1-processing-n:127.0.0.1:41179_) [n:127.0.0.1:41179_     ] o.a.s.c.OverseerTaskProcessor CompletedTasks: [/overseer/collection-queue-work/qn-0000000000]
   [junit4]   2> 1638683 INFO  (OverseerThreadFactory-14718-thread-1-processing-n:127.0.0.1:41179_) [n:127.0.0.1:41179_     ] o.a.s.c.OverseerTaskProcessor RunningZKTasks: [/overseer/collection-queue-work/qn-0000000000]
   [junit4]   2> 1638683 DEBUG (OverseerThreadFactory-14718-thread-1-processing-n:127.0.0.1:41179_) [n:127.0.0.1:41179_     ] o.a.s.c.OverseerTaskProcessor Overseer Collection Message Handler: Message id: /overseer/collection-queue-work/qn-0000000000 complete, response: {success={127.0.0.1:41179_={responseHeader={status=0,QTime=1232},core=control_collection_shard1_replica_n1}}}
   [junit4]   2> 1638684 DEBUG (TEST-ShardSplitTest.testSplitStaticIndexReplicationLink-seed#[A4CFB4BD235B78CF]-EventThread) [     ] o.a.s.c.c.SolrZkClient Submitting job to respond to event WatchedEvent state:SyncConnected type:NodeChildrenChanged path:/overseer/collection-queue-work
   [junit4]   2> 1638684 INFO  (qtp448280280-23439) [n:127.0.0.1:41179_     ] o.a.s.h.a.CollectionsHandler Wait for new collection to be active for at most 45 seconds. Check all shard replicas
   [junit4]   2> 1638684 INFO  (qtp448280280-2

[...truncated too long message...]

ng job to respond to event WatchedEvent state:Closed type:None path:null
   [junit4]   2> 1916427 WARN  (ZkTestServer Run Thread) [     ] o.a.s.c.ZkTestServer Watch limit violations: 
   [junit4]   2> Maximum concurrent create/delete watches above limit:
   [junit4]   2> 
   [junit4]   2> 	18	/solr/collections/collection1/state.json
   [junit4]   2> 	14	/solr/collections/testSplitMixedReplicaTypes_link/terms/shard1
   [junit4]   2> 	11	/solr/collections/testSplitMixedReplicaTypes_link/terms/shard1_0
   [junit4]   2> 	7	/solr/aliases.json
   [junit4]   2> 	5	/solr/packages.json
   [junit4]   2> 	5	/solr/security.json
   [junit4]   2> 	5	/solr/configs/conf1
   [junit4]   2> 	5	/solr/collections/collection1/terms/shard1
   [junit4]   2> 	5	/solr/collections/collection1/terms/shard2
   [junit4]   2> 	4	/solr/collections/collection1/collectionprops.json
   [junit4]   2> 	3	/solr/collections/testSplitMixedReplicaTypes_link/terms/shard1_1
   [junit4]   2> 	3	/solr/collections/testSplitMixedReplicaTypes_link/collectionprops.json
   [junit4]   2> 	2	/solr/collections/control_collection/terms/shard1
   [junit4]   2> 
   [junit4]   2> Maximum concurrent data watches above limit:
   [junit4]   2> 
   [junit4]   2> 	224	/solr/collections/testSplitMixedReplicaTypes_link/state.json
   [junit4]   2> 	56	/solr/clusterstate.json
   [junit4]   2> 	12	/solr/collections/control_collection/state.json
   [junit4]   2> 	7	/solr/clusterprops.json
   [junit4]   2> 	3	/solr/overseer_elect/election/72831628481462284-127.0.0.1:37741_-n_0000000001
   [junit4]   2> 
   [junit4]   2> Maximum concurrent children watches above limit:
   [junit4]   2> 
   [junit4]   2> 	97	/solr/overseer/queue
   [junit4]   2> 	33	/solr/live_nodes
   [junit4]   2> 	24	/solr/overseer/collection-queue-work
   [junit4]   2> 	17	/solr/collections/testSplitMixedReplicaTypes_link/state.json
   [junit4]   2> 	13	/solr/collections
   [junit4]   2> 	4	/solr/collections/control_collection/state.json
   [junit4]   2> 
   [junit4]   2> 1916431 INFO  (TEST-ShardSplitTest.testSplitMixedReplicaTypesLink-seed#[A4CFB4BD235B78CF]) [     ] o.a.s.c.ZkTestServer waitForServerDown: 127.0.0.1:39865
   [junit4]   2> 1916431 INFO  (TEST-ShardSplitTest.testSplitMixedReplicaTypesLink-seed#[A4CFB4BD235B78CF]) [     ] o.a.s.c.ZkTestServer parse host and port list: 127.0.0.1:39865
   [junit4]   2> 1916431 INFO  (TEST-ShardSplitTest.testSplitMixedReplicaTypesLink-seed#[A4CFB4BD235B78CF]) [     ] o.a.s.c.ZkTestServer connecting to 127.0.0.1 39865
   [junit4]   2> NOTE: reproduce with: ant test  -Dtestcase=ShardSplitTest -Dtests.method=testSplitMixedReplicaTypesLink -Dtests.seed=A4CFB4BD235B78CF -Dtests.multiplier=2 -Dtests.slow=true -Dtests.locale=en-IE -Dtests.timezone=MET -Dtests.asserts=true -Dtests.file.encoding=US-ASCII
   [junit4] ERROR   96.2s J3 | ShardSplitTest.testSplitMixedReplicaTypesLink <<<
   [junit4]    > Throwable #1: org.apache.solr.client.solrj.impl.HttpSolrClient$RemoteSolrException: Error from server at http://127.0.0.1:32887: ADDREPLICA failed to create replica
   [junit4]    > 	at __randomizedtesting.SeedInfo.seed([A4CFB4BD235B78CF:98A17DE48683D356]:0)
   [junit4]    > 	at org.apache.solr.client.solrj.impl.HttpSolrClient.executeMethod(HttpSolrClient.java:681)
   [junit4]    > 	at org.apache.solr.client.solrj.impl.HttpSolrClient.request(HttpSolrClient.java:266)
   [junit4]    > 	at org.apache.solr.client.solrj.impl.HttpSolrClient.request(HttpSolrClient.java:248)
   [junit4]    > 	at org.apache.solr.client.solrj.impl.LBSolrClient.doRequest(LBSolrClient.java:369)
   [junit4]    > 	at org.apache.solr.client.solrj.impl.LBSolrClient.request(LBSolrClient.java:297)
   [junit4]    > 	at org.apache.solr.client.solrj.impl.BaseCloudSolrClient.sendRequest(BaseCloudSolrClient.java:1171)
   [junit4]    > 	at org.apache.solr.client.solrj.impl.BaseCloudSolrClient.requestWithRetryOnStaleState(BaseCloudSolrClient.java:934)
   [junit4]    > 	at org.apache.solr.client.solrj.impl.BaseCloudSolrClient.request(BaseCloudSolrClient.java:866)
   [junit4]    > 	at org.apache.solr.client.solrj.SolrRequest.process(SolrRequest.java:214)
   [junit4]    > 	at org.apache.solr.client.solrj.SolrRequest.process(SolrRequest.java:231)
   [junit4]    > 	at org.apache.solr.cloud.api.collections.ShardSplitTest.doSplitMixedReplicaTypes(ShardSplitTest.java:379)
   [junit4]    > 	at org.apache.solr.cloud.api.collections.ShardSplitTest.testSplitMixedReplicaTypesLink(ShardSplitTest.java:356)
   [junit4]    > 	at org.apache.solr.BaseDistributedSearchTestCase$ShardsRepeatRule$ShardsFixedStatement.callStatement(BaseDistributedSearchTestCase.java:1090)
   [junit4]    > 	at org.apache.solr.BaseDistributedSearchTestCase$ShardsRepeatRule$ShardsStatement.evaluate(BaseDistributedSearchTestCase.java:1061)
   [junit4]    > 	at java.lang.Thread.run(Thread.java:748)
   [junit4]   2> NOTE: leaving temporary files on disk at: /home/jenkins/jenkins-slave/workspace/Lucene/Lucene-Solr-Tests-8.8/solr/build/solr-core/test/J3/temp/solr.cloud.api.collections.ShardSplitTest_A4CFB4BD235B78CF-001
   [junit4]   2> Jan 16, 2021 2:38:51 AM com.carrotsearch.randomizedtesting.ThreadLeakControl checkThreadLeaks
   [junit4]   2> WARNING: Will linger awaiting termination of 1 leaked thread(s).
   [junit4]   2> NOTE: test params are: codec=Asserting(Lucene87): {rnd_b=PostingsFormat(name=LuceneVarGapFixedInterval), a_t=BlockTreeOrds(blocksize=128), _root_=PostingsFormat(name=LuceneVarGapDocFreqInterval), id=PostingsFormat(name=LuceneVarGapFixedInterval), foo_s=BlockTreeOrds(blocksize=128)}, docValues:{_version_=DocValuesFormat(name=Lucene80), a_i=DocValuesFormat(name=Lucene80)}, maxPointsInLeafNode=636, maxMBSortInHeap=7.427225472246278, sim=Asserting(RandomSimilarity(queryNorm=false): {}), locale=en-IE, timezone=MET
   [junit4]   2> NOTE: Linux 5.4.0-45-generic amd64/Oracle Corporation 1.8.0_252 (64-bit)/cpus=4,threads=1,free=66401976,total=522190848
   [junit4]   2> NOTE: All tests run in this JVM: [TestJsonFacetErrors, SolrCloudReportersTest, RankFieldTest, OverseerTaskQueueTest, ConcurrentDeleteAndCreateCollectionTest, TestAuthenticationFramework, ForceLeaderWithTlogReplicasTest, TransactionLogTest, ScheduledTriggerTest, BlobRepositoryCloudTest, TestStressCloudBlindAtomicUpdates, ZkCollectionPropsCachingTest, TestHdfsCloudBackupRestore, OutOfBoxZkACLAndCredentialsProvidersTest, SearchHandlerTest, DistributedQueueTest, ZookeeperStatusHandlerTest, MultiSolrCloudTestCaseTest, TestJmxIntegration, PeerSyncWithBufferUpdatesTest, TestTrie, OverseerRolesTest, TestSolrDeletionPolicy2, SharedFSAutoReplicaFailoverTest, DefaultValueUpdateProcessorTest, TestBulkSchemaAPI, TestEmbeddedSolrServerSchemaAPI, DeleteLastCustomShardedReplicaTest, BlockJoinFacetSimpleTest, TestChildDocTransformerHierarchy, TestInPlaceUpdatesStandalone, TestDynamicFieldNamesIndexCorrectly, AuthToolTest, CoreAdminCreateDiscoverTest, TestBooleanSimilarityFactory, TestFilteredDocIdSet, ExecutePlanActionTest, TestPackages, TestJavabinTupleStreamParser, FullHLLTest, TestNRTOpen, DistanceUnitsTest, TestSolrCLIRunExample, SolrPluginUtilsTest, TestFuzzyAnalyzedSuggestions, ConfigureRecoveryStrategyTest, BinaryUpdateRequestHandlerTest, TestLeaderElectionZkExpiry, QueryParsingTest, SparseHLLTest, TestFacetMethods, HdfsUnloadDistributedZkTest, CoreMergeIndexesAdminHandlerTest, TestAddFieldRealTimeGet, DistributedQueryComponentOptimizationTest, MinimalSchemaTest, TestContainerPlugin, TestManagedSchemaThreadSafety, TestPKIAuthenticationPlugin, SegmentsInfoRequestHandlerTest, TestSkipOverseerOperations, TestDocTermOrds, XmlUpdateRequestHandlerTest, TestMacros, TestSimpleQParserPlugin, TestElisionMultitermQuery, SignificantTermsQParserPluginTest, TestLegacyFieldCache, ExitableDirectoryReaderTest, AutoAddReplicasIntegrationTest, TestRawTransformer, TestSQLHandler, TestCloudRecovery2, SpatialHeatmapFacetsTest, CdcrReplicationHandlerTest, TestConfigsApi, TestLRUCache, HdfsRestartWhileUpdatingTest, BlockDirectoryTest, TestManagedSynonymGraphFilterFactory, MissingSegmentRecoveryTest, BigEndianAscendingWordDeserializerTest, TestMissingGroups, SolrRequestParserTest, TermsComponentTest, TestCollationFieldDocValues, SolrTestCaseJ4DeleteCoreTest, TestSolrCachePerf, SpellingQueryConverterTest, TestNestedDocsSort, TestQueryUtils, HighlighterMaxOffsetTest, TestSolrCloudWithHadoopAuthPlugin, TestDeleteCollectionOnDownNodes, StatsReloadRaceTest, TestPrepRecovery, LargeFieldTest, ZkControllerTest, JsonLoaderTest, NestedAtomicUpdateTest, TestDistributedGrouping, WrapperMergePolicyFactoryTest, CollectionPropsTest, TestGroupingSearch, HDFSCollectionsAPITest, TestSchemaManager, TestReload, TestCSVResponseWriter, FieldMutatingUpdateProcessorTest, TestUseDocValuesAsStored, PKIAuthenticationIntegrationTest, TestMultiValuedNumericRangeQuery, AnalysisAfterCoreReloadTest, BasicFunctionalityTest, ConvertedLegacyTest, CursorPagingTest, OutputWriterTest, SampleTest, SolrInfoBeanTest, TestHighlightDedupGrouping, TestJoin, TestRandomDVFaceting, TestRandomFaceting, TestSimpleTrackingShardHandler, TestLuceneMatchVersion, TestWordDelimiterFilterFactory, TokenizerChainTest, TestLuceneIndexBackCompat, BasicDistributedZk2Test, BasicZkTest, ChaosMonkeyNothingIsSafeTest, ChaosMonkeySafeLeaderTest, CloudExitableDirectoryReaderTest, ConcurrentCreateRoutedAliasTest, ConnectionManagerTest, DeleteStatusTest, DistribCursorPagingTest, DistribDocExpirationUpdateProcessorTest, LeaderFailoverAfterPartitionTest, MoveReplicaHDFSFailoverTest, MoveReplicaTest, OverseerCollectionConfigSetProcessorTest, OverseerSolrResponseTest, OverseerSolrResponseUnsafeSerializationTest, OverseerStatusTest, PackageManagerCLITest, RecoveryAfterSoftCommitTest, RemoteQueryErrorTest, ReplaceNodeNoTargetTest, ReplaceNodeTest, ReplicationFactorTest, TestConfigSetsAPIShareSchema, TestTlogReplica, HdfsCollectionsAPIDistributedZkTest, ShardSplitTest]
   [junit4] Completed [645/923 (1!)] on J3 in 280.59s, 11 tests, 1 error, 3 skipped <<< FAILURES!

[...truncated 51636 lines...]