You are viewing a plain text version of this content. The canonical link for it is here.
Posted to dev@lucene.apache.org by Policeman Jenkins Server <je...@thetaphi.de> on 2017/02/21 03:18:19 UTC

[JENKINS] Lucene-Solr-6.x-Linux (64bit/jdk1.8.0_121) - Build # 2905 - Still Unstable!

Build: https://jenkins.thetaphi.de/job/Lucene-Solr-6.x-Linux/2905/
Java: 64bit/jdk1.8.0_121 -XX:+UseCompressedOops -XX:+UseG1GC

1 tests failed.
FAILED:  org.apache.solr.search.TestAnalyticsQParserPlugin.initializationError

Error Message:
No runnable methods

Stack Trace:
java.lang.Exception: No runnable methods
	at org.junit.runners.BlockJUnit4ClassRunner.validateInstanceMethods(BlockJUnit4ClassRunner.java:166)
	at org.junit.runners.BlockJUnit4ClassRunner.collectInitializationErrors(BlockJUnit4ClassRunner.java:102)
	at org.junit.runners.ParentRunner.validate(ParentRunner.java:344)
	at org.junit.runners.ParentRunner.<init>(ParentRunner.java:74)
	at org.junit.runners.BlockJUnit4ClassRunner.<init>(BlockJUnit4ClassRunner.java:55)
	at org.junit.internal.builders.JUnit4Builder.runnerForClass(JUnit4Builder.java:13)
	at org.junit.runners.model.RunnerBuilder.safeRunnerForClass(RunnerBuilder.java:57)
	at org.junit.internal.builders.AllDefaultPossibilitiesBuilder.runnerForClass(AllDefaultPossibilitiesBuilder.java:29)
	at org.junit.runners.model.RunnerBuilder.safeRunnerForClass(RunnerBuilder.java:57)
	at org.junit.internal.requests.ClassRequest.getRunner(ClassRequest.java:24)
	at com.carrotsearch.ant.tasks.junit4.slave.SlaveMain.execute(SlaveMain.java:239)
	at com.carrotsearch.ant.tasks.junit4.slave.SlaveMain.main(SlaveMain.java:355)
	at com.carrotsearch.ant.tasks.junit4.slave.SlaveMainSafe.main(SlaveMainSafe.java:13)




Build Log:
[...truncated 11157 lines...]
   [junit4] Suite: org.apache.solr.search.TestAnalyticsQParserPlugin
   [junit4] ERROR   0.00s J1 | TestAnalyticsQParserPlugin.initializationError <<<
   [junit4]    > Throwable #1: java.lang.Exception: No runnable methods
   [junit4] Completed [72/696 (1!)] on J1 in 0.00s, 1 test, 1 error <<< FAILURES!

[...truncated 64719 lines...]