You are viewing a plain text version of this content. The canonical link for it is here.
Posted to dev@poi.apache.org by Apache Jenkins Server <je...@builds.apache.org> on 2024/01/07 03:40:40 UTC

Build failed in Jenkins: POI » POI-DSL-1.22 #20

See <https://ci-builds.apache.org/job/POI/job/POI-DSL-1.22/20/display/redirect?page=changes>

Changes:

[PJ Fanning] 2024

[PJ Fanning] 2024


------------------------------------------
Started by an SCM change
Running as SYSTEM
ERROR: Not all environment variables could be successfully injected. Check for similarly-named environment variables.
[EnvInject] - Loading node environment variables.
[EnvInject] - Preparing an environment for the build.
[EnvInject] - Keeping Jenkins system variables.
[EnvInject] - Keeping Jenkins build variables.
[EnvInject] - Injecting as environment variables the properties content 
FORREST_HOME=/home/jenkins/tools/forrest/latest
LANG=en_US.UTF-8
CI_BUILD=TRUE

[EnvInject] - Variables injected successfully.
[EnvInject] - Injecting contributions.
Building remotely on builds26 (ubuntu) in workspace <https://ci-builds.apache.org/job/POI/job/POI-DSL-1.22/ws/>
[WS-CLEANUP] Deleting project workspace...
[WS-CLEANUP] Done
ERROR: Not all environment variables could be successfully injected. Check for similarly-named environment variables.
Updating https://svn.apache.org/repos/asf/poi/trunk at revision '2024-01-07T03:36:12.309 +0000'
U         legal/NOTICE
U         poi/src/main/java/org/apache/poi/hssf/record/FeatRecord.java
U         poi/src/main/java/org/apache/poi/hssf/usermodel/HSSFShapeFactory.java
U         poi/src/main/java/org/apache/poi/poifs/crypt/agile/AgileEncryptionInfoBuilder.java
U         poi/src/main/java/org/apache/poi/ss/usermodel/FractionFormat.java
U         poi/src/main/java/org/apache/poi/ddf/EscherContainerRecord.java
U         poi/src/main/java/org/apache/poi/ddf/UnknownEscherRecord.java
U         poi/src/test/java/org/apache/poi/hssf/dev/TestBiffViewer.java
U         poi/src/test/java/org/apache/poi/hssf/dev/TestRecordLister.java
U         poi/src/test/java/org/apache/poi/hssf/dev/BaseTestIteratingXLS.java
U         poi/src/test/java/org/apache/poi/hssf/dev/TestBiffDrawingToXml.java
U         poi/src/test/java/org/apache/poi/hssf/model/TestDrawingAggregate.java
A         test-data/spreadsheet/clusterfuzz-testcase-minimized-POIHSSFFuzzer-6137883240824832.xls
U         test-data/spreadsheet/stress.xls
A         test-data/spreadsheet/clusterfuzz-testcase-minimized-POIHSSFFuzzer-6537773940867072.xls
A         test-data/spreadsheet/clusterfuzz-testcase-minimized-POIHSSFFuzzer-4977868385681408.xls
A         test-data/document/clusterfuzz-testcase-minimized-POIXWPFFuzzer-6120975439364096.docx
A         test-data/document/clusterfuzz-testcase-minimized-POIHWPFFuzzer-6610789829836800.doc
A         test-data/slideshow/clusterfuzz-testcase-minimized-POIHSLFFuzzer-5018229722382336.ppt
U         poi-ooxml/src/main/java/org/apache/poi/xwpf/usermodel/XWPFNumbering.java
U         poi-ooxml/src/main/java/org/apache/poi/poifs/crypt/dsig/SignatureInfo.java
U         poi-ooxml/src/test/java/org/apache/poi/xwpf/usermodel/TestXWPFNumbering.java
U         poi-ooxml/src/test/java/org/apache/poi/poifs/crypt/dsig/TestSignatureInfo.java
U         poi-ooxml/build.gradle
U         poi-scratchpad/src/main/java/org/apache/poi/hwpf/converter/AbstractWordConverter.java
U         poi-scratchpad/src/test/java/org/apache/poi/hwpf/converter/TestWordToConverterSuite.java
U         poi-scratchpad/src/test/java/org/apache/poi/hwpf/converter/TestWordToTextConverter.java
U         poi-scratchpad/src/test/java/org/apache/poi/hslf/dev/BaseTestPPTIterating.java
U         build.gradle
U         build.xml
U         poi-excelant/build.gradle
U         poi-integration/build.gradle
U         jenkins/create_jobs.groovy
U         osgi/pom.xml

<-- Got one external: forrest.properties, svn url: https://svn.apache.org/repos/asf/poi/site/forrest.properties -->
Fetching 'https://svn.apache.org/repos/asf/poi/site/forrest.properties' at -1 into '<https://ci-builds.apache.org/job/POI/job/POI-DSL-1.22/ws/forrest.properties'>
At revision 1915107


<-- Got one external: documentation, svn url: https://svn.apache.org/repos/asf/poi/site/src/documentation -->
Fetching 'https://svn.apache.org/repos/asf/poi/site/src/documentation' at -1 into '<https://ci-builds.apache.org/job/POI/job/POI-DSL-1.22/ws/src/documentation'>
U         src/documentation/content/xdocs/legal.xml
U         src/documentation/content/xdocs/components/index.xml
U         src/documentation/content/xdocs/changes.xml
At revision 1915107

At revision 1915107

No changes for https://svn.apache.org/repos/asf/poi/site/forrest.properties since the previous build
ERROR: Not all environment variables could be successfully injected. Check for similarly-named environment variables.
[POI-DSL-1.22] $ /bin/sh -xe /tmp/jenkins17361487576435276439.sh
+ rm -rf examples excelant integrationtest main ooxml ooxml-schema scratchpad build.javacheck.xml
+ svn status
    X   forrest.properties
X       src/documentation

Performing status on external item at 'src/documentation':
+ svn revert poi-examples/src/main/java9/module-info.java poi-excelant/src/main/java9/module-info.java poi-excelant/src/test/java9/module-info.java poi-integration/src/test/java9/module-info.java poi-ooxml-full/src/main/java9/module-info.java poi-ooxml-lite-agent/src/main/java9/module-info.java poi-ooxml-lite/src/main/java9/module-info.java poi-ooxml/src/main/java9/module-info.java poi-ooxml/src/test/java9/module-info.java poi-scratchpad/src/main/java9/module-info.java poi-scratchpad/src/test/java9/module-info.java poi/src/main/java9/module-info.java poi/src/test/java9/module-info.java
+ svn revert src/resources/ooxml-lite-report.clazz src/resources/ooxml-lite-report.xsb
+ echo Java-Home: /home/jenkins/tools/java/latest22
Java-Home: /home/jenkins/tools/java/latest22
+ ls -al /home/jenkins/tools/java/latest22/
total 36
drwxr-xr-x  8 root root 4096 Nov 15 13:53 .
drwxrwxr-x 38 root root 4096 Dec 14 17:45 ..
drwxr-xr-x  2 root root 4096 Nov 15 13:53 bin
drwxr-xr-x  5 root root 4096 Nov 15 13:53 conf
drwxr-xr-x  3 root root 4096 Nov 15 13:53 include
drwxr-xr-x  2 root root 4096 Nov 15 13:53 jmods
drwxr-xr-x 71 root root 4096 Nov 15 13:53 legal
drwxr-xr-x  5 root root 4096 Nov 15 13:53 lib
-rw-r--r--  1 root root 1220 Oct 18 14:34 release
+ ls -al /home/jenkins/tools/java/latest22/bin
total 472
drwxr-xr-x 2 root root  4096 Nov 15 13:53 .
drwxr-xr-x 8 root root  4096 Nov 15 13:53 ..
-rwxr-xr-x 1 root root 12384 Oct 18 14:34 jar
-rwxr-xr-x 1 root root 12392 Oct 18 14:34 jarsigner
-rwxr-xr-x 1 root root 12328 Oct 18 14:34 java
-rwxr-xr-x 1 root root 12416 Oct 18 14:34 javac
-rwxr-xr-x 1 root root 12424 Oct 18 14:34 javadoc
-rwxr-xr-x 1 root root 12384 Oct 18 14:34 javap
-rwxr-xr-x 1 root root 12384 Oct 18 14:34 jcmd
-rwxr-xr-x 1 root root 12456 Oct 18 14:34 jconsole
-rwxr-xr-x 1 root root 12384 Oct 18 14:34 jdb
-rwxr-xr-x 1 root root 12392 Oct 18 14:34 jdeprscan
-rwxr-xr-x 1 root root 12384 Oct 18 14:34 jdeps
-rwxr-xr-x 1 root root 12384 Oct 18 14:34 jfr
-rwxr-xr-x 1 root root 12384 Oct 18 14:34 jhsdb
-rwxr-xr-x 1 root root 12392 Oct 18 14:34 jimage
-rwxr-xr-x 1 root root 12416 Oct 18 14:34 jinfo
-rwxr-xr-x 1 root root 12416 Oct 18 14:34 jlink
-rwxr-xr-x 1 root root 12416 Oct 18 14:34 jmap
-rwxr-xr-x 1 root root 12384 Oct 18 14:34 jmod
-rwxr-xr-x 1 root root 12392 Oct 18 14:34 jpackage
-rwxr-xr-x 1 root root 12384 Oct 18 14:34 jps
-rwxr-xr-x 1 root root 12424 Oct 18 14:34 jrunscript
-rwxr-xr-x 1 root root 12392 Oct 18 14:34 jshell
-rwxr-xr-x 1 root root 12424 Oct 18 14:34 jstack
-rwxr-xr-x 1 root root 12384 Oct 18 14:34 jstat
-rwxr-xr-x 1 root root 12392 Oct 18 14:34 jstatd
-rwxr-xr-x 1 root root 12392 Oct 18 14:34 jwebserver
-rwxr-xr-x 1 root root 12392 Oct 18 14:34 keytool
-rwxr-xr-x 1 root root 12416 Oct 18 14:34 rmiregistry
-rwxr-xr-x 1 root root 12392 Oct 18 14:34 serialver
+ /home/jenkins/tools/java/latest22/bin/java -version
openjdk version "22-ea" 2024-03-19
OpenJDK Runtime Environment (build 22-ea+20-1570)
OpenJDK 64-Bit Server VM (build 22-ea+20-1570, mixed mode, sharing)
+ echo which java
which java
+ which java
/home/jenkins/tools/java/latest22/bin/java
+ java -version
openjdk version "22-ea" 2024-03-19
OpenJDK Runtime Environment (build 22-ea+20-1570)
OpenJDK 64-Bit Server VM (build 22-ea+20-1570, mixed mode, sharing)
+ echo which javac
which javac
+ which javac
/home/jenkins/tools/java/latest22/bin/javac
+ javac -version
javac 22-ea
+ echo Ant-Home:
Ant-Home:
+ ls -al
total 532
drwxr-xr-x 22 jenkins jenkins   4096 Jan  7 03:39 .
drwxr-xr-x  5 jenkins jenkins   4096 Dec 10 16:21 ..
-rw-r--r--  1 jenkins jenkins    520 Nov 19 03:39 .asf.yaml
drwxr-xr-x  3 jenkins jenkins   4096 Dec 24 03:38 build
-rw-r--r--  1 jenkins jenkins  30456 Jan  7 03:38 build.gradle
-rw-r--r--  1 jenkins jenkins 169141 Jan  7 03:38 build.xml
-rw-r--r--  1 jenkins jenkins   7536 Nov 26 03:36 doap_POI.rdf
-rw-r--r--  1 jenkins jenkins   3261 Nov 19 03:39 file-leak-detector.exclude
-rw-r--r--  1 jenkins jenkins   6229 Nov 19 03:39 forrest.properties
-rw-r--r--  1 jenkins jenkins     53 Nov 19 03:39 .gitattributes
drwxr-xr-x  3 jenkins jenkins   4096 Nov 19 03:39 .github
-rw-r--r--  1 jenkins jenkins    396 Nov 19 03:39 .gitignore
drwxr-xr-x  5 jenkins jenkins   4096 Dec 17 03:58 .gradle
drwxr-xr-x  3 jenkins jenkins   4096 Nov 19 03:39 gradle
-rw-r--r--  1 jenkins jenkins    599 Nov 19 03:39 gradle.properties
-rwxr-xr-x  1 jenkins jenkins   8639 Nov 19 03:39 gradlew
-rw-r--r--  1 jenkins jenkins   2868 Nov 19 03:39 gradlew.bat
drwxr-xr-x  2 jenkins jenkins   4096 Jan  7 03:38 jenkins
-rw-r--r--  1 jenkins jenkins 167516 Nov 19 03:39 KEYS
drwxr-xr-x  2 jenkins jenkins   4096 Nov 19 03:39 legal
drwxr-xr-x  2 jenkins jenkins   4096 Nov 19 03:39 lib.stored
drwxr-xr-x  3 jenkins jenkins   4096 Jan  7 03:38 osgi
-rw-r--r--  1 jenkins jenkins   4813 Nov 19 03:39 patch.xml
drwxr-xr-x  5 jenkins jenkins   4096 Dec 24 03:40 poi
drwxr-xr-x  4 jenkins jenkins   4096 Dec 24 03:38 poi-examples
drwxr-xr-x  4 jenkins jenkins   4096 Jan  7 03:38 poi-excelant
drwxr-xr-x  4 jenkins jenkins   4096 Jan  7 03:38 poi-integration
drwxr-xr-x  4 jenkins jenkins   4096 Jan  7 03:38 poi-ooxml
drwxr-xr-x  4 jenkins jenkins   4096 Dec 24 03:38 poi-ooxml-full
drwxr-xr-x  4 jenkins jenkins   4096 Dec 24 03:41 poi-ooxml-lite
drwxr-xr-x  4 jenkins jenkins   4096 Dec 24 03:38 poi-ooxml-lite-agent
drwxr-xr-x  5 jenkins jenkins   4096 Dec 24 03:38 poi-scratchpad
-rw-r--r--  1 jenkins jenkins   4351 Nov 19 03:39 README.rst
-rw-r--r--  1 jenkins jenkins    428 Nov 19 03:39 SECURITY.md
-rw-r--r--  1 jenkins jenkins    190 Nov 19 03:39 settings.gradle
drwxr-xr-x  4 jenkins jenkins   4096 Nov 19 03:39 src
drwxr-xr-x  4 jenkins jenkins   4096 Jan  7 03:39 .svn
drwxr-xr-x 15 jenkins jenkins   4096 Nov 19 03:39 test-data
-rw-r--r--  1 jenkins jenkins   3803 Nov 19 03:39 wrapper.gradle
+ echo which ant
which ant
+ which ant
/usr/bin/ant
+ ant -version
Apache Ant(TM) version 1.10.12 compiled on January 17 1970
+ echo <project default="test"><target name="test"><echo>Java ${ant.java.version}/${java.version}</echo><exec executable="javac"><arg value="-version"/></exec></target></project>
+ ant -f build.javacheck.xml -v
Apache Ant(TM) version 1.10.12 compiled on January 17 1970
Buildfile: <https://ci-builds.apache.org/job/POI/job/POI-DSL-1.22/ws/build.javacheck.xml>
Detected Java version: 22 in: /usr/local/asfpackages/java/openjdk-22-ea+20
Detected OS: Linux
parsing buildfile <https://ci-builds.apache.org/job/POI/job/POI-DSL-1.22/ws/build.javacheck.xml> with URI = <https://ci-builds.apache.org/job/POI/job/POI-DSL-1.22/ws/build.javacheck.xml>
Project base dir set to: <https://ci-builds.apache.org/job/POI/job/POI-DSL-1.22/ws/>
Build sequence for target(s) `test' is [test]
Complete build sequence is [test, ]

test:
parsing buildfile jar:file:/usr/share/ant/lib/ant.jar!/org/apache/tools/ant/antlib.xml with URI = jar:file:/usr/share/ant/lib/ant.jar!/org/apache/tools/ant/antlib.xml from a zip file
     [echo] Java 22/22-ea
     [exec] Current OS is Linux
     [exec] Executing 'javac' with arguments:
     [exec] '-version'
     [exec] 
     [exec] The ' characters around the executable and arguments are
     [exec] not part of the command.
     [exec] javac 22-ea

BUILD SUCCESSFUL
Total time: 0 seconds
+ exit 0
ERROR: Not all environment variables could be successfully injected. Check for similarly-named environment variables.
[POI-DSL-1.22] $ /bin/sh -xe /tmp/jenkins14880356026960493280.sh
+ touch --no-create build/*/build/test-results/TEST-*.xml build/*/build/test-results/test/TEST-*.xml
[Gradle] - Launching build.
ERROR: Not all environment variables could be successfully injected. Check for similarly-named environment variables.
[POI-DSL-1.22] $ <https://ci-builds.apache.org/job/POI/job/POI-DSL-1.22/ws/gradlew> -PjdkVersion=22 --refresh-dependencies clean jenkins
To honour the JVM settings for this build a single-use Daemon process will be forked. For more on this, please refer to https://docs.gradle.org/8.5/userguide/gradle_daemon.html#sec:disabling_the_daemon in the Gradle documentation.
Daemon will be stopped at the end of the build 
Configuration on demand is an incubating feature.

FAILURE: Build failed with an exception.

* What went wrong:
A problem occurred configuring root project 'poi'.
> Could not open cp_proj generic class cache for build file '<https://ci-builds.apache.org/job/POI/job/POI-DSL-1.22/ws/build.gradle'> (/home/jenkins/.gradle/caches/8.5/scripts/5rfw5jn6xf698x5l4q9q8r2nb).
   > BUG! exception in phase 'semantic analysis' in source unit '_BuildScript_' Unsupported class file major version 66

* Try:
> Run with --stacktrace option to get the stack trace.
> Run with --info or --debug option to get more log output.
> Run with --scan to get full insights.
> Get more help at https://help.gradle.org.

BUILD FAILED in 17s
Build step 'Invoke Gradle script' changed build result to FAILURE
Build step 'Invoke Gradle script' marked build as failure
ERROR: Not all environment variables could be successfully injected. Check for similarly-named environment variables.
Archiving artifacts
ERROR: Not all environment variables could be successfully injected. Check for similarly-named environment variables.
Recording test results
ERROR: Not all environment variables could be successfully injected. Check for similarly-named environment variables.
[Checks API] No suitable checks publisher found.
ERROR: Not all environment variables could be successfully injected. Check for similarly-named environment variables.

---------------------------------------------------------------------
To unsubscribe, e-mail: dev-unsubscribe@poi.apache.org
For additional commands, e-mail: dev-help@poi.apache.org


Build failed in Jenkins: POI » POI-DSL-1.22 #33

Posted by Apache Jenkins Server <je...@builds.apache.org>.
See <https://ci-builds.apache.org/job/POI/job/POI-DSL-1.22/33/display/redirect?page=changes>

Changes:

[PJ Fanning] pdfbox 3.0.2

[PJ Fanning] pdfbox 3.0.2

[Dominik Stadler] Bug 68778: Verify "ignoreMissingFontSystem" for SheetUtil.getDefaultCharWidthAsFloat()

This functionality saw some regressions at times and thus
should be verified via unit-tests. 

We can simulate failures in the low-level font-system by 
mocking the FontRenderContext and triggering exceptions
from there.

This hopefully now verifies behavior of 
SheetUtil.getDefaultCharWidthAsFloat() both with 
"ignoreMissingFontSystem" enabled and disabled.

[PJ Fanning] upgrade commons-compress and log4j

[PJ Fanning] upgrade commons-compress and log4j


------------------------------------------
[...truncated 166.34 KB...]
[junitlauncher] Running org.apache.poi.ss.formula.ptg.TestArrayPtg
[junitlauncher] Tests run: 5, Failures: 0, Aborted: 0, Skipped: 0, Time elapsed: 0.002000 sec
[junitlauncher] Running org.apache.poi.ss.formula.ptg.TestAttrPtg
[junitlauncher] 
[junitlauncher] Running org.apache.poi.ss.formula.ptg.TestAttrPtg
[junitlauncher] Tests run: 1, Failures: 0, Aborted: 0, Skipped: 0, Time elapsed: 0.001000 sec
[junitlauncher] Running org.apache.poi.ss.formula.ptg.TestErrPtg
[junitlauncher] 
[junitlauncher] Running org.apache.poi.ss.formula.ptg.TestErrPtg
[junitlauncher] Tests run: 1, Failures: 0, Aborted: 0, Skipped: 0, Time elapsed: 0.002000 sec
[junitlauncher] Running org.apache.poi.ss.formula.ptg.TestExternalFunctionFormulas
[junitlauncher] 
[junitlauncher] Running org.apache.poi.ss.formula.ptg.TestExternalFunctionFormulas
[junitlauncher] Tests run: 3, Failures: 0, Aborted: 0, Skipped: 0, Time elapsed: 0.004000 sec
[junitlauncher] Running org.apache.poi.ss.formula.ptg.TestExternalNameReference
[junitlauncher] 
[junitlauncher] Running org.apache.poi.ss.formula.ptg.TestExternalNameReference
[junitlauncher] Tests run: 3, Failures: 0, Aborted: 0, Skipped: 0, Time elapsed: 0.004000 sec
[junitlauncher] Running org.apache.poi.ss.formula.ptg.TestFuncPtg
[junitlauncher] 
[junitlauncher] Running org.apache.poi.ss.formula.ptg.TestFuncPtg
[junitlauncher] Tests run: 2, Failures: 0, Aborted: 0, Skipped: 0, Time elapsed: 0.000000 sec
[junitlauncher] Running org.apache.poi.ss.formula.ptg.TestFuncVarPtg
[junitlauncher] 
[junitlauncher] Running org.apache.poi.ss.formula.ptg.TestFuncVarPtg
[junitlauncher] Tests run: 1, Failures: 0, Aborted: 0, Skipped: 0, Time elapsed: 0.000000 sec
[junitlauncher] Running org.apache.poi.ss.formula.ptg.TestIntersectionPtg
[junitlauncher] 
[junitlauncher] Running org.apache.poi.ss.formula.ptg.TestIntersectionPtg
[junitlauncher] Tests run: 1, Failures: 0, Aborted: 0, Skipped: 0, Time elapsed: 0.001000 sec
[junitlauncher] Running org.apache.poi.ss.formula.ptg.TestPercentPtg
[junitlauncher] 
[junitlauncher] Running org.apache.poi.ss.formula.ptg.TestPercentPtg
[junitlauncher] Tests run: 1, Failures: 0, Aborted: 0, Skipped: 0, Time elapsed: 0.001000 sec
[junitlauncher] Running org.apache.poi.ss.formula.ptg.TestRangePtg
[junitlauncher] 
[junitlauncher] Running org.apache.poi.ss.formula.ptg.TestRangePtg
[junitlauncher] Tests run: 1, Failures: 0, Aborted: 0, Skipped: 0, Time elapsed: 0.001000 sec
[junitlauncher] Running org.apache.poi.ss.formula.ptg.TestRef3DPtg
[junitlauncher] 
[junitlauncher] Running org.apache.poi.ss.formula.ptg.TestRef3DPtg
[junitlauncher] Tests run: 1, Failures: 0, Aborted: 0, Skipped: 0, Time elapsed: 0.000000 sec
[junitlauncher] Running org.apache.poi.ss.formula.ptg.TestReferencePtg
[junitlauncher] 
[junitlauncher] Running org.apache.poi.ss.formula.ptg.TestReferencePtg
[junitlauncher] Tests run: 4, Failures: 0, Aborted: 0, Skipped: 0, Time elapsed: 0.010000 sec
[junitlauncher] Running org.apache.poi.ss.formula.ptg.TestUnionPtg
[junitlauncher] 
[junitlauncher] Running org.apache.poi.ss.formula.ptg.TestUnionPtg
[junitlauncher] Tests run: 1, Failures: 0, Aborted: 0, Skipped: 0, Time elapsed: 0.001000 sec
[junitlauncher] Running org.apache.poi.ss.formula.udf.TestUDFFinder
[junitlauncher] 
[junitlauncher] Running org.apache.poi.ss.formula.udf.TestUDFFinder
[junitlauncher] Tests run: 4, Failures: 0, Aborted: 0, Skipped: 0, Time elapsed: 0.004000 sec
[junitlauncher] Running org.apache.poi.ss.usermodel.TestDataFormatter
[junitlauncher] 
[junitlauncher] Running org.apache.poi.ss.usermodel.TestDataFormatter
[junitlauncher] Tests run: 45, Failures: 0, Aborted: 0, Skipped: 1, Time elapsed: 0.382000 sec
[junitlauncher] Running org.apache.poi.ss.usermodel.TestDateUtil
[junitlauncher] 
[junitlauncher] Running org.apache.poi.ss.usermodel.TestDateUtil
[junitlauncher] Tests run: 26, Failures: 0, Aborted: 0, Skipped: 0, Time elapsed: 0.012000 sec
[junitlauncher] Running org.apache.poi.ss.usermodel.TestExcelStyleDateFormatter
[junitlauncher] 
[junitlauncher] Running org.apache.poi.ss.usermodel.TestExcelStyleDateFormatter
[junitlauncher] Tests run: 124, Failures: 0, Aborted: 0, Skipped: 0, Time elapsed: 0.074000 sec
[junitlauncher] Running org.apache.poi.ss.usermodel.TestFractionFormat
[junitlauncher] 
[junitlauncher] Running org.apache.poi.ss.usermodel.TestFractionFormat
[junitlauncher] Tests run: 5, Failures: 0, Aborted: 0, Skipped: 1, Time elapsed: 0.227000 sec
[junitlauncher] Running org.apache.poi.ss.usermodel.TestHSSFBorderStyle
[junitlauncher] 
[junitlauncher] Running org.apache.poi.ss.usermodel.TestHSSFBorderStyle
[junitlauncher] Tests run: 1, Failures: 0, Aborted: 0, Skipped: 0, Time elapsed: 0.001000 sec
[junitlauncher] Running org.apache.poi.ss.usermodel.TestIndexedColors
[junitlauncher] 
[junitlauncher] Running org.apache.poi.ss.usermodel.TestIndexedColors
[junitlauncher] Tests run: 3, Failures: 0, Aborted: 0, Skipped: 0, Time elapsed: 0.002000 sec
[junitlauncher] Running org.apache.poi.ss.util.TestAreaReference
[junitlauncher] 
[junitlauncher] Running org.apache.poi.ss.util.TestAreaReference
[junitlauncher] Tests run: 3, Failures: 0, Aborted: 0, Skipped: 0, Time elapsed: 0.001000 sec
[junitlauncher] Running org.apache.poi.ss.util.TestCellAddress
[junitlauncher] 
[junitlauncher] Running org.apache.poi.ss.util.TestCellAddress
[junitlauncher] Tests run: 6, Failures: 0, Aborted: 0, Skipped: 0, Time elapsed: 0.001000 sec
[junitlauncher] Running org.apache.poi.ss.util.TestCellRangeAddress
[junitlauncher] 
[junitlauncher] Running org.apache.poi.ss.util.TestCellRangeAddress
[junitlauncher] Tests run: 15, Failures: 0, Aborted: 0, Skipped: 0, Time elapsed: 0.008000 sec
[junitlauncher] Running org.apache.poi.ss.util.TestCellRangeUtil
[junitlauncher] 
[junitlauncher] Running org.apache.poi.ss.util.TestCellRangeUtil
[junitlauncher] Tests run: 1, Failures: 0, Aborted: 0, Skipped: 0, Time elapsed: 0.001000 sec
[junitlauncher] Running org.apache.poi.ss.util.TestCellReference
[junitlauncher] 
[junitlauncher] Running org.apache.poi.ss.util.TestCellReference
[junitlauncher] Tests run: 27, Failures: 0, Aborted: 0, Skipped: 0, Time elapsed: 0.194000 sec
[junitlauncher] Running org.apache.poi.ss.util.TestDateFormatConverter
[junitlauncher] 
[junitlauncher] Running org.apache.poi.ss.util.TestDateFormatConverter
[junitlauncher] Tests run: 19, Failures: 0, Aborted: 0, Skipped: 0, Time elapsed: 3.876000 sec
[junitlauncher] Running org.apache.poi.ss.util.TestDateParser
[junitlauncher] 
[junitlauncher] Running org.apache.poi.ss.util.TestDateParser
[junitlauncher] Tests run: 6, Failures: 0, Aborted: 0, Skipped: 0, Time elapsed: 0.004000 sec
[junitlauncher] Running org.apache.poi.ss.util.TestExpandedDouble
[junitlauncher] 
[junitlauncher] Running org.apache.poi.ss.util.TestExpandedDouble
[junitlauncher] Tests run: 19, Failures: 0, Aborted: 0, Skipped: 0, Time elapsed: 0.013000 sec
[junitlauncher] Running org.apache.poi.ss.util.TestHSSFCellUtil
[junitlauncher] 
[junitlauncher] Running org.apache.poi.ss.util.TestHSSFCellUtil
[junitlauncher] Tests run: 17, Failures: 0, Aborted: 0, Skipped: 0, Time elapsed: 0.032000 sec
[junitlauncher] Running org.apache.poi.ss.util.TestHSSFCellUtilCopy
[junitlauncher] 
[junitlauncher] Running org.apache.poi.ss.util.TestHSSFCellUtilCopy
[junitlauncher] Tests run: 6, Failures: 0, Aborted: 0, Skipped: 0, Time elapsed: 0.007000 sec
[junitlauncher] Running org.apache.poi.ss.util.TestImageUtils
[junitlauncher] 
[junitlauncher] Running org.apache.poi.ss.util.TestImageUtils
[junitlauncher] Tests run: 2, Failures: 0, Aborted: 0, Skipped: 0, Time elapsed: 0.007000 sec
[junitlauncher] Running org.apache.poi.ss.util.TestNumberComparer
[junitlauncher] 
[junitlauncher] Running org.apache.poi.ss.util.TestNumberComparer
[junitlauncher] Tests run: 116, Failures: 0, Aborted: 0, Skipped: 0, Time elapsed: 0.060000 sec
[junitlauncher] Running org.apache.poi.ss.util.TestNumberToTextConverter
[junitlauncher] 
[junitlauncher] Running org.apache.poi.ss.util.TestNumberToTextConverter
[junitlauncher] Tests run: 2, Failures: 0, Aborted: 0, Skipped: 0, Time elapsed: 0.005000 sec
[junitlauncher] Running org.apache.poi.ss.util.TestPaneInformation
[junitlauncher] 
[junitlauncher] Running org.apache.poi.ss.util.TestPaneInformation
[junitlauncher] Tests run: 2, Failures: 0, Aborted: 0, Skipped: 0, Time elapsed: 0.000000 sec
[junitlauncher] Running org.apache.poi.ss.util.TestPropertyTemplate
[junitlauncher] 
[junitlauncher] Running org.apache.poi.ss.util.TestPropertyTemplate
[junitlauncher] Tests run: 8, Failures: 0, Aborted: 0, Skipped: 0, Time elapsed: 0.017000 sec
[junitlauncher] Running org.apache.poi.ss.util.TestRegionUtil
[junitlauncher] 
[junitlauncher] Running org.apache.poi.ss.util.TestRegionUtil
[junitlauncher] Tests run: 10, Failures: 0, Aborted: 0, Skipped: 0, Time elapsed: 0.013000 sec
[junitlauncher] Running org.apache.poi.ss.util.TestSheetBuilder
[junitlauncher] 
[junitlauncher] Running org.apache.poi.ss.util.TestSheetBuilder
[junitlauncher] Tests run: 3, Failures: 0, Aborted: 0, Skipped: 0, Time elapsed: 0.002000 sec
[junitlauncher] Running org.apache.poi.ss.util.TestSheetUtil
[junitlauncher] 
[junitlauncher] Running org.apache.poi.ss.util.TestSheetUtil
[junitlauncher] Tests run: 18, Failures: 0, Aborted: 0, Skipped: 0, Time elapsed: 0.044000 sec
[junitlauncher] Running org.apache.poi.ss.util.TestWorkbookUtil
[junitlauncher] 
[junitlauncher] Running org.apache.poi.ss.util.TestWorkbookUtil
[junitlauncher] Tests run: 1, Failures: 0, Aborted: 0, Skipped: 0, Time elapsed: 0.000000 sec
[junitlauncher] Running org.apache.poi.ss.util.cellwalk.TestCellWalk
[junitlauncher] 
[junitlauncher] Running org.apache.poi.ss.util.cellwalk.TestCellWalk
[junitlauncher] Tests run: 1, Failures: 0, Aborted: 0, Skipped: 0, Time elapsed: 0.002000 sec
[junitlauncher] Running org.apache.poi.util.TestArrayUtil
[junitlauncher] 
[junitlauncher] Running org.apache.poi.util.TestArrayUtil
[junitlauncher] Tests run: 1, Failures: 0, Aborted: 0, Skipped: 0, Time elapsed: 0.001000 sec
[junitlauncher] Running org.apache.poi.util.TestBitField
[junitlauncher] 
[junitlauncher] Running org.apache.poi.util.TestBitField
[junitlauncher] Tests run: 16, Failures: 0, Aborted: 0, Skipped: 0, Time elapsed: 0.002000 sec
[junitlauncher] Running org.apache.poi.util.TestByteField
[junitlauncher] 
[junitlauncher] Running org.apache.poi.util.TestByteField
[junitlauncher] Tests run: 5, Failures: 0, Aborted: 0, Skipped: 0, Time elapsed: 0.003000 sec
[junitlauncher] Running org.apache.poi.util.TestCodepointsUtil
[junitlauncher] 
[junitlauncher] Running org.apache.poi.util.TestCodepointsUtil
[junitlauncher] Tests run: 2, Failures: 0, Aborted: 0, Skipped: 0, Time elapsed: 0.001000 sec
[junitlauncher] Running org.apache.poi.util.TestHexDump
[junitlauncher] 
[junitlauncher] Running org.apache.poi.util.TestHexDump
[junitlauncher] Tests run: 10, Failures: 0, Aborted: 0, Skipped: 0, Time elapsed: 0.011000 sec
[junitlauncher] Running org.apache.poi.util.TestIOUtils
[junitlauncher] 
[junitlauncher] Running org.apache.poi.util.TestIOUtils
[junitlauncher] Tests run: 59, Failures: 0, Aborted: 0, Skipped: 0, Time elapsed: 0.086000 sec
[junitlauncher] Running org.apache.poi.util.TestIntList
[junitlauncher] 
[junitlauncher] Running org.apache.poi.util.TestIntList
[junitlauncher] Tests run: 19, Failures: 0, Aborted: 0, Skipped: 0, Time elapsed: 0.038000 sec
[junitlauncher] Running org.apache.poi.util.TestIntegerField
[junitlauncher] 
[junitlauncher] Running org.apache.poi.util.TestIntegerField
[junitlauncher] Tests run: 5, Failures: 0, Aborted: 0, Skipped: 0, Time elapsed: 0.004000 sec
[junitlauncher] Running org.apache.poi.util.TestLittleEndian
[junitlauncher] 
[junitlauncher] Running org.apache.poi.util.TestLittleEndian
[junitlauncher] Tests run: 15, Failures: 0, Aborted: 0, Skipped: 0, Time elapsed: 0.004000 sec
[junitlauncher] Running org.apache.poi.util.TestLittleEndianInputStream
[junitlauncher] 
[junitlauncher] Running org.apache.poi.util.TestLittleEndianInputStream
[junitlauncher] Tests run: 2, Failures: 0, Aborted: 0, Skipped: 0, Time elapsed: 0.000000 sec
[junitlauncher] Running org.apache.poi.util.TestLittleEndianStreams
[junitlauncher] 
[junitlauncher] Running org.apache.poi.util.TestLittleEndianStreams
[junitlauncher] Tests run: 5, Failures: 0, Aborted: 0, Skipped: 0, Time elapsed: 0.002000 sec
[junitlauncher] Running org.apache.poi.util.TestLocaleUtil
[junitlauncher] 
[junitlauncher] Running org.apache.poi.util.TestLocaleUtil
[junitlauncher] Tests run: 3, Failures: 0, Aborted: 0, Skipped: 0, Time elapsed: 0.001000 sec
[junitlauncher] Running org.apache.poi.util.TestLongField
[junitlauncher] 
[junitlauncher] Running org.apache.poi.util.TestLongField
[junitlauncher] Tests run: 5, Failures: 0, Aborted: 0, Skipped: 0, Time elapsed: 0.003000 sec
[junitlauncher] Running org.apache.poi.util.TestRLEDecompressingInputStream
[junitlauncher] 
[junitlauncher] Running org.apache.poi.util.TestRLEDecompressingInputStream
[junitlauncher] Tests run: 4, Failures: 0, Aborted: 0, Skipped: 0, Time elapsed: 0.001000 sec
[junitlauncher] Running org.apache.poi.util.TestShortField
[junitlauncher] 
[junitlauncher] Running org.apache.poi.util.TestShortField
[junitlauncher] Tests run: 5, Failures: 0, Aborted: 0, Skipped: 0, Time elapsed: 0.002000 sec
[junitlauncher] Running org.apache.poi.util.TestStringUtil
[junitlauncher] 
[junitlauncher] Running org.apache.poi.util.TestStringUtil
[junitlauncher] Tests run: 7, Failures: 0, Aborted: 0, Skipped: 0, Time elapsed: 0.003000 sec
[junitlauncher] Running org.apache.poi.util.TestTempFile
[junitlauncher] 
[junitlauncher] Running org.apache.poi.util.TestTempFile
[junitlauncher] Tests run: 4, Failures: 0, Aborted: 0, Skipped: 0, Time elapsed: 0.008000 sec
[junitlauncher] Running org.apache.poi.util.TestThreadLocalUtil
[junitlauncher] 
[junitlauncher] Running org.apache.poi.util.TestThreadLocalUtil
[junitlauncher] Tests run: 2, Failures: 0, Aborted: 0, Skipped: 0, Time elapsed: 0.287000 sec
[junitlauncher] Running org.apache.poi.util.TestXMLHelper
[junitlauncher] 
[junitlauncher] Running org.apache.poi.util.TestXMLHelper
[junitlauncher]    Failed: testNewXMLInputFactory(): org.opentest4j.AssertionFailedError: expected: java.lang.Boolean@4b641265<false> but was: java.lang.String@48950a5d<false>
[junitlauncher] Tests run: 9, Failures: 1, Aborted: 0, Skipped: 0, Time elapsed: 0.335000 sec

BUILD FAILED
<https://ci-builds.apache.org/job/POI/job/POI-DSL-1.22/ws/build.xml>:1691: The following error occurred while executing this line:
<https://ci-builds.apache.org/job/POI/job/POI-DSL-1.22/ws/build.xml>:1385: Some test(s) have failure(s)

Total time: 5 minutes 57 seconds
Build step 'Invoke Ant' marked build as failure
ERROR: Not all environment variables could be successfully injected. Check for similarly-named environment variables.
Archiving artifacts
ERROR: Not all environment variables could be successfully injected. Check for similarly-named environment variables.
Recording test results
ERROR: Not all environment variables could be successfully injected. Check for similarly-named environment variables.
[Checks API] No suitable checks publisher found.
ERROR: Not all environment variables could be successfully injected. Check for similarly-named environment variables.

---------------------------------------------------------------------
To unsubscribe, e-mail: dev-unsubscribe@poi.apache.org
For additional commands, e-mail: dev-help@poi.apache.org


Build failed in Jenkins: POI » POI-DSL-1.22 #32

Posted by Apache Jenkins Server <je...@builds.apache.org>.
See <https://ci-builds.apache.org/job/POI/job/POI-DSL-1.22/32/display/redirect?page=changes>

Changes:

[PJ Fanning] add javadoc

[PJ Fanning] remove annotation

[PJ Fanning] deprecation warning

[PJ Fanning] [github-604] XDGF: add support for poly lines. Thanks to Dmitrii Komarov. This closes #604

[PJ Fanning] [github-601] XDGF: handle elliptical arcs that have colinear points. Thanks to Dmitrii Komarov. This closes #601

[PJ Fanning] rework test state

[PJ Fanning] update changes

[PJ Fanning] gradle 8.6

[PJ Fanning] [bug-68703] fix issue with XSLFTextRuns in XSLFTableCells

[PJ Fanning] [bug-68703] revert fix issue with XSLFTextRuns in XSLFTableCells

[PJ Fanning] [bug-68703] fix issue with XSLFTextRuns in XSLFTableCells


------------------------------------------
[...truncated 602.71 KB...]
[junitlauncher] Running org.apache.poi.ss.formula.ptg.TestArrayPtg
[junitlauncher] Tests run: 5, Failures: 0, Aborted: 0, Skipped: 0, Time elapsed: 0.002000 sec
[junitlauncher] Running org.apache.poi.ss.formula.ptg.TestAttrPtg
[junitlauncher] 
[junitlauncher] Running org.apache.poi.ss.formula.ptg.TestAttrPtg
[junitlauncher] Tests run: 1, Failures: 0, Aborted: 0, Skipped: 0, Time elapsed: 0.000000 sec
[junitlauncher] Running org.apache.poi.ss.formula.ptg.TestErrPtg
[junitlauncher] 
[junitlauncher] Running org.apache.poi.ss.formula.ptg.TestErrPtg
[junitlauncher] Tests run: 1, Failures: 0, Aborted: 0, Skipped: 0, Time elapsed: 0.001000 sec
[junitlauncher] Running org.apache.poi.ss.formula.ptg.TestExternalFunctionFormulas
[junitlauncher] 
[junitlauncher] Running org.apache.poi.ss.formula.ptg.TestExternalFunctionFormulas
[junitlauncher] Tests run: 3, Failures: 0, Aborted: 0, Skipped: 0, Time elapsed: 0.003000 sec
[junitlauncher] Running org.apache.poi.ss.formula.ptg.TestExternalNameReference
[junitlauncher] 
[junitlauncher] Running org.apache.poi.ss.formula.ptg.TestExternalNameReference
[junitlauncher] Tests run: 3, Failures: 0, Aborted: 0, Skipped: 0, Time elapsed: 0.004000 sec
[junitlauncher] Running org.apache.poi.ss.formula.ptg.TestFuncPtg
[junitlauncher] 
[junitlauncher] Running org.apache.poi.ss.formula.ptg.TestFuncPtg
[junitlauncher] Tests run: 2, Failures: 0, Aborted: 0, Skipped: 0, Time elapsed: 0.001000 sec
[junitlauncher] Running org.apache.poi.ss.formula.ptg.TestFuncVarPtg
[junitlauncher] 
[junitlauncher] Running org.apache.poi.ss.formula.ptg.TestFuncVarPtg
[junitlauncher] Tests run: 1, Failures: 0, Aborted: 0, Skipped: 0, Time elapsed: 0.000000 sec
[junitlauncher] Running org.apache.poi.ss.formula.ptg.TestIntersectionPtg
[junitlauncher] 
[junitlauncher] Running org.apache.poi.ss.formula.ptg.TestIntersectionPtg
[junitlauncher] Tests run: 1, Failures: 0, Aborted: 0, Skipped: 0, Time elapsed: 0.001000 sec
[junitlauncher] Running org.apache.poi.ss.formula.ptg.TestPercentPtg
[junitlauncher] 
[junitlauncher] Running org.apache.poi.ss.formula.ptg.TestPercentPtg
[junitlauncher] Tests run: 1, Failures: 0, Aborted: 0, Skipped: 0, Time elapsed: 0.001000 sec
[junitlauncher] Running org.apache.poi.ss.formula.ptg.TestRangePtg
[junitlauncher] 
[junitlauncher] Running org.apache.poi.ss.formula.ptg.TestRangePtg
[junitlauncher] Tests run: 1, Failures: 0, Aborted: 0, Skipped: 0, Time elapsed: 0.001000 sec
[junitlauncher] Running org.apache.poi.ss.formula.ptg.TestRef3DPtg
[junitlauncher] 
[junitlauncher] Running org.apache.poi.ss.formula.ptg.TestRef3DPtg
[junitlauncher] Tests run: 1, Failures: 0, Aborted: 0, Skipped: 0, Time elapsed: 0.000000 sec
[junitlauncher] Running org.apache.poi.ss.formula.ptg.TestReferencePtg
[junitlauncher] 
[junitlauncher] Running org.apache.poi.ss.formula.ptg.TestReferencePtg
[junitlauncher] Tests run: 4, Failures: 0, Aborted: 0, Skipped: 0, Time elapsed: 0.008000 sec
[junitlauncher] Running org.apache.poi.ss.formula.ptg.TestUnionPtg
[junitlauncher] 
[junitlauncher] Running org.apache.poi.ss.formula.ptg.TestUnionPtg
[junitlauncher] Tests run: 1, Failures: 0, Aborted: 0, Skipped: 0, Time elapsed: 0.001000 sec
[junitlauncher] Running org.apache.poi.ss.formula.udf.TestUDFFinder
[junitlauncher] 
[junitlauncher] Running org.apache.poi.ss.formula.udf.TestUDFFinder
[junitlauncher] Tests run: 4, Failures: 0, Aborted: 0, Skipped: 0, Time elapsed: 0.004000 sec
[junitlauncher] Running org.apache.poi.ss.usermodel.TestDataFormatter
[junitlauncher] 
[junitlauncher] Running org.apache.poi.ss.usermodel.TestDataFormatter
[junitlauncher] Tests run: 45, Failures: 0, Aborted: 0, Skipped: 1, Time elapsed: 0.398000 sec
[junitlauncher] Running org.apache.poi.ss.usermodel.TestDateUtil
[junitlauncher] 
[junitlauncher] Running org.apache.poi.ss.usermodel.TestDateUtil
[junitlauncher] Tests run: 26, Failures: 0, Aborted: 0, Skipped: 0, Time elapsed: 0.014000 sec
[junitlauncher] Running org.apache.poi.ss.usermodel.TestExcelStyleDateFormatter
[junitlauncher] 
[junitlauncher] Running org.apache.poi.ss.usermodel.TestExcelStyleDateFormatter
[junitlauncher] Tests run: 124, Failures: 0, Aborted: 0, Skipped: 0, Time elapsed: 0.066000 sec
[junitlauncher] Running org.apache.poi.ss.usermodel.TestFractionFormat
[junitlauncher] 
[junitlauncher] Running org.apache.poi.ss.usermodel.TestFractionFormat
[junitlauncher] Tests run: 5, Failures: 0, Aborted: 0, Skipped: 1, Time elapsed: 0.238000 sec
[junitlauncher] Running org.apache.poi.ss.usermodel.TestHSSFBorderStyle
[junitlauncher] 
[junitlauncher] Running org.apache.poi.ss.usermodel.TestHSSFBorderStyle
[junitlauncher] Tests run: 1, Failures: 0, Aborted: 0, Skipped: 0, Time elapsed: 0.001000 sec
[junitlauncher] Running org.apache.poi.ss.usermodel.TestIndexedColors
[junitlauncher] 
[junitlauncher] Running org.apache.poi.ss.usermodel.TestIndexedColors
[junitlauncher] Tests run: 3, Failures: 0, Aborted: 0, Skipped: 0, Time elapsed: 0.001000 sec
[junitlauncher] Running org.apache.poi.ss.util.TestAreaReference
[junitlauncher] 
[junitlauncher] Running org.apache.poi.ss.util.TestAreaReference
[junitlauncher] Tests run: 3, Failures: 0, Aborted: 0, Skipped: 0, Time elapsed: 0.002000 sec
[junitlauncher] Running org.apache.poi.ss.util.TestCellAddress
[junitlauncher] 
[junitlauncher] Running org.apache.poi.ss.util.TestCellAddress
[junitlauncher] Tests run: 6, Failures: 0, Aborted: 0, Skipped: 0, Time elapsed: 0.002000 sec
[junitlauncher] Running org.apache.poi.ss.util.TestCellRangeAddress
[junitlauncher] 
[junitlauncher] Running org.apache.poi.ss.util.TestCellRangeAddress
[junitlauncher] Tests run: 15, Failures: 0, Aborted: 0, Skipped: 0, Time elapsed: 0.010000 sec
[junitlauncher] Running org.apache.poi.ss.util.TestCellRangeUtil
[junitlauncher] 
[junitlauncher] Running org.apache.poi.ss.util.TestCellRangeUtil
[junitlauncher] Tests run: 1, Failures: 0, Aborted: 0, Skipped: 0, Time elapsed: 0.001000 sec
[junitlauncher] Running org.apache.poi.ss.util.TestCellReference
[junitlauncher] 
[junitlauncher] Running org.apache.poi.ss.util.TestCellReference
[junitlauncher] Tests run: 27, Failures: 0, Aborted: 0, Skipped: 0, Time elapsed: 0.210000 sec
[junitlauncher] Running org.apache.poi.ss.util.TestDateFormatConverter
[junitlauncher] 
[junitlauncher] Running org.apache.poi.ss.util.TestDateFormatConverter
[junitlauncher] Tests run: 19, Failures: 0, Aborted: 0, Skipped: 0, Time elapsed: 3.958000 sec
[junitlauncher] Running org.apache.poi.ss.util.TestDateParser
[junitlauncher] 
[junitlauncher] Running org.apache.poi.ss.util.TestDateParser
[junitlauncher] Tests run: 6, Failures: 0, Aborted: 0, Skipped: 0, Time elapsed: 0.005000 sec
[junitlauncher] Running org.apache.poi.ss.util.TestExpandedDouble
[junitlauncher] 
[junitlauncher] Running org.apache.poi.ss.util.TestExpandedDouble
[junitlauncher] Tests run: 19, Failures: 0, Aborted: 0, Skipped: 0, Time elapsed: 0.011000 sec
[junitlauncher] Running org.apache.poi.ss.util.TestHSSFCellUtil
[junitlauncher] 
[junitlauncher] Running org.apache.poi.ss.util.TestHSSFCellUtil
[junitlauncher] Tests run: 17, Failures: 0, Aborted: 0, Skipped: 0, Time elapsed: 0.020000 sec
[junitlauncher] Running org.apache.poi.ss.util.TestHSSFCellUtilCopy
[junitlauncher] 
[junitlauncher] Running org.apache.poi.ss.util.TestHSSFCellUtilCopy
[junitlauncher] Tests run: 6, Failures: 0, Aborted: 0, Skipped: 0, Time elapsed: 0.006000 sec
[junitlauncher] Running org.apache.poi.ss.util.TestImageUtils
[junitlauncher] 
[junitlauncher] Running org.apache.poi.ss.util.TestImageUtils
[junitlauncher] Tests run: 2, Failures: 0, Aborted: 0, Skipped: 0, Time elapsed: 0.005000 sec
[junitlauncher] Running org.apache.poi.ss.util.TestNumberComparer
[junitlauncher] 
[junitlauncher] Running org.apache.poi.ss.util.TestNumberComparer
[junitlauncher] Tests run: 116, Failures: 0, Aborted: 0, Skipped: 0, Time elapsed: 0.068000 sec
[junitlauncher] Running org.apache.poi.ss.util.TestNumberToTextConverter
[junitlauncher] 
[junitlauncher] Running org.apache.poi.ss.util.TestNumberToTextConverter
[junitlauncher] Tests run: 2, Failures: 0, Aborted: 0, Skipped: 0, Time elapsed: 0.006000 sec
[junitlauncher] Running org.apache.poi.ss.util.TestPaneInformation
[junitlauncher] 
[junitlauncher] Running org.apache.poi.ss.util.TestPaneInformation
[junitlauncher] Tests run: 2, Failures: 0, Aborted: 0, Skipped: 0, Time elapsed: 0.001000 sec
[junitlauncher] Running org.apache.poi.ss.util.TestPropertyTemplate
[junitlauncher] 
[junitlauncher] Running org.apache.poi.ss.util.TestPropertyTemplate
[junitlauncher] Tests run: 8, Failures: 0, Aborted: 0, Skipped: 0, Time elapsed: 0.019000 sec
[junitlauncher] Running org.apache.poi.ss.util.TestRegionUtil
[junitlauncher] 
[junitlauncher] Running org.apache.poi.ss.util.TestRegionUtil
[junitlauncher] Tests run: 10, Failures: 0, Aborted: 0, Skipped: 0, Time elapsed: 0.013000 sec
[junitlauncher] Running org.apache.poi.ss.util.TestSheetBuilder
[junitlauncher] 
[junitlauncher] Running org.apache.poi.ss.util.TestSheetBuilder
[junitlauncher] Tests run: 3, Failures: 0, Aborted: 0, Skipped: 0, Time elapsed: 0.003000 sec
[junitlauncher] Running org.apache.poi.ss.util.TestSheetUtil
[junitlauncher] 
[junitlauncher] Running org.apache.poi.ss.util.TestSheetUtil
[junitlauncher] Tests run: 10, Failures: 0, Aborted: 0, Skipped: 0, Time elapsed: 0.010000 sec
[junitlauncher] Running org.apache.poi.ss.util.TestWorkbookUtil
[junitlauncher] 
[junitlauncher] Running org.apache.poi.ss.util.TestWorkbookUtil
[junitlauncher] Tests run: 1, Failures: 0, Aborted: 0, Skipped: 0, Time elapsed: 0.000000 sec
[junitlauncher] Running org.apache.poi.ss.util.cellwalk.TestCellWalk
[junitlauncher] 
[junitlauncher] Running org.apache.poi.ss.util.cellwalk.TestCellWalk
[junitlauncher] Tests run: 1, Failures: 0, Aborted: 0, Skipped: 0, Time elapsed: 0.002000 sec
[junitlauncher] Running org.apache.poi.util.TestArrayUtil
[junitlauncher] 
[junitlauncher] Running org.apache.poi.util.TestArrayUtil
[junitlauncher] Tests run: 1, Failures: 0, Aborted: 0, Skipped: 0, Time elapsed: 0.001000 sec
[junitlauncher] Running org.apache.poi.util.TestBitField
[junitlauncher] 
[junitlauncher] Running org.apache.poi.util.TestBitField
[junitlauncher] Tests run: 16, Failures: 0, Aborted: 0, Skipped: 0, Time elapsed: 0.003000 sec
[junitlauncher] Running org.apache.poi.util.TestByteField
[junitlauncher] 
[junitlauncher] Running org.apache.poi.util.TestByteField
[junitlauncher] Tests run: 5, Failures: 0, Aborted: 0, Skipped: 0, Time elapsed: 0.003000 sec
[junitlauncher] Running org.apache.poi.util.TestCodepointsUtil
[junitlauncher] 
[junitlauncher] Running org.apache.poi.util.TestCodepointsUtil
[junitlauncher] Tests run: 2, Failures: 0, Aborted: 0, Skipped: 0, Time elapsed: 0.001000 sec
[junitlauncher] Running org.apache.poi.util.TestHexDump
[junitlauncher] 
[junitlauncher] Running org.apache.poi.util.TestHexDump
[junitlauncher] Tests run: 10, Failures: 0, Aborted: 0, Skipped: 0, Time elapsed: 0.011000 sec
[junitlauncher] Running org.apache.poi.util.TestIOUtils
[junitlauncher] 
[junitlauncher] Running org.apache.poi.util.TestIOUtils
[junitlauncher] Tests run: 59, Failures: 0, Aborted: 0, Skipped: 0, Time elapsed: 0.051000 sec
[junitlauncher] Running org.apache.poi.util.TestIntList
[junitlauncher] 
[junitlauncher] Running org.apache.poi.util.TestIntList
[junitlauncher] Tests run: 19, Failures: 0, Aborted: 0, Skipped: 0, Time elapsed: 0.050000 sec
[junitlauncher] Running org.apache.poi.util.TestIntegerField
[junitlauncher] 
[junitlauncher] Running org.apache.poi.util.TestIntegerField
[junitlauncher] Tests run: 5, Failures: 0, Aborted: 0, Skipped: 0, Time elapsed: 0.003000 sec
[junitlauncher] Running org.apache.poi.util.TestLittleEndian
[junitlauncher] 
[junitlauncher] Running org.apache.poi.util.TestLittleEndian
[junitlauncher] Tests run: 15, Failures: 0, Aborted: 0, Skipped: 0, Time elapsed: 0.003000 sec
[junitlauncher] Running org.apache.poi.util.TestLittleEndianInputStream
[junitlauncher] 
[junitlauncher] Running org.apache.poi.util.TestLittleEndianInputStream
[junitlauncher] Tests run: 2, Failures: 0, Aborted: 0, Skipped: 0, Time elapsed: 0.000000 sec
[junitlauncher] Running org.apache.poi.util.TestLittleEndianStreams
[junitlauncher] 
[junitlauncher] Running org.apache.poi.util.TestLittleEndianStreams
[junitlauncher] Tests run: 5, Failures: 0, Aborted: 0, Skipped: 0, Time elapsed: 0.002000 sec
[junitlauncher] Running org.apache.poi.util.TestLocaleUtil
[junitlauncher] 
[junitlauncher] Running org.apache.poi.util.TestLocaleUtil
[junitlauncher] Tests run: 3, Failures: 0, Aborted: 0, Skipped: 0, Time elapsed: 0.001000 sec
[junitlauncher] Running org.apache.poi.util.TestLongField
[junitlauncher] 
[junitlauncher] Running org.apache.poi.util.TestLongField
[junitlauncher] Tests run: 5, Failures: 0, Aborted: 0, Skipped: 0, Time elapsed: 0.002000 sec
[junitlauncher] Running org.apache.poi.util.TestRLEDecompressingInputStream
[junitlauncher] 
[junitlauncher] Running org.apache.poi.util.TestRLEDecompressingInputStream
[junitlauncher] Tests run: 4, Failures: 0, Aborted: 0, Skipped: 0, Time elapsed: 0.001000 sec
[junitlauncher] Running org.apache.poi.util.TestShortField
[junitlauncher] 
[junitlauncher] Running org.apache.poi.util.TestShortField
[junitlauncher] Tests run: 5, Failures: 0, Aborted: 0, Skipped: 0, Time elapsed: 0.002000 sec
[junitlauncher] Running org.apache.poi.util.TestStringUtil
[junitlauncher] 
[junitlauncher] Running org.apache.poi.util.TestStringUtil
[junitlauncher] Tests run: 7, Failures: 0, Aborted: 0, Skipped: 0, Time elapsed: 0.002000 sec
[junitlauncher] Running org.apache.poi.util.TestTempFile
[junitlauncher] 
[junitlauncher] Running org.apache.poi.util.TestTempFile
[junitlauncher] Tests run: 4, Failures: 0, Aborted: 0, Skipped: 0, Time elapsed: 0.007000 sec
[junitlauncher] Running org.apache.poi.util.TestThreadLocalUtil
[junitlauncher] 
[junitlauncher] Running org.apache.poi.util.TestThreadLocalUtil
[junitlauncher] Tests run: 2, Failures: 0, Aborted: 0, Skipped: 0, Time elapsed: 0.247000 sec
[junitlauncher] Running org.apache.poi.util.TestXMLHelper
[junitlauncher] 
[junitlauncher] Running org.apache.poi.util.TestXMLHelper
[junitlauncher]    Failed: testNewXMLInputFactory(): org.opentest4j.AssertionFailedError: expected: java.lang.Boolean@55d0645d<false> but was: java.lang.String@48950a5d<false>
[junitlauncher] Tests run: 9, Failures: 1, Aborted: 0, Skipped: 0, Time elapsed: 0.262000 sec

BUILD FAILED
<https://ci-builds.apache.org/job/POI/job/POI-DSL-1.22/ws/build.xml>:1691: The following error occurred while executing this line:
<https://ci-builds.apache.org/job/POI/job/POI-DSL-1.22/ws/build.xml>:1385: Some test(s) have failure(s)

Total time: 6 minutes 25 seconds
Build step 'Invoke Ant' marked build as failure
ERROR: Not all environment variables could be successfully injected. Check for similarly-named environment variables.
Archiving artifacts
ERROR: Not all environment variables could be successfully injected. Check for similarly-named environment variables.
Recording test results
ERROR: Not all environment variables could be successfully injected. Check for similarly-named environment variables.
[Checks API] No suitable checks publisher found.
ERROR: Not all environment variables could be successfully injected. Check for similarly-named environment variables.

---------------------------------------------------------------------
To unsubscribe, e-mail: dev-unsubscribe@poi.apache.org
For additional commands, e-mail: dev-help@poi.apache.org


Build failed in Jenkins: POI » POI-DSL-1.22 #31

Posted by Apache Jenkins Server <je...@builds.apache.org>.
See <https://ci-builds.apache.org/job/POI/job/POI-DSL-1.22/31/display/redirect?page=changes>

Changes:

[Axel Howind] enable gradle caching again

[Axel Howind] use diamond operator

[Axel Howind] use method reference

[Axel Howind] use Map.computeIfAbsent()


------------------------------------------
[...truncated 159.10 KB...]
[junitlauncher] Running org.apache.poi.ss.formula.ptg.TestArrayPtg
[junitlauncher] Tests run: 5, Failures: 0, Aborted: 0, Skipped: 0, Time elapsed: 0.003000 sec
[junitlauncher] Running org.apache.poi.ss.formula.ptg.TestAttrPtg
[junitlauncher] 
[junitlauncher] Running org.apache.poi.ss.formula.ptg.TestAttrPtg
[junitlauncher] Tests run: 1, Failures: 0, Aborted: 0, Skipped: 0, Time elapsed: 0.000000 sec
[junitlauncher] Running org.apache.poi.ss.formula.ptg.TestErrPtg
[junitlauncher] 
[junitlauncher] Running org.apache.poi.ss.formula.ptg.TestErrPtg
[junitlauncher] Tests run: 1, Failures: 0, Aborted: 0, Skipped: 0, Time elapsed: 0.001000 sec
[junitlauncher] Running org.apache.poi.ss.formula.ptg.TestExternalFunctionFormulas
[junitlauncher] 
[junitlauncher] Running org.apache.poi.ss.formula.ptg.TestExternalFunctionFormulas
[junitlauncher] Tests run: 3, Failures: 0, Aborted: 0, Skipped: 0, Time elapsed: 0.003000 sec
[junitlauncher] Running org.apache.poi.ss.formula.ptg.TestExternalNameReference
[junitlauncher] 
[junitlauncher] Running org.apache.poi.ss.formula.ptg.TestExternalNameReference
[junitlauncher] Tests run: 3, Failures: 0, Aborted: 0, Skipped: 0, Time elapsed: 0.007000 sec
[junitlauncher] Running org.apache.poi.ss.formula.ptg.TestFuncPtg
[junitlauncher] 
[junitlauncher] Running org.apache.poi.ss.formula.ptg.TestFuncPtg
[junitlauncher] Tests run: 2, Failures: 0, Aborted: 0, Skipped: 0, Time elapsed: 0.000000 sec
[junitlauncher] Running org.apache.poi.ss.formula.ptg.TestFuncVarPtg
[junitlauncher] 
[junitlauncher] Running org.apache.poi.ss.formula.ptg.TestFuncVarPtg
[junitlauncher] Tests run: 1, Failures: 0, Aborted: 0, Skipped: 0, Time elapsed: 0.000000 sec
[junitlauncher] Running org.apache.poi.ss.formula.ptg.TestIntersectionPtg
[junitlauncher] 
[junitlauncher] Running org.apache.poi.ss.formula.ptg.TestIntersectionPtg
[junitlauncher] Tests run: 1, Failures: 0, Aborted: 0, Skipped: 0, Time elapsed: 0.001000 sec
[junitlauncher] Running org.apache.poi.ss.formula.ptg.TestPercentPtg
[junitlauncher] 
[junitlauncher] Running org.apache.poi.ss.formula.ptg.TestPercentPtg
[junitlauncher] Tests run: 1, Failures: 0, Aborted: 0, Skipped: 0, Time elapsed: 0.001000 sec
[junitlauncher] Running org.apache.poi.ss.formula.ptg.TestRangePtg
[junitlauncher] 
[junitlauncher] Running org.apache.poi.ss.formula.ptg.TestRangePtg
[junitlauncher] Tests run: 1, Failures: 0, Aborted: 0, Skipped: 0, Time elapsed: 0.001000 sec
[junitlauncher] Running org.apache.poi.ss.formula.ptg.TestRef3DPtg
[junitlauncher] 
[junitlauncher] Running org.apache.poi.ss.formula.ptg.TestRef3DPtg
[junitlauncher] Tests run: 1, Failures: 0, Aborted: 0, Skipped: 0, Time elapsed: 0.001000 sec
[junitlauncher] Running org.apache.poi.ss.formula.ptg.TestReferencePtg
[junitlauncher] 
[junitlauncher] Running org.apache.poi.ss.formula.ptg.TestReferencePtg
[junitlauncher] Tests run: 4, Failures: 0, Aborted: 0, Skipped: 0, Time elapsed: 0.026000 sec
[junitlauncher] Running org.apache.poi.ss.formula.ptg.TestUnionPtg
[junitlauncher] 
[junitlauncher] Running org.apache.poi.ss.formula.ptg.TestUnionPtg
[junitlauncher] Tests run: 1, Failures: 0, Aborted: 0, Skipped: 0, Time elapsed: 0.001000 sec
[junitlauncher] Running org.apache.poi.ss.formula.udf.TestUDFFinder
[junitlauncher] 
[junitlauncher] Running org.apache.poi.ss.formula.udf.TestUDFFinder
[junitlauncher] Tests run: 4, Failures: 0, Aborted: 0, Skipped: 0, Time elapsed: 0.003000 sec
[junitlauncher] Running org.apache.poi.ss.usermodel.TestDataFormatter
[junitlauncher] 
[junitlauncher] Running org.apache.poi.ss.usermodel.TestDataFormatter
[junitlauncher] Tests run: 45, Failures: 0, Aborted: 0, Skipped: 1, Time elapsed: 0.524000 sec
[junitlauncher] Running org.apache.poi.ss.usermodel.TestDateUtil
[junitlauncher] 
[junitlauncher] Running org.apache.poi.ss.usermodel.TestDateUtil
[junitlauncher] Tests run: 26, Failures: 0, Aborted: 0, Skipped: 0, Time elapsed: 0.024000 sec
[junitlauncher] Running org.apache.poi.ss.usermodel.TestExcelStyleDateFormatter
[junitlauncher] 
[junitlauncher] Running org.apache.poi.ss.usermodel.TestExcelStyleDateFormatter
[junitlauncher] Tests run: 124, Failures: 0, Aborted: 0, Skipped: 0, Time elapsed: 0.083000 sec
[junitlauncher] Running org.apache.poi.ss.usermodel.TestFractionFormat
[junitlauncher] 
[junitlauncher] Running org.apache.poi.ss.usermodel.TestFractionFormat
[junitlauncher] Tests run: 5, Failures: 0, Aborted: 0, Skipped: 1, Time elapsed: 0.277000 sec
[junitlauncher] Running org.apache.poi.ss.usermodel.TestHSSFBorderStyle
[junitlauncher] 
[junitlauncher] Running org.apache.poi.ss.usermodel.TestHSSFBorderStyle
[junitlauncher] Tests run: 1, Failures: 0, Aborted: 0, Skipped: 0, Time elapsed: 0.002000 sec
[junitlauncher] Running org.apache.poi.ss.usermodel.TestIndexedColors
[junitlauncher] 
[junitlauncher] Running org.apache.poi.ss.usermodel.TestIndexedColors
[junitlauncher] Tests run: 3, Failures: 0, Aborted: 0, Skipped: 0, Time elapsed: 0.002000 sec
[junitlauncher] Running org.apache.poi.ss.util.TestAreaReference
[junitlauncher] 
[junitlauncher] Running org.apache.poi.ss.util.TestAreaReference
[junitlauncher] Tests run: 3, Failures: 0, Aborted: 0, Skipped: 0, Time elapsed: 0.001000 sec
[junitlauncher] Running org.apache.poi.ss.util.TestCellAddress
[junitlauncher] 
[junitlauncher] Running org.apache.poi.ss.util.TestCellAddress
[junitlauncher] Tests run: 6, Failures: 0, Aborted: 0, Skipped: 0, Time elapsed: 0.001000 sec
[junitlauncher] Running org.apache.poi.ss.util.TestCellRangeAddress
[junitlauncher] 
[junitlauncher] Running org.apache.poi.ss.util.TestCellRangeAddress
[junitlauncher] Tests run: 15, Failures: 0, Aborted: 0, Skipped: 0, Time elapsed: 0.008000 sec
[junitlauncher] Running org.apache.poi.ss.util.TestCellRangeUtil
[junitlauncher] 
[junitlauncher] Running org.apache.poi.ss.util.TestCellRangeUtil
[junitlauncher] Tests run: 1, Failures: 0, Aborted: 0, Skipped: 0, Time elapsed: 0.001000 sec
[junitlauncher] Running org.apache.poi.ss.util.TestCellReference
[junitlauncher] 
[junitlauncher] Running org.apache.poi.ss.util.TestCellReference
[junitlauncher] Tests run: 27, Failures: 0, Aborted: 0, Skipped: 0, Time elapsed: 0.243000 sec
[junitlauncher] Running org.apache.poi.ss.util.TestDateFormatConverter
[junitlauncher] 
[junitlauncher] Running org.apache.poi.ss.util.TestDateFormatConverter
[junitlauncher] Tests run: 19, Failures: 0, Aborted: 0, Skipped: 0, Time elapsed: 5.504000 sec
[junitlauncher] Running org.apache.poi.ss.util.TestDateParser
[junitlauncher] 
[junitlauncher] Running org.apache.poi.ss.util.TestDateParser
[junitlauncher] Tests run: 6, Failures: 0, Aborted: 0, Skipped: 0, Time elapsed: 0.006000 sec
[junitlauncher] Running org.apache.poi.ss.util.TestExpandedDouble
[junitlauncher] 
[junitlauncher] Running org.apache.poi.ss.util.TestExpandedDouble
[junitlauncher] Tests run: 19, Failures: 0, Aborted: 0, Skipped: 0, Time elapsed: 0.016000 sec
[junitlauncher] Running org.apache.poi.ss.util.TestHSSFCellUtil
[junitlauncher] 
[junitlauncher] Running org.apache.poi.ss.util.TestHSSFCellUtil
[junitlauncher] Tests run: 17, Failures: 0, Aborted: 0, Skipped: 0, Time elapsed: 0.024000 sec
[junitlauncher] Running org.apache.poi.ss.util.TestHSSFCellUtilCopy
[junitlauncher] 
[junitlauncher] Running org.apache.poi.ss.util.TestHSSFCellUtilCopy
[junitlauncher] Tests run: 6, Failures: 0, Aborted: 0, Skipped: 0, Time elapsed: 0.007000 sec
[junitlauncher] Running org.apache.poi.ss.util.TestImageUtils
[junitlauncher] 
[junitlauncher] Running org.apache.poi.ss.util.TestImageUtils
[junitlauncher] Tests run: 2, Failures: 0, Aborted: 0, Skipped: 0, Time elapsed: 0.006000 sec
[junitlauncher] Running org.apache.poi.ss.util.TestNumberComparer
[junitlauncher] 
[junitlauncher] Running org.apache.poi.ss.util.TestNumberComparer
[junitlauncher] Tests run: 116, Failures: 0, Aborted: 0, Skipped: 0, Time elapsed: 0.078000 sec
[junitlauncher] Running org.apache.poi.ss.util.TestNumberToTextConverter
[junitlauncher] 
[junitlauncher] Running org.apache.poi.ss.util.TestNumberToTextConverter
[junitlauncher] Tests run: 2, Failures: 0, Aborted: 0, Skipped: 0, Time elapsed: 0.005000 sec
[junitlauncher] Running org.apache.poi.ss.util.TestPaneInformation
[junitlauncher] 
[junitlauncher] Running org.apache.poi.ss.util.TestPaneInformation
[junitlauncher] Tests run: 2, Failures: 0, Aborted: 0, Skipped: 0, Time elapsed: 0.001000 sec
[junitlauncher] Running org.apache.poi.ss.util.TestPropertyTemplate
[junitlauncher] 
[junitlauncher] Running org.apache.poi.ss.util.TestPropertyTemplate
[junitlauncher] Tests run: 8, Failures: 0, Aborted: 0, Skipped: 0, Time elapsed: 0.018000 sec
[junitlauncher] Running org.apache.poi.ss.util.TestRegionUtil
[junitlauncher] 
[junitlauncher] Running org.apache.poi.ss.util.TestRegionUtil
[junitlauncher] Tests run: 10, Failures: 0, Aborted: 0, Skipped: 0, Time elapsed: 0.021000 sec
[junitlauncher] Running org.apache.poi.ss.util.TestSheetBuilder
[junitlauncher] 
[junitlauncher] Running org.apache.poi.ss.util.TestSheetBuilder
[junitlauncher] Tests run: 3, Failures: 0, Aborted: 0, Skipped: 0, Time elapsed: 0.006000 sec
[junitlauncher] Running org.apache.poi.ss.util.TestSheetUtil
[junitlauncher] 
[junitlauncher] Running org.apache.poi.ss.util.TestSheetUtil
[junitlauncher] Tests run: 10, Failures: 0, Aborted: 0, Skipped: 0, Time elapsed: 0.012000 sec
[junitlauncher] Running org.apache.poi.ss.util.TestWorkbookUtil
[junitlauncher] 
[junitlauncher] Running org.apache.poi.ss.util.TestWorkbookUtil
[junitlauncher] Tests run: 1, Failures: 0, Aborted: 0, Skipped: 0, Time elapsed: 0.000000 sec
[junitlauncher] Running org.apache.poi.ss.util.cellwalk.TestCellWalk
[junitlauncher] 
[junitlauncher] Running org.apache.poi.ss.util.cellwalk.TestCellWalk
[junitlauncher] Tests run: 1, Failures: 0, Aborted: 0, Skipped: 0, Time elapsed: 0.003000 sec
[junitlauncher] Running org.apache.poi.util.TestArrayUtil
[junitlauncher] 
[junitlauncher] Running org.apache.poi.util.TestArrayUtil
[junitlauncher] Tests run: 1, Failures: 0, Aborted: 0, Skipped: 0, Time elapsed: 0.002000 sec
[junitlauncher] Running org.apache.poi.util.TestBitField
[junitlauncher] 
[junitlauncher] Running org.apache.poi.util.TestBitField
[junitlauncher] Tests run: 16, Failures: 0, Aborted: 0, Skipped: 0, Time elapsed: 0.004000 sec
[junitlauncher] Running org.apache.poi.util.TestByteField
[junitlauncher] 
[junitlauncher] Running org.apache.poi.util.TestByteField
[junitlauncher] Tests run: 5, Failures: 0, Aborted: 0, Skipped: 0, Time elapsed: 0.003000 sec
[junitlauncher] Running org.apache.poi.util.TestCodepointsUtil
[junitlauncher] 
[junitlauncher] Running org.apache.poi.util.TestCodepointsUtil
[junitlauncher] Tests run: 2, Failures: 0, Aborted: 0, Skipped: 0, Time elapsed: 0.001000 sec
[junitlauncher] Running org.apache.poi.util.TestHexDump
[junitlauncher] 
[junitlauncher] Running org.apache.poi.util.TestHexDump
[junitlauncher] Tests run: 10, Failures: 0, Aborted: 0, Skipped: 0, Time elapsed: 0.017000 sec
[junitlauncher] Running org.apache.poi.util.TestIOUtils
[junitlauncher] 
[junitlauncher] Running org.apache.poi.util.TestIOUtils
[junitlauncher] Tests run: 59, Failures: 0, Aborted: 0, Skipped: 0, Time elapsed: 0.086000 sec
[junitlauncher] Running org.apache.poi.util.TestIntList
[junitlauncher] 
[junitlauncher] Running org.apache.poi.util.TestIntList
[junitlauncher] Tests run: 19, Failures: 0, Aborted: 0, Skipped: 0, Time elapsed: 0.043000 sec
[junitlauncher] Running org.apache.poi.util.TestIntegerField
[junitlauncher] 
[junitlauncher] Running org.apache.poi.util.TestIntegerField
[junitlauncher] Tests run: 5, Failures: 0, Aborted: 0, Skipped: 0, Time elapsed: 0.003000 sec
[junitlauncher] Running org.apache.poi.util.TestLittleEndian
[junitlauncher] 
[junitlauncher] Running org.apache.poi.util.TestLittleEndian
[junitlauncher] Tests run: 15, Failures: 0, Aborted: 0, Skipped: 0, Time elapsed: 0.005000 sec
[junitlauncher] Running org.apache.poi.util.TestLittleEndianInputStream
[junitlauncher] 
[junitlauncher] Running org.apache.poi.util.TestLittleEndianInputStream
[junitlauncher] Tests run: 2, Failures: 0, Aborted: 0, Skipped: 0, Time elapsed: 0.000000 sec
[junitlauncher] Running org.apache.poi.util.TestLittleEndianStreams
[junitlauncher] 
[junitlauncher] Running org.apache.poi.util.TestLittleEndianStreams
[junitlauncher] Tests run: 5, Failures: 0, Aborted: 0, Skipped: 0, Time elapsed: 0.003000 sec
[junitlauncher] Running org.apache.poi.util.TestLocaleUtil
[junitlauncher] 
[junitlauncher] Running org.apache.poi.util.TestLocaleUtil
[junitlauncher] Tests run: 3, Failures: 0, Aborted: 0, Skipped: 0, Time elapsed: 0.001000 sec
[junitlauncher] Running org.apache.poi.util.TestLongField
[junitlauncher] 
[junitlauncher] Running org.apache.poi.util.TestLongField
[junitlauncher] Tests run: 5, Failures: 0, Aborted: 0, Skipped: 0, Time elapsed: 0.004000 sec
[junitlauncher] Running org.apache.poi.util.TestRLEDecompressingInputStream
[junitlauncher] 
[junitlauncher] Running org.apache.poi.util.TestRLEDecompressingInputStream
[junitlauncher] Tests run: 4, Failures: 0, Aborted: 0, Skipped: 0, Time elapsed: 0.001000 sec
[junitlauncher] Running org.apache.poi.util.TestShortField
[junitlauncher] 
[junitlauncher] Running org.apache.poi.util.TestShortField
[junitlauncher] Tests run: 5, Failures: 0, Aborted: 0, Skipped: 0, Time elapsed: 0.003000 sec
[junitlauncher] Running org.apache.poi.util.TestStringUtil
[junitlauncher] 
[junitlauncher] Running org.apache.poi.util.TestStringUtil
[junitlauncher] Tests run: 7, Failures: 0, Aborted: 0, Skipped: 0, Time elapsed: 0.004000 sec
[junitlauncher] Running org.apache.poi.util.TestTempFile
[junitlauncher] 
[junitlauncher] Running org.apache.poi.util.TestTempFile
[junitlauncher] Tests run: 4, Failures: 0, Aborted: 0, Skipped: 0, Time elapsed: 0.041000 sec
[junitlauncher] Running org.apache.poi.util.TestThreadLocalUtil
[junitlauncher] 
[junitlauncher] Running org.apache.poi.util.TestThreadLocalUtil
[junitlauncher] Tests run: 2, Failures: 0, Aborted: 0, Skipped: 0, Time elapsed: 0.257000 sec
[junitlauncher] Running org.apache.poi.util.TestXMLHelper
[junitlauncher] 
[junitlauncher] Running org.apache.poi.util.TestXMLHelper
[junitlauncher]    Failed: testNewXMLInputFactory(): org.opentest4j.AssertionFailedError: expected: java.lang.Boolean@6f9c9971<false> but was: java.lang.String@48950a5d<false>
[junitlauncher] Tests run: 9, Failures: 1, Aborted: 0, Skipped: 0, Time elapsed: 0.248000 sec

BUILD FAILED
<https://ci-builds.apache.org/job/POI/job/POI-DSL-1.22/ws/build.xml>:1691: The following error occurred while executing this line:
<https://ci-builds.apache.org/job/POI/job/POI-DSL-1.22/ws/build.xml>:1385: Some test(s) have failure(s)

Total time: 8 minutes 47 seconds
Build step 'Invoke Ant' marked build as failure
ERROR: Not all environment variables could be successfully injected. Check for similarly-named environment variables.
Archiving artifacts
ERROR: Not all environment variables could be successfully injected. Check for similarly-named environment variables.
Recording test results
ERROR: Not all environment variables could be successfully injected. Check for similarly-named environment variables.
[Checks API] No suitable checks publisher found.
ERROR: Not all environment variables could be successfully injected. Check for similarly-named environment variables.

---------------------------------------------------------------------
To unsubscribe, e-mail: dev-unsubscribe@poi.apache.org
For additional commands, e-mail: dev-help@poi.apache.org


Build failed in Jenkins: POI » POI-DSL-1.22 #30

Posted by Apache Jenkins Server <je...@builds.apache.org>.
See <https://ci-builds.apache.org/job/POI/job/POI-DSL-1.22/30/display/redirect?page=changes>

Changes:

[PJ Fanning] rework tests

[PJ Fanning] woodstox 6.6.1

[PJ Fanning] update changes


------------------------------------------
[...truncated 602.64 KB...]
[junitlauncher] Running org.apache.poi.ss.formula.ptg.TestArrayPtg
[junitlauncher] Tests run: 5, Failures: 0, Aborted: 0, Skipped: 0, Time elapsed: 0.002000 sec
[junitlauncher] Running org.apache.poi.ss.formula.ptg.TestAttrPtg
[junitlauncher] 
[junitlauncher] Running org.apache.poi.ss.formula.ptg.TestAttrPtg
[junitlauncher] Tests run: 1, Failures: 0, Aborted: 0, Skipped: 0, Time elapsed: 0.000000 sec
[junitlauncher] Running org.apache.poi.ss.formula.ptg.TestErrPtg
[junitlauncher] 
[junitlauncher] Running org.apache.poi.ss.formula.ptg.TestErrPtg
[junitlauncher] Tests run: 1, Failures: 0, Aborted: 0, Skipped: 0, Time elapsed: 0.001000 sec
[junitlauncher] Running org.apache.poi.ss.formula.ptg.TestExternalFunctionFormulas
[junitlauncher] 
[junitlauncher] Running org.apache.poi.ss.formula.ptg.TestExternalFunctionFormulas
[junitlauncher] Tests run: 3, Failures: 0, Aborted: 0, Skipped: 0, Time elapsed: 0.004000 sec
[junitlauncher] Running org.apache.poi.ss.formula.ptg.TestExternalNameReference
[junitlauncher] 
[junitlauncher] Running org.apache.poi.ss.formula.ptg.TestExternalNameReference
[junitlauncher] Tests run: 3, Failures: 0, Aborted: 0, Skipped: 0, Time elapsed: 0.006000 sec
[junitlauncher] Running org.apache.poi.ss.formula.ptg.TestFuncPtg
[junitlauncher] 
[junitlauncher] Running org.apache.poi.ss.formula.ptg.TestFuncPtg
[junitlauncher] Tests run: 2, Failures: 0, Aborted: 0, Skipped: 0, Time elapsed: 0.000000 sec
[junitlauncher] Running org.apache.poi.ss.formula.ptg.TestFuncVarPtg
[junitlauncher] 
[junitlauncher] Running org.apache.poi.ss.formula.ptg.TestFuncVarPtg
[junitlauncher] Tests run: 1, Failures: 0, Aborted: 0, Skipped: 0, Time elapsed: 0.000000 sec
[junitlauncher] Running org.apache.poi.ss.formula.ptg.TestIntersectionPtg
[junitlauncher] 
[junitlauncher] Running org.apache.poi.ss.formula.ptg.TestIntersectionPtg
[junitlauncher] Tests run: 1, Failures: 0, Aborted: 0, Skipped: 0, Time elapsed: 0.001000 sec
[junitlauncher] Running org.apache.poi.ss.formula.ptg.TestPercentPtg
[junitlauncher] 
[junitlauncher] Running org.apache.poi.ss.formula.ptg.TestPercentPtg
[junitlauncher] Tests run: 1, Failures: 0, Aborted: 0, Skipped: 0, Time elapsed: 0.001000 sec
[junitlauncher] Running org.apache.poi.ss.formula.ptg.TestRangePtg
[junitlauncher] 
[junitlauncher] Running org.apache.poi.ss.formula.ptg.TestRangePtg
[junitlauncher] Tests run: 1, Failures: 0, Aborted: 0, Skipped: 0, Time elapsed: 0.001000 sec
[junitlauncher] Running org.apache.poi.ss.formula.ptg.TestRef3DPtg
[junitlauncher] 
[junitlauncher] Running org.apache.poi.ss.formula.ptg.TestRef3DPtg
[junitlauncher] Tests run: 1, Failures: 0, Aborted: 0, Skipped: 0, Time elapsed: 0.000000 sec
[junitlauncher] Running org.apache.poi.ss.formula.ptg.TestReferencePtg
[junitlauncher] 
[junitlauncher] Running org.apache.poi.ss.formula.ptg.TestReferencePtg
[junitlauncher] Tests run: 4, Failures: 0, Aborted: 0, Skipped: 0, Time elapsed: 0.013000 sec
[junitlauncher] Running org.apache.poi.ss.formula.ptg.TestUnionPtg
[junitlauncher] 
[junitlauncher] Running org.apache.poi.ss.formula.ptg.TestUnionPtg
[junitlauncher] Tests run: 1, Failures: 0, Aborted: 0, Skipped: 0, Time elapsed: 0.001000 sec
[junitlauncher] Running org.apache.poi.ss.formula.udf.TestUDFFinder
[junitlauncher] 
[junitlauncher] Running org.apache.poi.ss.formula.udf.TestUDFFinder
[junitlauncher] Tests run: 4, Failures: 0, Aborted: 0, Skipped: 0, Time elapsed: 0.002000 sec
[junitlauncher] Running org.apache.poi.ss.usermodel.TestDataFormatter
[junitlauncher] 
[junitlauncher] Running org.apache.poi.ss.usermodel.TestDataFormatter
[junitlauncher] Tests run: 45, Failures: 0, Aborted: 0, Skipped: 1, Time elapsed: 0.634000 sec
[junitlauncher] Running org.apache.poi.ss.usermodel.TestDateUtil
[junitlauncher] 
[junitlauncher] Running org.apache.poi.ss.usermodel.TestDateUtil
[junitlauncher] Tests run: 26, Failures: 0, Aborted: 0, Skipped: 0, Time elapsed: 0.022000 sec
[junitlauncher] Running org.apache.poi.ss.usermodel.TestExcelStyleDateFormatter
[junitlauncher] 
[junitlauncher] Running org.apache.poi.ss.usermodel.TestExcelStyleDateFormatter
[junitlauncher] Tests run: 124, Failures: 0, Aborted: 0, Skipped: 0, Time elapsed: 0.079000 sec
[junitlauncher] Running org.apache.poi.ss.usermodel.TestFractionFormat
[junitlauncher] 
[junitlauncher] Running org.apache.poi.ss.usermodel.TestFractionFormat
[junitlauncher] Tests run: 5, Failures: 0, Aborted: 0, Skipped: 1, Time elapsed: 0.339000 sec
[junitlauncher] Running org.apache.poi.ss.usermodel.TestHSSFBorderStyle
[junitlauncher] 
[junitlauncher] Running org.apache.poi.ss.usermodel.TestHSSFBorderStyle
[junitlauncher] Tests run: 1, Failures: 0, Aborted: 0, Skipped: 0, Time elapsed: 0.001000 sec
[junitlauncher] Running org.apache.poi.ss.usermodel.TestIndexedColors
[junitlauncher] 
[junitlauncher] Running org.apache.poi.ss.usermodel.TestIndexedColors
[junitlauncher] Tests run: 3, Failures: 0, Aborted: 0, Skipped: 0, Time elapsed: 0.002000 sec
[junitlauncher] Running org.apache.poi.ss.util.TestAreaReference
[junitlauncher] 
[junitlauncher] Running org.apache.poi.ss.util.TestAreaReference
[junitlauncher] Tests run: 3, Failures: 0, Aborted: 0, Skipped: 0, Time elapsed: 0.001000 sec
[junitlauncher] Running org.apache.poi.ss.util.TestCellAddress
[junitlauncher] 
[junitlauncher] Running org.apache.poi.ss.util.TestCellAddress
[junitlauncher] Tests run: 6, Failures: 0, Aborted: 0, Skipped: 0, Time elapsed: 0.002000 sec
[junitlauncher] Running org.apache.poi.ss.util.TestCellRangeAddress
[junitlauncher] 
[junitlauncher] Running org.apache.poi.ss.util.TestCellRangeAddress
[junitlauncher] Tests run: 15, Failures: 0, Aborted: 0, Skipped: 0, Time elapsed: 0.019000 sec
[junitlauncher] Running org.apache.poi.ss.util.TestCellRangeUtil
[junitlauncher] 
[junitlauncher] Running org.apache.poi.ss.util.TestCellRangeUtil
[junitlauncher] Tests run: 1, Failures: 0, Aborted: 0, Skipped: 0, Time elapsed: 0.001000 sec
[junitlauncher] Running org.apache.poi.ss.util.TestCellReference
[junitlauncher] 
[junitlauncher] Running org.apache.poi.ss.util.TestCellReference
[junitlauncher] Tests run: 27, Failures: 0, Aborted: 0, Skipped: 0, Time elapsed: 1.091000 sec
[junitlauncher] Running org.apache.poi.ss.util.TestDateFormatConverter
[junitlauncher] 
[junitlauncher] Running org.apache.poi.ss.util.TestDateFormatConverter
[junitlauncher] Tests run: 19, Failures: 0, Aborted: 0, Skipped: 0, Time elapsed: 30.214000 sec
[junitlauncher] Running org.apache.poi.ss.util.TestDateParser
[junitlauncher] 
[junitlauncher] Running org.apache.poi.ss.util.TestDateParser
[junitlauncher] Tests run: 6, Failures: 0, Aborted: 0, Skipped: 0, Time elapsed: 0.070000 sec
[junitlauncher] Running org.apache.poi.ss.util.TestExpandedDouble
[junitlauncher] 
[junitlauncher] Running org.apache.poi.ss.util.TestExpandedDouble
[junitlauncher] Tests run: 19, Failures: 0, Aborted: 0, Skipped: 0, Time elapsed: 0.069000 sec
[junitlauncher] Running org.apache.poi.ss.util.TestHSSFCellUtil
[junitlauncher] 
[junitlauncher] Running org.apache.poi.ss.util.TestHSSFCellUtil
[junitlauncher] Tests run: 17, Failures: 0, Aborted: 0, Skipped: 0, Time elapsed: 0.119000 sec
[junitlauncher] Running org.apache.poi.ss.util.TestHSSFCellUtilCopy
[junitlauncher] 
[junitlauncher] Running org.apache.poi.ss.util.TestHSSFCellUtilCopy
[junitlauncher] Tests run: 6, Failures: 0, Aborted: 0, Skipped: 0, Time elapsed: 0.056000 sec
[junitlauncher] Running org.apache.poi.ss.util.TestImageUtils
[junitlauncher] 
[junitlauncher] Running org.apache.poi.ss.util.TestImageUtils
[junitlauncher] Tests run: 2, Failures: 0, Aborted: 0, Skipped: 0, Time elapsed: 0.042000 sec
[junitlauncher] Running org.apache.poi.ss.util.TestNumberComparer
[junitlauncher] 
[junitlauncher] Running org.apache.poi.ss.util.TestNumberComparer
[junitlauncher] Tests run: 116, Failures: 0, Aborted: 0, Skipped: 0, Time elapsed: 0.613000 sec
[junitlauncher] Running org.apache.poi.ss.util.TestNumberToTextConverter
[junitlauncher] 
[junitlauncher] Running org.apache.poi.ss.util.TestNumberToTextConverter
[junitlauncher] Tests run: 2, Failures: 0, Aborted: 0, Skipped: 0, Time elapsed: 0.040000 sec
[junitlauncher] Running org.apache.poi.ss.util.TestPaneInformation
[junitlauncher] 
[junitlauncher] Running org.apache.poi.ss.util.TestPaneInformation
[junitlauncher] Tests run: 2, Failures: 0, Aborted: 0, Skipped: 0, Time elapsed: 0.000000 sec
[junitlauncher] Running org.apache.poi.ss.util.TestPropertyTemplate
[junitlauncher] 
[junitlauncher] Running org.apache.poi.ss.util.TestPropertyTemplate
[junitlauncher] Tests run: 8, Failures: 0, Aborted: 0, Skipped: 0, Time elapsed: 0.177000 sec
[junitlauncher] Running org.apache.poi.ss.util.TestRegionUtil
[junitlauncher] 
[junitlauncher] Running org.apache.poi.ss.util.TestRegionUtil
[junitlauncher] Tests run: 10, Failures: 0, Aborted: 0, Skipped: 0, Time elapsed: 0.109000 sec
[junitlauncher] Running org.apache.poi.ss.util.TestSheetBuilder
[junitlauncher] 
[junitlauncher] Running org.apache.poi.ss.util.TestSheetBuilder
[junitlauncher] Tests run: 3, Failures: 0, Aborted: 0, Skipped: 0, Time elapsed: 0.002000 sec
[junitlauncher] Running org.apache.poi.ss.util.TestSheetUtil
[junitlauncher] 
[junitlauncher] Running org.apache.poi.ss.util.TestSheetUtil
[junitlauncher] Tests run: 10, Failures: 0, Aborted: 0, Skipped: 0, Time elapsed: 0.058000 sec
[junitlauncher] Running org.apache.poi.ss.util.TestWorkbookUtil
[junitlauncher] 
[junitlauncher] Running org.apache.poi.ss.util.TestWorkbookUtil
[junitlauncher] Tests run: 1, Failures: 0, Aborted: 0, Skipped: 0, Time elapsed: 0.000000 sec
[junitlauncher] Running org.apache.poi.ss.util.cellwalk.TestCellWalk
[junitlauncher] 
[junitlauncher] Running org.apache.poi.ss.util.cellwalk.TestCellWalk
[junitlauncher] Tests run: 1, Failures: 0, Aborted: 0, Skipped: 0, Time elapsed: 0.002000 sec
[junitlauncher] Running org.apache.poi.util.TestArrayUtil
[junitlauncher] 
[junitlauncher] Running org.apache.poi.util.TestArrayUtil
[junitlauncher] Tests run: 1, Failures: 0, Aborted: 0, Skipped: 0, Time elapsed: 0.002000 sec
[junitlauncher] Running org.apache.poi.util.TestBitField
[junitlauncher] 
[junitlauncher] Running org.apache.poi.util.TestBitField
[junitlauncher] Tests run: 16, Failures: 0, Aborted: 0, Skipped: 0, Time elapsed: 0.008000 sec
[junitlauncher] Running org.apache.poi.util.TestByteField
[junitlauncher] 
[junitlauncher] Running org.apache.poi.util.TestByteField
[junitlauncher] Tests run: 5, Failures: 0, Aborted: 0, Skipped: 0, Time elapsed: 0.025000 sec
[junitlauncher] Running org.apache.poi.util.TestCodepointsUtil
[junitlauncher] 
[junitlauncher] Running org.apache.poi.util.TestCodepointsUtil
[junitlauncher] Tests run: 2, Failures: 0, Aborted: 0, Skipped: 0, Time elapsed: 0.011000 sec
[junitlauncher] Running org.apache.poi.util.TestHexDump
[junitlauncher] 
[junitlauncher] Running org.apache.poi.util.TestHexDump
[junitlauncher] Tests run: 10, Failures: 0, Aborted: 0, Skipped: 0, Time elapsed: 0.088000 sec
[junitlauncher] Running org.apache.poi.util.TestIOUtils
[junitlauncher] 
[junitlauncher] Running org.apache.poi.util.TestIOUtils
[junitlauncher] Tests run: 59, Failures: 0, Aborted: 0, Skipped: 0, Time elapsed: 0.315000 sec
[junitlauncher] Running org.apache.poi.util.TestIntList
[junitlauncher] 
[junitlauncher] Running org.apache.poi.util.TestIntList
[junitlauncher] Tests run: 19, Failures: 0, Aborted: 0, Skipped: 0, Time elapsed: 0.315000 sec
[junitlauncher] Running org.apache.poi.util.TestIntegerField
[junitlauncher] 
[junitlauncher] Running org.apache.poi.util.TestIntegerField
[junitlauncher] Tests run: 5, Failures: 0, Aborted: 0, Skipped: 0, Time elapsed: 0.033000 sec
[junitlauncher] Running org.apache.poi.util.TestLittleEndian
[junitlauncher] 
[junitlauncher] Running org.apache.poi.util.TestLittleEndian
[junitlauncher] Tests run: 15, Failures: 0, Aborted: 0, Skipped: 0, Time elapsed: 0.032000 sec
[junitlauncher] Running org.apache.poi.util.TestLittleEndianInputStream
[junitlauncher] 
[junitlauncher] Running org.apache.poi.util.TestLittleEndianInputStream
[junitlauncher] Tests run: 2, Failures: 0, Aborted: 0, Skipped: 0, Time elapsed: 0.000000 sec
[junitlauncher] Running org.apache.poi.util.TestLittleEndianStreams
[junitlauncher] 
[junitlauncher] Running org.apache.poi.util.TestLittleEndianStreams
[junitlauncher] Tests run: 5, Failures: 0, Aborted: 0, Skipped: 0, Time elapsed: 0.003000 sec
[junitlauncher] Running org.apache.poi.util.TestLocaleUtil
[junitlauncher] 
[junitlauncher] Running org.apache.poi.util.TestLocaleUtil
[junitlauncher] Tests run: 3, Failures: 0, Aborted: 0, Skipped: 0, Time elapsed: 0.002000 sec
[junitlauncher] Running org.apache.poi.util.TestLongField
[junitlauncher] 
[junitlauncher] Running org.apache.poi.util.TestLongField
[junitlauncher] Tests run: 5, Failures: 0, Aborted: 0, Skipped: 0, Time elapsed: 0.004000 sec
[junitlauncher] Running org.apache.poi.util.TestRLEDecompressingInputStream
[junitlauncher] 
[junitlauncher] Running org.apache.poi.util.TestRLEDecompressingInputStream
[junitlauncher] Tests run: 4, Failures: 0, Aborted: 0, Skipped: 0, Time elapsed: 0.014000 sec
[junitlauncher] Running org.apache.poi.util.TestShortField
[junitlauncher] 
[junitlauncher] Running org.apache.poi.util.TestShortField
[junitlauncher] Tests run: 5, Failures: 0, Aborted: 0, Skipped: 0, Time elapsed: 0.004000 sec
[junitlauncher] Running org.apache.poi.util.TestStringUtil
[junitlauncher] 
[junitlauncher] Running org.apache.poi.util.TestStringUtil
[junitlauncher] Tests run: 7, Failures: 0, Aborted: 0, Skipped: 0, Time elapsed: 0.025000 sec
[junitlauncher] Running org.apache.poi.util.TestTempFile
[junitlauncher] 
[junitlauncher] Running org.apache.poi.util.TestTempFile
[junitlauncher] Tests run: 4, Failures: 0, Aborted: 0, Skipped: 0, Time elapsed: 0.109000 sec
[junitlauncher] Running org.apache.poi.util.TestThreadLocalUtil
[junitlauncher] 
[junitlauncher] Running org.apache.poi.util.TestThreadLocalUtil
[junitlauncher] Tests run: 2, Failures: 0, Aborted: 0, Skipped: 0, Time elapsed: 1.004000 sec
[junitlauncher] Running org.apache.poi.util.TestXMLHelper
[junitlauncher] 
[junitlauncher] Running org.apache.poi.util.TestXMLHelper
[junitlauncher]    Failed: testNewXMLInputFactory(): org.opentest4j.AssertionFailedError: expected: java.lang.Boolean@16deb03d<false> but was: java.lang.String@48950a5d<false>
[junitlauncher] Tests run: 9, Failures: 1, Aborted: 0, Skipped: 0, Time elapsed: 0.732000 sec

BUILD FAILED
<https://ci-builds.apache.org/job/POI/job/POI-DSL-1.22/ws/build.xml>:1691: The following error occurred while executing this line:
<https://ci-builds.apache.org/job/POI/job/POI-DSL-1.22/ws/build.xml>:1385: Some test(s) have failure(s)

Total time: 10 minutes 34 seconds
Build step 'Invoke Ant' marked build as failure
ERROR: Not all environment variables could be successfully injected. Check for similarly-named environment variables.
Archiving artifacts
ERROR: Not all environment variables could be successfully injected. Check for similarly-named environment variables.
Recording test results
ERROR: Not all environment variables could be successfully injected. Check for similarly-named environment variables.
[Checks API] No suitable checks publisher found.
ERROR: Not all environment variables could be successfully injected. Check for similarly-named environment variables.

---------------------------------------------------------------------
To unsubscribe, e-mail: dev-unsubscribe@poi.apache.org
For additional commands, e-mail: dev-help@poi.apache.org


Build failed in Jenkins: POI » POI-DSL-1.22 #29

Posted by Apache Jenkins Server <je...@builds.apache.org>.
See <https://ci-builds.apache.org/job/POI/job/POI-DSL-1.22/29/display/redirect?page=changes>

Changes:

[Axel Howind] Math.toIntExact is unnecessary because value is guaranteed to be between 0 and 15

[Axel Howind] replace List<Byte> with ByteArrayOutputStream to avoid boxing/unboxing and repeated copying of data

[PJ Fanning] xmlsec 3.0.4

[Axel Howind] do not write single bytes


------------------------------------------
[...truncated 602.47 KB...]
[junitlauncher] Running org.apache.poi.ss.formula.ptg.TestArrayPtg
[junitlauncher] Tests run: 5, Failures: 0, Aborted: 0, Skipped: 0, Time elapsed: 0.002000 sec
[junitlauncher] Running org.apache.poi.ss.formula.ptg.TestAttrPtg
[junitlauncher] 
[junitlauncher] Running org.apache.poi.ss.formula.ptg.TestAttrPtg
[junitlauncher] Tests run: 1, Failures: 0, Aborted: 0, Skipped: 0, Time elapsed: 0.000000 sec
[junitlauncher] Running org.apache.poi.ss.formula.ptg.TestErrPtg
[junitlauncher] 
[junitlauncher] Running org.apache.poi.ss.formula.ptg.TestErrPtg
[junitlauncher] Tests run: 1, Failures: 0, Aborted: 0, Skipped: 0, Time elapsed: 0.001000 sec
[junitlauncher] Running org.apache.poi.ss.formula.ptg.TestExternalFunctionFormulas
[junitlauncher] 
[junitlauncher] Running org.apache.poi.ss.formula.ptg.TestExternalFunctionFormulas
[junitlauncher] Tests run: 3, Failures: 0, Aborted: 0, Skipped: 0, Time elapsed: 0.004000 sec
[junitlauncher] Running org.apache.poi.ss.formula.ptg.TestExternalNameReference
[junitlauncher] 
[junitlauncher] Running org.apache.poi.ss.formula.ptg.TestExternalNameReference
[junitlauncher] Tests run: 3, Failures: 0, Aborted: 0, Skipped: 0, Time elapsed: 0.004000 sec
[junitlauncher] Running org.apache.poi.ss.formula.ptg.TestFuncPtg
[junitlauncher] 
[junitlauncher] Running org.apache.poi.ss.formula.ptg.TestFuncPtg
[junitlauncher] Tests run: 2, Failures: 0, Aborted: 0, Skipped: 0, Time elapsed: 0.000000 sec
[junitlauncher] Running org.apache.poi.ss.formula.ptg.TestFuncVarPtg
[junitlauncher] 
[junitlauncher] Running org.apache.poi.ss.formula.ptg.TestFuncVarPtg
[junitlauncher] Tests run: 1, Failures: 0, Aborted: 0, Skipped: 0, Time elapsed: 0.000000 sec
[junitlauncher] Running org.apache.poi.ss.formula.ptg.TestIntersectionPtg
[junitlauncher] 
[junitlauncher] Running org.apache.poi.ss.formula.ptg.TestIntersectionPtg
[junitlauncher] Tests run: 1, Failures: 0, Aborted: 0, Skipped: 0, Time elapsed: 0.001000 sec
[junitlauncher] Running org.apache.poi.ss.formula.ptg.TestPercentPtg
[junitlauncher] 
[junitlauncher] Running org.apache.poi.ss.formula.ptg.TestPercentPtg
[junitlauncher] Tests run: 1, Failures: 0, Aborted: 0, Skipped: 0, Time elapsed: 0.001000 sec
[junitlauncher] Running org.apache.poi.ss.formula.ptg.TestRangePtg
[junitlauncher] 
[junitlauncher] Running org.apache.poi.ss.formula.ptg.TestRangePtg
[junitlauncher] Tests run: 1, Failures: 0, Aborted: 0, Skipped: 0, Time elapsed: 0.001000 sec
[junitlauncher] Running org.apache.poi.ss.formula.ptg.TestRef3DPtg
[junitlauncher] 
[junitlauncher] Running org.apache.poi.ss.formula.ptg.TestRef3DPtg
[junitlauncher] Tests run: 1, Failures: 0, Aborted: 0, Skipped: 0, Time elapsed: 0.000000 sec
[junitlauncher] Running org.apache.poi.ss.formula.ptg.TestReferencePtg
[junitlauncher] 
[junitlauncher] Running org.apache.poi.ss.formula.ptg.TestReferencePtg
[junitlauncher] Tests run: 4, Failures: 0, Aborted: 0, Skipped: 0, Time elapsed: 0.011000 sec
[junitlauncher] Running org.apache.poi.ss.formula.ptg.TestUnionPtg
[junitlauncher] 
[junitlauncher] Running org.apache.poi.ss.formula.ptg.TestUnionPtg
[junitlauncher] Tests run: 1, Failures: 0, Aborted: 0, Skipped: 0, Time elapsed: 0.001000 sec
[junitlauncher] Running org.apache.poi.ss.formula.udf.TestUDFFinder
[junitlauncher] 
[junitlauncher] Running org.apache.poi.ss.formula.udf.TestUDFFinder
[junitlauncher] Tests run: 4, Failures: 0, Aborted: 0, Skipped: 0, Time elapsed: 0.002000 sec
[junitlauncher] Running org.apache.poi.ss.usermodel.TestDataFormatter
[junitlauncher] 
[junitlauncher] Running org.apache.poi.ss.usermodel.TestDataFormatter
[junitlauncher] Tests run: 45, Failures: 0, Aborted: 0, Skipped: 1, Time elapsed: 0.375000 sec
[junitlauncher] Running org.apache.poi.ss.usermodel.TestDateUtil
[junitlauncher] 
[junitlauncher] Running org.apache.poi.ss.usermodel.TestDateUtil
[junitlauncher] Tests run: 26, Failures: 0, Aborted: 0, Skipped: 0, Time elapsed: 0.012000 sec
[junitlauncher] Running org.apache.poi.ss.usermodel.TestExcelStyleDateFormatter
[junitlauncher] 
[junitlauncher] Running org.apache.poi.ss.usermodel.TestExcelStyleDateFormatter
[junitlauncher] Tests run: 124, Failures: 0, Aborted: 0, Skipped: 0, Time elapsed: 0.075000 sec
[junitlauncher] Running org.apache.poi.ss.usermodel.TestFractionFormat
[junitlauncher] 
[junitlauncher] Running org.apache.poi.ss.usermodel.TestFractionFormat
[junitlauncher] Tests run: 5, Failures: 0, Aborted: 0, Skipped: 1, Time elapsed: 0.251000 sec
[junitlauncher] Running org.apache.poi.ss.usermodel.TestHSSFBorderStyle
[junitlauncher] 
[junitlauncher] Running org.apache.poi.ss.usermodel.TestHSSFBorderStyle
[junitlauncher] Tests run: 1, Failures: 0, Aborted: 0, Skipped: 0, Time elapsed: 0.002000 sec
[junitlauncher] Running org.apache.poi.ss.usermodel.TestIndexedColors
[junitlauncher] 
[junitlauncher] Running org.apache.poi.ss.usermodel.TestIndexedColors
[junitlauncher] Tests run: 3, Failures: 0, Aborted: 0, Skipped: 0, Time elapsed: 0.001000 sec
[junitlauncher] Running org.apache.poi.ss.util.TestAreaReference
[junitlauncher] 
[junitlauncher] Running org.apache.poi.ss.util.TestAreaReference
[junitlauncher] Tests run: 3, Failures: 0, Aborted: 0, Skipped: 0, Time elapsed: 0.001000 sec
[junitlauncher] Running org.apache.poi.ss.util.TestCellAddress
[junitlauncher] 
[junitlauncher] Running org.apache.poi.ss.util.TestCellAddress
[junitlauncher] Tests run: 6, Failures: 0, Aborted: 0, Skipped: 0, Time elapsed: 0.001000 sec
[junitlauncher] Running org.apache.poi.ss.util.TestCellRangeAddress
[junitlauncher] 
[junitlauncher] Running org.apache.poi.ss.util.TestCellRangeAddress
[junitlauncher] Tests run: 15, Failures: 0, Aborted: 0, Skipped: 0, Time elapsed: 0.008000 sec
[junitlauncher] Running org.apache.poi.ss.util.TestCellRangeUtil
[junitlauncher] 
[junitlauncher] Running org.apache.poi.ss.util.TestCellRangeUtil
[junitlauncher] Tests run: 1, Failures: 0, Aborted: 0, Skipped: 0, Time elapsed: 0.001000 sec
[junitlauncher] Running org.apache.poi.ss.util.TestCellReference
[junitlauncher] 
[junitlauncher] Running org.apache.poi.ss.util.TestCellReference
[junitlauncher] Tests run: 27, Failures: 0, Aborted: 0, Skipped: 0, Time elapsed: 0.210000 sec
[junitlauncher] Running org.apache.poi.ss.util.TestDateFormatConverter
[junitlauncher] 
[junitlauncher] Running org.apache.poi.ss.util.TestDateFormatConverter
[junitlauncher] Tests run: 19, Failures: 0, Aborted: 0, Skipped: 0, Time elapsed: 3.766000 sec
[junitlauncher] Running org.apache.poi.ss.util.TestDateParser
[junitlauncher] 
[junitlauncher] Running org.apache.poi.ss.util.TestDateParser
[junitlauncher] Tests run: 6, Failures: 0, Aborted: 0, Skipped: 0, Time elapsed: 0.005000 sec
[junitlauncher] Running org.apache.poi.ss.util.TestExpandedDouble
[junitlauncher] 
[junitlauncher] Running org.apache.poi.ss.util.TestExpandedDouble
[junitlauncher] Tests run: 19, Failures: 0, Aborted: 0, Skipped: 0, Time elapsed: 0.012000 sec
[junitlauncher] Running org.apache.poi.ss.util.TestHSSFCellUtil
[junitlauncher] 
[junitlauncher] Running org.apache.poi.ss.util.TestHSSFCellUtil
[junitlauncher] Tests run: 17, Failures: 0, Aborted: 0, Skipped: 0, Time elapsed: 0.018000 sec
[junitlauncher] Running org.apache.poi.ss.util.TestHSSFCellUtilCopy
[junitlauncher] 
[junitlauncher] Running org.apache.poi.ss.util.TestHSSFCellUtilCopy
[junitlauncher] Tests run: 6, Failures: 0, Aborted: 0, Skipped: 0, Time elapsed: 0.006000 sec
[junitlauncher] Running org.apache.poi.ss.util.TestImageUtils
[junitlauncher] 
[junitlauncher] Running org.apache.poi.ss.util.TestImageUtils
[junitlauncher] Tests run: 2, Failures: 0, Aborted: 0, Skipped: 0, Time elapsed: 0.006000 sec
[junitlauncher] Running org.apache.poi.ss.util.TestNumberComparer
[junitlauncher] 
[junitlauncher] Running org.apache.poi.ss.util.TestNumberComparer
[junitlauncher] Tests run: 116, Failures: 0, Aborted: 0, Skipped: 0, Time elapsed: 0.084000 sec
[junitlauncher] Running org.apache.poi.ss.util.TestNumberToTextConverter
[junitlauncher] 
[junitlauncher] Running org.apache.poi.ss.util.TestNumberToTextConverter
[junitlauncher] Tests run: 2, Failures: 0, Aborted: 0, Skipped: 0, Time elapsed: 0.004000 sec
[junitlauncher] Running org.apache.poi.ss.util.TestPaneInformation
[junitlauncher] 
[junitlauncher] Running org.apache.poi.ss.util.TestPaneInformation
[junitlauncher] Tests run: 2, Failures: 0, Aborted: 0, Skipped: 0, Time elapsed: 0.000000 sec
[junitlauncher] Running org.apache.poi.ss.util.TestPropertyTemplate
[junitlauncher] 
[junitlauncher] Running org.apache.poi.ss.util.TestPropertyTemplate
[junitlauncher] Tests run: 8, Failures: 0, Aborted: 0, Skipped: 0, Time elapsed: 0.013000 sec
[junitlauncher] Running org.apache.poi.ss.util.TestRegionUtil
[junitlauncher] 
[junitlauncher] Running org.apache.poi.ss.util.TestRegionUtil
[junitlauncher] Tests run: 10, Failures: 0, Aborted: 0, Skipped: 0, Time elapsed: 0.012000 sec
[junitlauncher] Running org.apache.poi.ss.util.TestSheetBuilder
[junitlauncher] 
[junitlauncher] Running org.apache.poi.ss.util.TestSheetBuilder
[junitlauncher] Tests run: 3, Failures: 0, Aborted: 0, Skipped: 0, Time elapsed: 0.002000 sec
[junitlauncher] Running org.apache.poi.ss.util.TestSheetUtil
[junitlauncher] 
[junitlauncher] Running org.apache.poi.ss.util.TestSheetUtil
[junitlauncher] Tests run: 10, Failures: 0, Aborted: 0, Skipped: 0, Time elapsed: 0.007000 sec
[junitlauncher] Running org.apache.poi.ss.util.TestWorkbookUtil
[junitlauncher] 
[junitlauncher] Running org.apache.poi.ss.util.TestWorkbookUtil
[junitlauncher] Tests run: 1, Failures: 0, Aborted: 0, Skipped: 0, Time elapsed: 0.000000 sec
[junitlauncher] Running org.apache.poi.ss.util.cellwalk.TestCellWalk
[junitlauncher] 
[junitlauncher] Running org.apache.poi.ss.util.cellwalk.TestCellWalk
[junitlauncher] Tests run: 1, Failures: 0, Aborted: 0, Skipped: 0, Time elapsed: 0.002000 sec
[junitlauncher] Running org.apache.poi.util.TestArrayUtil
[junitlauncher] 
[junitlauncher] Running org.apache.poi.util.TestArrayUtil
[junitlauncher] Tests run: 1, Failures: 0, Aborted: 0, Skipped: 0, Time elapsed: 0.001000 sec
[junitlauncher] Running org.apache.poi.util.TestBitField
[junitlauncher] 
[junitlauncher] Running org.apache.poi.util.TestBitField
[junitlauncher] Tests run: 16, Failures: 0, Aborted: 0, Skipped: 0, Time elapsed: 0.003000 sec
[junitlauncher] Running org.apache.poi.util.TestByteField
[junitlauncher] 
[junitlauncher] Running org.apache.poi.util.TestByteField
[junitlauncher] Tests run: 5, Failures: 0, Aborted: 0, Skipped: 0, Time elapsed: 0.002000 sec
[junitlauncher] Running org.apache.poi.util.TestCodepointsUtil
[junitlauncher] 
[junitlauncher] Running org.apache.poi.util.TestCodepointsUtil
[junitlauncher] Tests run: 2, Failures: 0, Aborted: 0, Skipped: 0, Time elapsed: 0.001000 sec
[junitlauncher] Running org.apache.poi.util.TestHexDump
[junitlauncher] 
[junitlauncher] Running org.apache.poi.util.TestHexDump
[junitlauncher] Tests run: 10, Failures: 0, Aborted: 0, Skipped: 0, Time elapsed: 0.010000 sec
[junitlauncher] Running org.apache.poi.util.TestIOUtils
[junitlauncher] 
[junitlauncher] Running org.apache.poi.util.TestIOUtils
[junitlauncher] Tests run: 59, Failures: 0, Aborted: 0, Skipped: 0, Time elapsed: 0.048000 sec
[junitlauncher] Running org.apache.poi.util.TestIntList
[junitlauncher] 
[junitlauncher] Running org.apache.poi.util.TestIntList
[junitlauncher] Tests run: 19, Failures: 0, Aborted: 0, Skipped: 0, Time elapsed: 0.038000 sec
[junitlauncher] Running org.apache.poi.util.TestIntegerField
[junitlauncher] 
[junitlauncher] Running org.apache.poi.util.TestIntegerField
[junitlauncher] Tests run: 5, Failures: 0, Aborted: 0, Skipped: 0, Time elapsed: 0.004000 sec
[junitlauncher] Running org.apache.poi.util.TestLittleEndian
[junitlauncher] 
[junitlauncher] Running org.apache.poi.util.TestLittleEndian
[junitlauncher] Tests run: 15, Failures: 0, Aborted: 0, Skipped: 0, Time elapsed: 0.004000 sec
[junitlauncher] Running org.apache.poi.util.TestLittleEndianInputStream
[junitlauncher] 
[junitlauncher] Running org.apache.poi.util.TestLittleEndianInputStream
[junitlauncher] Tests run: 2, Failures: 0, Aborted: 0, Skipped: 0, Time elapsed: 0.000000 sec
[junitlauncher] Running org.apache.poi.util.TestLittleEndianStreams
[junitlauncher] 
[junitlauncher] Running org.apache.poi.util.TestLittleEndianStreams
[junitlauncher] Tests run: 5, Failures: 0, Aborted: 0, Skipped: 0, Time elapsed: 0.002000 sec
[junitlauncher] Running org.apache.poi.util.TestLocaleUtil
[junitlauncher] 
[junitlauncher] Running org.apache.poi.util.TestLocaleUtil
[junitlauncher] Tests run: 3, Failures: 0, Aborted: 0, Skipped: 0, Time elapsed: 0.001000 sec
[junitlauncher] Running org.apache.poi.util.TestLongField
[junitlauncher] 
[junitlauncher] Running org.apache.poi.util.TestLongField
[junitlauncher] Tests run: 5, Failures: 0, Aborted: 0, Skipped: 0, Time elapsed: 0.003000 sec
[junitlauncher] Running org.apache.poi.util.TestRLEDecompressingInputStream
[junitlauncher] 
[junitlauncher] Running org.apache.poi.util.TestRLEDecompressingInputStream
[junitlauncher] Tests run: 4, Failures: 0, Aborted: 0, Skipped: 0, Time elapsed: 0.001000 sec
[junitlauncher] Running org.apache.poi.util.TestShortField
[junitlauncher] 
[junitlauncher] Running org.apache.poi.util.TestShortField
[junitlauncher] Tests run: 5, Failures: 0, Aborted: 0, Skipped: 0, Time elapsed: 0.002000 sec
[junitlauncher] Running org.apache.poi.util.TestStringUtil
[junitlauncher] 
[junitlauncher] Running org.apache.poi.util.TestStringUtil
[junitlauncher] Tests run: 7, Failures: 0, Aborted: 0, Skipped: 0, Time elapsed: 0.003000 sec
[junitlauncher] Running org.apache.poi.util.TestTempFile
[junitlauncher] 
[junitlauncher] Running org.apache.poi.util.TestTempFile
[junitlauncher] Tests run: 4, Failures: 0, Aborted: 0, Skipped: 0, Time elapsed: 0.007000 sec
[junitlauncher] Running org.apache.poi.util.TestThreadLocalUtil
[junitlauncher] 
[junitlauncher] Running org.apache.poi.util.TestThreadLocalUtil
[junitlauncher] Tests run: 2, Failures: 0, Aborted: 0, Skipped: 0, Time elapsed: 0.233000 sec
[junitlauncher] Running org.apache.poi.util.TestXMLHelper
[junitlauncher] 
[junitlauncher] Running org.apache.poi.util.TestXMLHelper
[junitlauncher]    Failed: testNewXMLInputFactory(): java.lang.ClassCastException: class java.lang.String cannot be cast to class java.lang.Boolean (java.lang.String and java.lang.Boolean are in module java.base of loader 'bootstrap')
[junitlauncher] Tests run: 9, Failures: 1, Aborted: 0, Skipped: 0, Time elapsed: 0.321000 sec

BUILD FAILED
<https://ci-builds.apache.org/job/POI/job/POI-DSL-1.22/ws/build.xml>:1691: The following error occurred while executing this line:
<https://ci-builds.apache.org/job/POI/job/POI-DSL-1.22/ws/build.xml>:1385: Some test(s) have failure(s)

Total time: 6 minutes 27 seconds
Build step 'Invoke Ant' marked build as failure
ERROR: Not all environment variables could be successfully injected. Check for similarly-named environment variables.
Archiving artifacts
ERROR: Not all environment variables could be successfully injected. Check for similarly-named environment variables.
Recording test results
ERROR: Not all environment variables could be successfully injected. Check for similarly-named environment variables.
[Checks API] No suitable checks publisher found.
ERROR: Not all environment variables could be successfully injected. Check for similarly-named environment variables.

---------------------------------------------------------------------
To unsubscribe, e-mail: dev-unsubscribe@poi.apache.org
For additional commands, e-mail: dev-help@poi.apache.org


Build failed in Jenkins: POI » POI-DSL-1.22 #28

Posted by Apache Jenkins Server <je...@builds.apache.org>.
See <https://ci-builds.apache.org/job/POI/job/POI-DSL-1.22/28/display/redirect?page=changes>

Changes:

[Axel Howind] fix Logging issues:

- don't use foreign class in Logger initialization
- update log statements to use MessageFormat syntax

[Axel Howind] make loggers static final

[PJ Fanning] log4j 2.23.0

[Axel Howind] move setting of locale for tests to top level build.gradle

[Dominik Stadler] Fix Ant-build after upgrade of commons-compress

Commons-lang3 is now required as dependency of commons-compress

[Dominik Stadler] Jenkins DSL: Use sonar-task and sonar.token instead of sonar.login

This removes some build-warnings

[Dominik Stadler] Switch builds for JDK 22 and 23 to Ant for now

Gradle does not yet support newer JDKs

See https://docs.gradle.org/current/userguide/compatibility.html
and https://github.com/gradle/gradle/issues/26162

[PJ Fanning] try to fix issue with invalid files after commons-compress upgrade

[PJ Fanning] commons-compress 1.26.0

[PJ Fanning] [github-596] Change cast logic in HSSFChart. Thanks to Ruby Hartono. This closes #596

[PJ Fanning] remove unused loggers. Thanks to Ruby Hartono. This closes #594 and closes #595


------------------------------------------
[...truncated 600.20 KB...]
[junitlauncher] Running org.apache.poi.ss.formula.ptg.TestArrayPtg
[junitlauncher] Tests run: 5, Failures: 0, Aborted: 0, Skipped: 0, Time elapsed: 0.002000 sec
[junitlauncher] Running org.apache.poi.ss.formula.ptg.TestAttrPtg
[junitlauncher] 
[junitlauncher] Running org.apache.poi.ss.formula.ptg.TestAttrPtg
[junitlauncher] Tests run: 1, Failures: 0, Aborted: 0, Skipped: 0, Time elapsed: 0.000000 sec
[junitlauncher] Running org.apache.poi.ss.formula.ptg.TestErrPtg
[junitlauncher] 
[junitlauncher] Running org.apache.poi.ss.formula.ptg.TestErrPtg
[junitlauncher] Tests run: 1, Failures: 0, Aborted: 0, Skipped: 0, Time elapsed: 0.001000 sec
[junitlauncher] Running org.apache.poi.ss.formula.ptg.TestExternalFunctionFormulas
[junitlauncher] 
[junitlauncher] Running org.apache.poi.ss.formula.ptg.TestExternalFunctionFormulas
[junitlauncher] Tests run: 3, Failures: 0, Aborted: 0, Skipped: 0, Time elapsed: 0.003000 sec
[junitlauncher] Running org.apache.poi.ss.formula.ptg.TestExternalNameReference
[junitlauncher] 
[junitlauncher] Running org.apache.poi.ss.formula.ptg.TestExternalNameReference
[junitlauncher] Tests run: 3, Failures: 0, Aborted: 0, Skipped: 0, Time elapsed: 0.004000 sec
[junitlauncher] Running org.apache.poi.ss.formula.ptg.TestFuncPtg
[junitlauncher] 
[junitlauncher] Running org.apache.poi.ss.formula.ptg.TestFuncPtg
[junitlauncher] Tests run: 2, Failures: 0, Aborted: 0, Skipped: 0, Time elapsed: 0.000000 sec
[junitlauncher] Running org.apache.poi.ss.formula.ptg.TestFuncVarPtg
[junitlauncher] 
[junitlauncher] Running org.apache.poi.ss.formula.ptg.TestFuncVarPtg
[junitlauncher] Tests run: 1, Failures: 0, Aborted: 0, Skipped: 0, Time elapsed: 0.000000 sec
[junitlauncher] Running org.apache.poi.ss.formula.ptg.TestIntersectionPtg
[junitlauncher] 
[junitlauncher] Running org.apache.poi.ss.formula.ptg.TestIntersectionPtg
[junitlauncher] Tests run: 1, Failures: 0, Aborted: 0, Skipped: 0, Time elapsed: 0.001000 sec
[junitlauncher] Running org.apache.poi.ss.formula.ptg.TestPercentPtg
[junitlauncher] 
[junitlauncher] Running org.apache.poi.ss.formula.ptg.TestPercentPtg
[junitlauncher] Tests run: 1, Failures: 0, Aborted: 0, Skipped: 0, Time elapsed: 0.001000 sec
[junitlauncher] Running org.apache.poi.ss.formula.ptg.TestRangePtg
[junitlauncher] 
[junitlauncher] Running org.apache.poi.ss.formula.ptg.TestRangePtg
[junitlauncher] Tests run: 1, Failures: 0, Aborted: 0, Skipped: 0, Time elapsed: 0.001000 sec
[junitlauncher] Running org.apache.poi.ss.formula.ptg.TestRef3DPtg
[junitlauncher] 
[junitlauncher] Running org.apache.poi.ss.formula.ptg.TestRef3DPtg
[junitlauncher] Tests run: 1, Failures: 0, Aborted: 0, Skipped: 0, Time elapsed: 0.000000 sec
[junitlauncher] Running org.apache.poi.ss.formula.ptg.TestReferencePtg
[junitlauncher] 
[junitlauncher] Running org.apache.poi.ss.formula.ptg.TestReferencePtg
[junitlauncher] Tests run: 4, Failures: 0, Aborted: 0, Skipped: 0, Time elapsed: 0.010000 sec
[junitlauncher] Running org.apache.poi.ss.formula.ptg.TestUnionPtg
[junitlauncher] 
[junitlauncher] Running org.apache.poi.ss.formula.ptg.TestUnionPtg
[junitlauncher] Tests run: 1, Failures: 0, Aborted: 0, Skipped: 0, Time elapsed: 0.001000 sec
[junitlauncher] Running org.apache.poi.ss.formula.udf.TestUDFFinder
[junitlauncher] 
[junitlauncher] Running org.apache.poi.ss.formula.udf.TestUDFFinder
[junitlauncher] Tests run: 4, Failures: 0, Aborted: 0, Skipped: 0, Time elapsed: 0.003000 sec
[junitlauncher] Running org.apache.poi.ss.usermodel.TestDataFormatter
[junitlauncher] 
[junitlauncher] Running org.apache.poi.ss.usermodel.TestDataFormatter
[junitlauncher] Tests run: 45, Failures: 0, Aborted: 0, Skipped: 1, Time elapsed: 0.531000 sec
[junitlauncher] Running org.apache.poi.ss.usermodel.TestDateUtil
[junitlauncher] 
[junitlauncher] Running org.apache.poi.ss.usermodel.TestDateUtil
[junitlauncher] Tests run: 26, Failures: 0, Aborted: 0, Skipped: 0, Time elapsed: 0.017000 sec
[junitlauncher] Running org.apache.poi.ss.usermodel.TestExcelStyleDateFormatter
[junitlauncher] 
[junitlauncher] Running org.apache.poi.ss.usermodel.TestExcelStyleDateFormatter
[junitlauncher] Tests run: 124, Failures: 0, Aborted: 0, Skipped: 0, Time elapsed: 0.078000 sec
[junitlauncher] Running org.apache.poi.ss.usermodel.TestFractionFormat
[junitlauncher] 
[junitlauncher] Running org.apache.poi.ss.usermodel.TestFractionFormat
[junitlauncher] Tests run: 5, Failures: 0, Aborted: 0, Skipped: 1, Time elapsed: 0.272000 sec
[junitlauncher] Running org.apache.poi.ss.usermodel.TestHSSFBorderStyle
[junitlauncher] 
[junitlauncher] Running org.apache.poi.ss.usermodel.TestHSSFBorderStyle
[junitlauncher] Tests run: 1, Failures: 0, Aborted: 0, Skipped: 0, Time elapsed: 0.002000 sec
[junitlauncher] Running org.apache.poi.ss.usermodel.TestIndexedColors
[junitlauncher] 
[junitlauncher] Running org.apache.poi.ss.usermodel.TestIndexedColors
[junitlauncher] Tests run: 3, Failures: 0, Aborted: 0, Skipped: 0, Time elapsed: 0.002000 sec
[junitlauncher] Running org.apache.poi.ss.util.TestAreaReference
[junitlauncher] 
[junitlauncher] Running org.apache.poi.ss.util.TestAreaReference
[junitlauncher] Tests run: 3, Failures: 0, Aborted: 0, Skipped: 0, Time elapsed: 0.001000 sec
[junitlauncher] Running org.apache.poi.ss.util.TestCellAddress
[junitlauncher] 
[junitlauncher] Running org.apache.poi.ss.util.TestCellAddress
[junitlauncher] Tests run: 6, Failures: 0, Aborted: 0, Skipped: 0, Time elapsed: 0.001000 sec
[junitlauncher] Running org.apache.poi.ss.util.TestCellRangeAddress
[junitlauncher] 
[junitlauncher] Running org.apache.poi.ss.util.TestCellRangeAddress
[junitlauncher] Tests run: 15, Failures: 0, Aborted: 0, Skipped: 0, Time elapsed: 0.006000 sec
[junitlauncher] Running org.apache.poi.ss.util.TestCellRangeUtil
[junitlauncher] 
[junitlauncher] Running org.apache.poi.ss.util.TestCellRangeUtil
[junitlauncher] Tests run: 1, Failures: 0, Aborted: 0, Skipped: 0, Time elapsed: 0.000000 sec
[junitlauncher] Running org.apache.poi.ss.util.TestCellReference
[junitlauncher] 
[junitlauncher] Running org.apache.poi.ss.util.TestCellReference
[junitlauncher] Tests run: 27, Failures: 0, Aborted: 0, Skipped: 0, Time elapsed: 0.253000 sec
[junitlauncher] Running org.apache.poi.ss.util.TestDateFormatConverter
[junitlauncher] 
[junitlauncher] Running org.apache.poi.ss.util.TestDateFormatConverter
[junitlauncher] Tests run: 19, Failures: 0, Aborted: 0, Skipped: 0, Time elapsed: 4.687000 sec
[junitlauncher] Running org.apache.poi.ss.util.TestDateParser
[junitlauncher] 
[junitlauncher] Running org.apache.poi.ss.util.TestDateParser
[junitlauncher] Tests run: 6, Failures: 0, Aborted: 0, Skipped: 0, Time elapsed: 0.003000 sec
[junitlauncher] Running org.apache.poi.ss.util.TestExpandedDouble
[junitlauncher] 
[junitlauncher] Running org.apache.poi.ss.util.TestExpandedDouble
[junitlauncher] Tests run: 19, Failures: 0, Aborted: 0, Skipped: 0, Time elapsed: 0.010000 sec
[junitlauncher] Running org.apache.poi.ss.util.TestHSSFCellUtil
[junitlauncher] 
[junitlauncher] Running org.apache.poi.ss.util.TestHSSFCellUtil
[junitlauncher] Tests run: 17, Failures: 0, Aborted: 0, Skipped: 0, Time elapsed: 0.018000 sec
[junitlauncher] Running org.apache.poi.ss.util.TestHSSFCellUtilCopy
[junitlauncher] 
[junitlauncher] Running org.apache.poi.ss.util.TestHSSFCellUtilCopy
[junitlauncher] Tests run: 6, Failures: 0, Aborted: 0, Skipped: 0, Time elapsed: 0.005000 sec
[junitlauncher] Running org.apache.poi.ss.util.TestImageUtils
[junitlauncher] 
[junitlauncher] Running org.apache.poi.ss.util.TestImageUtils
[junitlauncher] Tests run: 2, Failures: 0, Aborted: 0, Skipped: 0, Time elapsed: 0.006000 sec
[junitlauncher] Running org.apache.poi.ss.util.TestNumberComparer
[junitlauncher] 
[junitlauncher] Running org.apache.poi.ss.util.TestNumberComparer
[junitlauncher] Tests run: 116, Failures: 0, Aborted: 0, Skipped: 0, Time elapsed: 0.082000 sec
[junitlauncher] Running org.apache.poi.ss.util.TestNumberToTextConverter
[junitlauncher] 
[junitlauncher] Running org.apache.poi.ss.util.TestNumberToTextConverter
[junitlauncher] Tests run: 2, Failures: 0, Aborted: 0, Skipped: 0, Time elapsed: 0.004000 sec
[junitlauncher] Running org.apache.poi.ss.util.TestPaneInformation
[junitlauncher] 
[junitlauncher] Running org.apache.poi.ss.util.TestPaneInformation
[junitlauncher] Tests run: 2, Failures: 0, Aborted: 0, Skipped: 0, Time elapsed: 0.000000 sec
[junitlauncher] Running org.apache.poi.ss.util.TestPropertyTemplate
[junitlauncher] 
[junitlauncher] Running org.apache.poi.ss.util.TestPropertyTemplate
[junitlauncher] Tests run: 8, Failures: 0, Aborted: 0, Skipped: 0, Time elapsed: 0.023000 sec
[junitlauncher] Running org.apache.poi.ss.util.TestRegionUtil
[junitlauncher] 
[junitlauncher] Running org.apache.poi.ss.util.TestRegionUtil
[junitlauncher] Tests run: 10, Failures: 0, Aborted: 0, Skipped: 0, Time elapsed: 0.011000 sec
[junitlauncher] Running org.apache.poi.ss.util.TestSheetBuilder
[junitlauncher] 
[junitlauncher] Running org.apache.poi.ss.util.TestSheetBuilder
[junitlauncher] Tests run: 3, Failures: 0, Aborted: 0, Skipped: 0, Time elapsed: 0.001000 sec
[junitlauncher] Running org.apache.poi.ss.util.TestSheetUtil
[junitlauncher] 
[junitlauncher] Running org.apache.poi.ss.util.TestSheetUtil
[junitlauncher] Tests run: 10, Failures: 0, Aborted: 0, Skipped: 0, Time elapsed: 0.006000 sec
[junitlauncher] Running org.apache.poi.ss.util.TestWorkbookUtil
[junitlauncher] 
[junitlauncher] Running org.apache.poi.ss.util.TestWorkbookUtil
[junitlauncher] Tests run: 1, Failures: 0, Aborted: 0, Skipped: 0, Time elapsed: 0.000000 sec
[junitlauncher] Running org.apache.poi.ss.util.cellwalk.TestCellWalk
[junitlauncher] 
[junitlauncher] Running org.apache.poi.ss.util.cellwalk.TestCellWalk
[junitlauncher] Tests run: 1, Failures: 0, Aborted: 0, Skipped: 0, Time elapsed: 0.002000 sec
[junitlauncher] Running org.apache.poi.util.TestArrayUtil
[junitlauncher] 
[junitlauncher] Running org.apache.poi.util.TestArrayUtil
[junitlauncher] Tests run: 1, Failures: 0, Aborted: 0, Skipped: 0, Time elapsed: 0.001000 sec
[junitlauncher] Running org.apache.poi.util.TestBitField
[junitlauncher] 
[junitlauncher] Running org.apache.poi.util.TestBitField
[junitlauncher] Tests run: 16, Failures: 0, Aborted: 0, Skipped: 0, Time elapsed: 0.002000 sec
[junitlauncher] Running org.apache.poi.util.TestByteField
[junitlauncher] 
[junitlauncher] Running org.apache.poi.util.TestByteField
[junitlauncher] Tests run: 5, Failures: 0, Aborted: 0, Skipped: 0, Time elapsed: 0.003000 sec
[junitlauncher] Running org.apache.poi.util.TestCodepointsUtil
[junitlauncher] 
[junitlauncher] Running org.apache.poi.util.TestCodepointsUtil
[junitlauncher] Tests run: 2, Failures: 0, Aborted: 0, Skipped: 0, Time elapsed: 0.001000 sec
[junitlauncher] Running org.apache.poi.util.TestHexDump
[junitlauncher] 
[junitlauncher] Running org.apache.poi.util.TestHexDump
[junitlauncher] Tests run: 10, Failures: 0, Aborted: 0, Skipped: 0, Time elapsed: 0.011000 sec
[junitlauncher] Running org.apache.poi.util.TestIOUtils
[junitlauncher] 
[junitlauncher] Running org.apache.poi.util.TestIOUtils
[junitlauncher] Tests run: 59, Failures: 0, Aborted: 0, Skipped: 0, Time elapsed: 0.077000 sec
[junitlauncher] Running org.apache.poi.util.TestIntList
[junitlauncher] 
[junitlauncher] Running org.apache.poi.util.TestIntList
[junitlauncher] Tests run: 19, Failures: 0, Aborted: 0, Skipped: 0, Time elapsed: 0.050000 sec
[junitlauncher] Running org.apache.poi.util.TestIntegerField
[junitlauncher] 
[junitlauncher] Running org.apache.poi.util.TestIntegerField
[junitlauncher] Tests run: 5, Failures: 0, Aborted: 0, Skipped: 0, Time elapsed: 0.002000 sec
[junitlauncher] Running org.apache.poi.util.TestLittleEndian
[junitlauncher] 
[junitlauncher] Running org.apache.poi.util.TestLittleEndian
[junitlauncher] Tests run: 15, Failures: 0, Aborted: 0, Skipped: 0, Time elapsed: 0.003000 sec
[junitlauncher] Running org.apache.poi.util.TestLittleEndianInputStream
[junitlauncher] 
[junitlauncher] Running org.apache.poi.util.TestLittleEndianInputStream
[junitlauncher] Tests run: 2, Failures: 0, Aborted: 0, Skipped: 0, Time elapsed: 0.000000 sec
[junitlauncher] Running org.apache.poi.util.TestLittleEndianStreams
[junitlauncher] 
[junitlauncher] Running org.apache.poi.util.TestLittleEndianStreams
[junitlauncher] Tests run: 5, Failures: 0, Aborted: 0, Skipped: 0, Time elapsed: 0.002000 sec
[junitlauncher] Running org.apache.poi.util.TestLocaleUtil
[junitlauncher] 
[junitlauncher] Running org.apache.poi.util.TestLocaleUtil
[junitlauncher] Tests run: 3, Failures: 0, Aborted: 0, Skipped: 0, Time elapsed: 0.001000 sec
[junitlauncher] Running org.apache.poi.util.TestLongField
[junitlauncher] 
[junitlauncher] Running org.apache.poi.util.TestLongField
[junitlauncher] Tests run: 5, Failures: 0, Aborted: 0, Skipped: 0, Time elapsed: 0.002000 sec
[junitlauncher] Running org.apache.poi.util.TestRLEDecompressingInputStream
[junitlauncher] 
[junitlauncher] Running org.apache.poi.util.TestRLEDecompressingInputStream
[junitlauncher] Tests run: 4, Failures: 0, Aborted: 0, Skipped: 0, Time elapsed: 0.001000 sec
[junitlauncher] Running org.apache.poi.util.TestShortField
[junitlauncher] 
[junitlauncher] Running org.apache.poi.util.TestShortField
[junitlauncher] Tests run: 5, Failures: 0, Aborted: 0, Skipped: 0, Time elapsed: 0.005000 sec
[junitlauncher] Running org.apache.poi.util.TestStringUtil
[junitlauncher] 
[junitlauncher] Running org.apache.poi.util.TestStringUtil
[junitlauncher] Tests run: 7, Failures: 0, Aborted: 0, Skipped: 0, Time elapsed: 0.003000 sec
[junitlauncher] Running org.apache.poi.util.TestTempFile
[junitlauncher] 
[junitlauncher] Running org.apache.poi.util.TestTempFile
[junitlauncher] Tests run: 4, Failures: 0, Aborted: 0, Skipped: 0, Time elapsed: 0.033000 sec
[junitlauncher] Running org.apache.poi.util.TestThreadLocalUtil
[junitlauncher] 
[junitlauncher] Running org.apache.poi.util.TestThreadLocalUtil
[junitlauncher] Tests run: 2, Failures: 0, Aborted: 0, Skipped: 0, Time elapsed: 0.241000 sec
[junitlauncher] Running org.apache.poi.util.TestXMLHelper
[junitlauncher] 
[junitlauncher] Running org.apache.poi.util.TestXMLHelper
[junitlauncher]    Failed: testNewXMLInputFactory(): java.lang.ClassCastException: class java.lang.String cannot be cast to class java.lang.Boolean (java.lang.String and java.lang.Boolean are in module java.base of loader 'bootstrap')
[junitlauncher] Tests run: 9, Failures: 1, Aborted: 0, Skipped: 0, Time elapsed: 0.320000 sec

BUILD FAILED
<https://ci-builds.apache.org/job/POI/job/POI-DSL-1.22/ws/build.xml>:1691: The following error occurred while executing this line:
<https://ci-builds.apache.org/job/POI/job/POI-DSL-1.22/ws/build.xml>:1385: Some test(s) have failure(s)

Total time: 7 minutes 6 seconds
Build step 'Invoke Ant' marked build as failure
ERROR: Not all environment variables could be successfully injected. Check for similarly-named environment variables.
Archiving artifacts
ERROR: Not all environment variables could be successfully injected. Check for similarly-named environment variables.
Recording test results
ERROR: Not all environment variables could be successfully injected. Check for similarly-named environment variables.
[Checks API] No suitable checks publisher found.
ERROR: Not all environment variables could be successfully injected. Check for similarly-named environment variables.

---------------------------------------------------------------------
To unsubscribe, e-mail: dev-unsubscribe@poi.apache.org
For additional commands, e-mail: dev-help@poi.apache.org


Build failed in Jenkins: POI » POI-DSL-1.22 #27

Posted by Apache Jenkins Server <je...@builds.apache.org>.
See <https://ci-builds.apache.org/job/POI/job/POI-DSL-1.22/27/display/redirect?page=changes>

Changes:

[Axel Howind] fix #68635: POI unit tests fail when run under non-US locale

[PJ Fanning] remove unused loggers - thanks to Ruby Hartono. This closes #588 and closes #589

[PJ Fanning] [github-590] simplify some logging. This closes #590

[PJ Fanning] byte buddy 1.14.12


------------------------------------------
[...truncated 602.26 KB...]
[junitlauncher] Running org.apache.poi.ss.formula.ptg.TestArrayPtg
[junitlauncher] Tests run: 5, Failures: 0, Aborted: 0, Skipped: 0, Time elapsed: 0.002000 sec
[junitlauncher] Running org.apache.poi.ss.formula.ptg.TestAttrPtg
[junitlauncher] 
[junitlauncher] Running org.apache.poi.ss.formula.ptg.TestAttrPtg
[junitlauncher] Tests run: 1, Failures: 0, Aborted: 0, Skipped: 0, Time elapsed: 0.000000 sec
[junitlauncher] Running org.apache.poi.ss.formula.ptg.TestErrPtg
[junitlauncher] 
[junitlauncher] Running org.apache.poi.ss.formula.ptg.TestErrPtg
[junitlauncher] Tests run: 1, Failures: 0, Aborted: 0, Skipped: 0, Time elapsed: 0.001000 sec
[junitlauncher] Running org.apache.poi.ss.formula.ptg.TestExternalFunctionFormulas
[junitlauncher] 
[junitlauncher] Running org.apache.poi.ss.formula.ptg.TestExternalFunctionFormulas
[junitlauncher] Tests run: 3, Failures: 0, Aborted: 0, Skipped: 0, Time elapsed: 0.008000 sec
[junitlauncher] Running org.apache.poi.ss.formula.ptg.TestExternalNameReference
[junitlauncher] 
[junitlauncher] Running org.apache.poi.ss.formula.ptg.TestExternalNameReference
[junitlauncher] Tests run: 3, Failures: 0, Aborted: 0, Skipped: 0, Time elapsed: 0.006000 sec
[junitlauncher] Running org.apache.poi.ss.formula.ptg.TestFuncPtg
[junitlauncher] 
[junitlauncher] Running org.apache.poi.ss.formula.ptg.TestFuncPtg
[junitlauncher] Tests run: 2, Failures: 0, Aborted: 0, Skipped: 0, Time elapsed: 0.000000 sec
[junitlauncher] Running org.apache.poi.ss.formula.ptg.TestFuncVarPtg
[junitlauncher] 
[junitlauncher] Running org.apache.poi.ss.formula.ptg.TestFuncVarPtg
[junitlauncher] Tests run: 1, Failures: 0, Aborted: 0, Skipped: 0, Time elapsed: 0.000000 sec
[junitlauncher] Running org.apache.poi.ss.formula.ptg.TestIntersectionPtg
[junitlauncher] 
[junitlauncher] Running org.apache.poi.ss.formula.ptg.TestIntersectionPtg
[junitlauncher] Tests run: 1, Failures: 0, Aborted: 0, Skipped: 0, Time elapsed: 0.001000 sec
[junitlauncher] Running org.apache.poi.ss.formula.ptg.TestPercentPtg
[junitlauncher] 
[junitlauncher] Running org.apache.poi.ss.formula.ptg.TestPercentPtg
[junitlauncher] Tests run: 1, Failures: 0, Aborted: 0, Skipped: 0, Time elapsed: 0.001000 sec
[junitlauncher] Running org.apache.poi.ss.formula.ptg.TestRangePtg
[junitlauncher] 
[junitlauncher] Running org.apache.poi.ss.formula.ptg.TestRangePtg
[junitlauncher] Tests run: 1, Failures: 0, Aborted: 0, Skipped: 0, Time elapsed: 0.001000 sec
[junitlauncher] Running org.apache.poi.ss.formula.ptg.TestRef3DPtg
[junitlauncher] 
[junitlauncher] Running org.apache.poi.ss.formula.ptg.TestRef3DPtg
[junitlauncher] Tests run: 1, Failures: 0, Aborted: 0, Skipped: 0, Time elapsed: 0.000000 sec
[junitlauncher] Running org.apache.poi.ss.formula.ptg.TestReferencePtg
[junitlauncher] 
[junitlauncher] Running org.apache.poi.ss.formula.ptg.TestReferencePtg
[junitlauncher] Tests run: 4, Failures: 0, Aborted: 0, Skipped: 0, Time elapsed: 0.010000 sec
[junitlauncher] Running org.apache.poi.ss.formula.ptg.TestUnionPtg
[junitlauncher] 
[junitlauncher] Running org.apache.poi.ss.formula.ptg.TestUnionPtg
[junitlauncher] Tests run: 1, Failures: 0, Aborted: 0, Skipped: 0, Time elapsed: 0.001000 sec
[junitlauncher] Running org.apache.poi.ss.formula.udf.TestUDFFinder
[junitlauncher] 
[junitlauncher] Running org.apache.poi.ss.formula.udf.TestUDFFinder
[junitlauncher] Tests run: 4, Failures: 0, Aborted: 0, Skipped: 0, Time elapsed: 0.002000 sec
[junitlauncher] Running org.apache.poi.ss.usermodel.TestDataFormatter
[junitlauncher] 
[junitlauncher] Running org.apache.poi.ss.usermodel.TestDataFormatter
[junitlauncher] Tests run: 45, Failures: 0, Aborted: 0, Skipped: 1, Time elapsed: 0.582000 sec
[junitlauncher] Running org.apache.poi.ss.usermodel.TestDateUtil
[junitlauncher] 
[junitlauncher] Running org.apache.poi.ss.usermodel.TestDateUtil
[junitlauncher] Tests run: 26, Failures: 0, Aborted: 0, Skipped: 0, Time elapsed: 0.019000 sec
[junitlauncher] Running org.apache.poi.ss.usermodel.TestExcelStyleDateFormatter
[junitlauncher] 
[junitlauncher] Running org.apache.poi.ss.usermodel.TestExcelStyleDateFormatter
[junitlauncher] Tests run: 124, Failures: 0, Aborted: 0, Skipped: 0, Time elapsed: 0.064000 sec
[junitlauncher] Running org.apache.poi.ss.usermodel.TestFractionFormat
[junitlauncher] 
[junitlauncher] Running org.apache.poi.ss.usermodel.TestFractionFormat
[junitlauncher] Tests run: 5, Failures: 0, Aborted: 0, Skipped: 1, Time elapsed: 0.279000 sec
[junitlauncher] Running org.apache.poi.ss.usermodel.TestHSSFBorderStyle
[junitlauncher] 
[junitlauncher] Running org.apache.poi.ss.usermodel.TestHSSFBorderStyle
[junitlauncher] Tests run: 1, Failures: 0, Aborted: 0, Skipped: 0, Time elapsed: 0.002000 sec
[junitlauncher] Running org.apache.poi.ss.usermodel.TestIndexedColors
[junitlauncher] 
[junitlauncher] Running org.apache.poi.ss.usermodel.TestIndexedColors
[junitlauncher] Tests run: 3, Failures: 0, Aborted: 0, Skipped: 0, Time elapsed: 0.002000 sec
[junitlauncher] Running org.apache.poi.ss.util.TestAreaReference
[junitlauncher] 
[junitlauncher] Running org.apache.poi.ss.util.TestAreaReference
[junitlauncher] Tests run: 3, Failures: 0, Aborted: 0, Skipped: 0, Time elapsed: 0.001000 sec
[junitlauncher] Running org.apache.poi.ss.util.TestCellAddress
[junitlauncher] 
[junitlauncher] Running org.apache.poi.ss.util.TestCellAddress
[junitlauncher] Tests run: 6, Failures: 0, Aborted: 0, Skipped: 0, Time elapsed: 0.001000 sec
[junitlauncher] Running org.apache.poi.ss.util.TestCellRangeAddress
[junitlauncher] 
[junitlauncher] Running org.apache.poi.ss.util.TestCellRangeAddress
[junitlauncher] Tests run: 15, Failures: 0, Aborted: 0, Skipped: 0, Time elapsed: 0.006000 sec
[junitlauncher] Running org.apache.poi.ss.util.TestCellRangeUtil
[junitlauncher] 
[junitlauncher] Running org.apache.poi.ss.util.TestCellRangeUtil
[junitlauncher] Tests run: 1, Failures: 0, Aborted: 0, Skipped: 0, Time elapsed: 0.000000 sec
[junitlauncher] Running org.apache.poi.ss.util.TestCellReference
[junitlauncher] 
[junitlauncher] Running org.apache.poi.ss.util.TestCellReference
[junitlauncher] Tests run: 27, Failures: 0, Aborted: 0, Skipped: 0, Time elapsed: 0.220000 sec
[junitlauncher] Running org.apache.poi.ss.util.TestDateFormatConverter
[junitlauncher] 
[junitlauncher] Running org.apache.poi.ss.util.TestDateFormatConverter
[junitlauncher] Tests run: 19, Failures: 0, Aborted: 0, Skipped: 0, Time elapsed: 4.945000 sec
[junitlauncher] Running org.apache.poi.ss.util.TestDateParser
[junitlauncher] 
[junitlauncher] Running org.apache.poi.ss.util.TestDateParser
[junitlauncher] Tests run: 6, Failures: 0, Aborted: 0, Skipped: 0, Time elapsed: 0.003000 sec
[junitlauncher] Running org.apache.poi.ss.util.TestExpandedDouble
[junitlauncher] 
[junitlauncher] Running org.apache.poi.ss.util.TestExpandedDouble
[junitlauncher] Tests run: 19, Failures: 0, Aborted: 0, Skipped: 0, Time elapsed: 0.012000 sec
[junitlauncher] Running org.apache.poi.ss.util.TestHSSFCellUtil
[junitlauncher] 
[junitlauncher] Running org.apache.poi.ss.util.TestHSSFCellUtil
[junitlauncher] Tests run: 17, Failures: 0, Aborted: 0, Skipped: 0, Time elapsed: 0.018000 sec
[junitlauncher] Running org.apache.poi.ss.util.TestHSSFCellUtilCopy
[junitlauncher] 
[junitlauncher] Running org.apache.poi.ss.util.TestHSSFCellUtilCopy
[junitlauncher] Tests run: 6, Failures: 0, Aborted: 0, Skipped: 0, Time elapsed: 0.006000 sec
[junitlauncher] Running org.apache.poi.ss.util.TestImageUtils
[junitlauncher] 
[junitlauncher] Running org.apache.poi.ss.util.TestImageUtils
[junitlauncher] Tests run: 2, Failures: 0, Aborted: 0, Skipped: 0, Time elapsed: 0.006000 sec
[junitlauncher] Running org.apache.poi.ss.util.TestNumberComparer
[junitlauncher] 
[junitlauncher] Running org.apache.poi.ss.util.TestNumberComparer
[junitlauncher] Tests run: 116, Failures: 0, Aborted: 0, Skipped: 0, Time elapsed: 0.074000 sec
[junitlauncher] Running org.apache.poi.ss.util.TestNumberToTextConverter
[junitlauncher] 
[junitlauncher] Running org.apache.poi.ss.util.TestNumberToTextConverter
[junitlauncher] Tests run: 2, Failures: 0, Aborted: 0, Skipped: 0, Time elapsed: 0.003000 sec
[junitlauncher] Running org.apache.poi.ss.util.TestPaneInformation
[junitlauncher] 
[junitlauncher] Running org.apache.poi.ss.util.TestPaneInformation
[junitlauncher] Tests run: 2, Failures: 0, Aborted: 0, Skipped: 0, Time elapsed: 0.000000 sec
[junitlauncher] Running org.apache.poi.ss.util.TestPropertyTemplate
[junitlauncher] 
[junitlauncher] Running org.apache.poi.ss.util.TestPropertyTemplate
[junitlauncher] Tests run: 8, Failures: 0, Aborted: 0, Skipped: 0, Time elapsed: 0.017000 sec
[junitlauncher] Running org.apache.poi.ss.util.TestRegionUtil
[junitlauncher] 
[junitlauncher] Running org.apache.poi.ss.util.TestRegionUtil
[junitlauncher] Tests run: 10, Failures: 0, Aborted: 0, Skipped: 0, Time elapsed: 0.011000 sec
[junitlauncher] Running org.apache.poi.ss.util.TestSheetBuilder
[junitlauncher] 
[junitlauncher] Running org.apache.poi.ss.util.TestSheetBuilder
[junitlauncher] Tests run: 3, Failures: 0, Aborted: 0, Skipped: 0, Time elapsed: 0.001000 sec
[junitlauncher] Running org.apache.poi.ss.util.TestSheetUtil
[junitlauncher] 
[junitlauncher] Running org.apache.poi.ss.util.TestSheetUtil
[junitlauncher] Tests run: 10, Failures: 0, Aborted: 0, Skipped: 0, Time elapsed: 0.009000 sec
[junitlauncher] Running org.apache.poi.ss.util.TestWorkbookUtil
[junitlauncher] 
[junitlauncher] Running org.apache.poi.ss.util.TestWorkbookUtil
[junitlauncher] Tests run: 1, Failures: 0, Aborted: 0, Skipped: 0, Time elapsed: 0.004000 sec
[junitlauncher] Running org.apache.poi.ss.util.cellwalk.TestCellWalk
[junitlauncher] 
[junitlauncher] Running org.apache.poi.ss.util.cellwalk.TestCellWalk
[junitlauncher] Tests run: 1, Failures: 0, Aborted: 0, Skipped: 0, Time elapsed: 0.002000 sec
[junitlauncher] Running org.apache.poi.util.TestArrayUtil
[junitlauncher] 
[junitlauncher] Running org.apache.poi.util.TestArrayUtil
[junitlauncher] Tests run: 1, Failures: 0, Aborted: 0, Skipped: 0, Time elapsed: 0.002000 sec
[junitlauncher] Running org.apache.poi.util.TestBitField
[junitlauncher] 
[junitlauncher] Running org.apache.poi.util.TestBitField
[junitlauncher] Tests run: 16, Failures: 0, Aborted: 0, Skipped: 0, Time elapsed: 0.003000 sec
[junitlauncher] Running org.apache.poi.util.TestByteField
[junitlauncher] 
[junitlauncher] Running org.apache.poi.util.TestByteField
[junitlauncher] Tests run: 5, Failures: 0, Aborted: 0, Skipped: 0, Time elapsed: 0.003000 sec
[junitlauncher] Running org.apache.poi.util.TestCodepointsUtil
[junitlauncher] 
[junitlauncher] Running org.apache.poi.util.TestCodepointsUtil
[junitlauncher] Tests run: 2, Failures: 0, Aborted: 0, Skipped: 0, Time elapsed: 0.001000 sec
[junitlauncher] Running org.apache.poi.util.TestHexDump
[junitlauncher] 
[junitlauncher] Running org.apache.poi.util.TestHexDump
[junitlauncher] Tests run: 10, Failures: 0, Aborted: 0, Skipped: 0, Time elapsed: 0.014000 sec
[junitlauncher] Running org.apache.poi.util.TestIOUtils
[junitlauncher] 
[junitlauncher] Running org.apache.poi.util.TestIOUtils
[junitlauncher] Tests run: 59, Failures: 0, Aborted: 0, Skipped: 0, Time elapsed: 0.097000 sec
[junitlauncher] Running org.apache.poi.util.TestIntList
[junitlauncher] 
[junitlauncher] Running org.apache.poi.util.TestIntList
[junitlauncher] Tests run: 19, Failures: 0, Aborted: 0, Skipped: 0, Time elapsed: 0.061000 sec
[junitlauncher] Running org.apache.poi.util.TestIntegerField
[junitlauncher] 
[junitlauncher] Running org.apache.poi.util.TestIntegerField
[junitlauncher] Tests run: 5, Failures: 0, Aborted: 0, Skipped: 0, Time elapsed: 0.003000 sec
[junitlauncher] Running org.apache.poi.util.TestLittleEndian
[junitlauncher] 
[junitlauncher] Running org.apache.poi.util.TestLittleEndian
[junitlauncher] Tests run: 15, Failures: 0, Aborted: 0, Skipped: 0, Time elapsed: 0.005000 sec
[junitlauncher] Running org.apache.poi.util.TestLittleEndianInputStream
[junitlauncher] 
[junitlauncher] Running org.apache.poi.util.TestLittleEndianInputStream
[junitlauncher] Tests run: 2, Failures: 0, Aborted: 0, Skipped: 0, Time elapsed: 0.000000 sec
[junitlauncher] Running org.apache.poi.util.TestLittleEndianStreams
[junitlauncher] 
[junitlauncher] Running org.apache.poi.util.TestLittleEndianStreams
[junitlauncher] Tests run: 5, Failures: 0, Aborted: 0, Skipped: 0, Time elapsed: 0.002000 sec
[junitlauncher] Running org.apache.poi.util.TestLocaleUtil
[junitlauncher] 
[junitlauncher] Running org.apache.poi.util.TestLocaleUtil
[junitlauncher] Tests run: 3, Failures: 0, Aborted: 0, Skipped: 0, Time elapsed: 0.002000 sec
[junitlauncher] Running org.apache.poi.util.TestLongField
[junitlauncher] 
[junitlauncher] Running org.apache.poi.util.TestLongField
[junitlauncher] Tests run: 5, Failures: 0, Aborted: 0, Skipped: 0, Time elapsed: 0.002000 sec
[junitlauncher] Running org.apache.poi.util.TestRLEDecompressingInputStream
[junitlauncher] 
[junitlauncher] Running org.apache.poi.util.TestRLEDecompressingInputStream
[junitlauncher] Tests run: 4, Failures: 0, Aborted: 0, Skipped: 0, Time elapsed: 0.001000 sec
[junitlauncher] Running org.apache.poi.util.TestShortField
[junitlauncher] 
[junitlauncher] Running org.apache.poi.util.TestShortField
[junitlauncher] Tests run: 5, Failures: 0, Aborted: 0, Skipped: 0, Time elapsed: 0.004000 sec
[junitlauncher] Running org.apache.poi.util.TestStringUtil
[junitlauncher] 
[junitlauncher] Running org.apache.poi.util.TestStringUtil
[junitlauncher] Tests run: 7, Failures: 0, Aborted: 0, Skipped: 0, Time elapsed: 0.003000 sec
[junitlauncher] Running org.apache.poi.util.TestTempFile
[junitlauncher] 
[junitlauncher] Running org.apache.poi.util.TestTempFile
[junitlauncher] Tests run: 4, Failures: 0, Aborted: 0, Skipped: 0, Time elapsed: 0.020000 sec
[junitlauncher] Running org.apache.poi.util.TestThreadLocalUtil
[junitlauncher] 
[junitlauncher] Running org.apache.poi.util.TestThreadLocalUtil
[junitlauncher] Tests run: 2, Failures: 0, Aborted: 0, Skipped: 0, Time elapsed: 0.226000 sec
[junitlauncher] Running org.apache.poi.util.TestXMLHelper
[junitlauncher] 
[junitlauncher] Running org.apache.poi.util.TestXMLHelper
[junitlauncher]    Failed: testNewXMLInputFactory(): java.lang.ClassCastException: class java.lang.String cannot be cast to class java.lang.Boolean (java.lang.String and java.lang.Boolean are in module java.base of loader 'bootstrap')
[junitlauncher] Tests run: 9, Failures: 1, Aborted: 0, Skipped: 0, Time elapsed: 0.393000 sec

BUILD FAILED
<https://ci-builds.apache.org/job/POI/job/POI-DSL-1.22/ws/build.xml>:1687: The following error occurred while executing this line:
<https://ci-builds.apache.org/job/POI/job/POI-DSL-1.22/ws/build.xml>:1381: Some test(s) have failure(s)

Total time: 8 minutes 34 seconds
Build step 'Invoke Ant' marked build as failure
ERROR: Not all environment variables could be successfully injected. Check for similarly-named environment variables.
Archiving artifacts
ERROR: Not all environment variables could be successfully injected. Check for similarly-named environment variables.
Recording test results
ERROR: Not all environment variables could be successfully injected. Check for similarly-named environment variables.
[Checks API] No suitable checks publisher found.
ERROR: Not all environment variables could be successfully injected. Check for similarly-named environment variables.

---------------------------------------------------------------------
To unsubscribe, e-mail: dev-unsubscribe@poi.apache.org
For additional commands, e-mail: dev-help@poi.apache.org


Build failed in Jenkins: POI » POI-DSL-1.22 #26

Posted by Apache Jenkins Server <je...@builds.apache.org>.
See <https://ci-builds.apache.org/job/POI/job/POI-DSL-1.22/26/display/redirect?page=changes>

Changes:

[PJ Fanning] try to fix poi-scratchpad test module-info

[PJ Fanning] Upgrade commons-codec dependency to 1.16.1

[PJ Fanning] Upgrade commons-codec dependency to 1.16.1

[PJ Fanning] junit 5.10.2

[PJ Fanning] slf4j 2.0.12


------------------------------------------
[...truncated 164.70 KB...]
[junitlauncher] Running org.apache.poi.ss.formula.ptg.TestArrayPtg
[junitlauncher] Tests run: 5, Failures: 0, Aborted: 0, Skipped: 0, Time elapsed: 0.002000 sec
[junitlauncher] Running org.apache.poi.ss.formula.ptg.TestAttrPtg
[junitlauncher] 
[junitlauncher] Running org.apache.poi.ss.formula.ptg.TestAttrPtg
[junitlauncher] Tests run: 1, Failures: 0, Aborted: 0, Skipped: 0, Time elapsed: 0.000000 sec
[junitlauncher] Running org.apache.poi.ss.formula.ptg.TestErrPtg
[junitlauncher] 
[junitlauncher] Running org.apache.poi.ss.formula.ptg.TestErrPtg
[junitlauncher] Tests run: 1, Failures: 0, Aborted: 0, Skipped: 0, Time elapsed: 0.001000 sec
[junitlauncher] Running org.apache.poi.ss.formula.ptg.TestExternalFunctionFormulas
[junitlauncher] 
[junitlauncher] Running org.apache.poi.ss.formula.ptg.TestExternalFunctionFormulas
[junitlauncher] Tests run: 3, Failures: 0, Aborted: 0, Skipped: 0, Time elapsed: 0.004000 sec
[junitlauncher] Running org.apache.poi.ss.formula.ptg.TestExternalNameReference
[junitlauncher] 
[junitlauncher] Running org.apache.poi.ss.formula.ptg.TestExternalNameReference
[junitlauncher] Tests run: 3, Failures: 0, Aborted: 0, Skipped: 0, Time elapsed: 0.004000 sec
[junitlauncher] Running org.apache.poi.ss.formula.ptg.TestFuncPtg
[junitlauncher] 
[junitlauncher] Running org.apache.poi.ss.formula.ptg.TestFuncPtg
[junitlauncher] Tests run: 2, Failures: 0, Aborted: 0, Skipped: 0, Time elapsed: 0.000000 sec
[junitlauncher] Running org.apache.poi.ss.formula.ptg.TestFuncVarPtg
[junitlauncher] 
[junitlauncher] Running org.apache.poi.ss.formula.ptg.TestFuncVarPtg
[junitlauncher] Tests run: 1, Failures: 0, Aborted: 0, Skipped: 0, Time elapsed: 0.001000 sec
[junitlauncher] Running org.apache.poi.ss.formula.ptg.TestIntersectionPtg
[junitlauncher] 
[junitlauncher] Running org.apache.poi.ss.formula.ptg.TestIntersectionPtg
[junitlauncher] Tests run: 1, Failures: 0, Aborted: 0, Skipped: 0, Time elapsed: 0.000000 sec
[junitlauncher] Running org.apache.poi.ss.formula.ptg.TestPercentPtg
[junitlauncher] 
[junitlauncher] Running org.apache.poi.ss.formula.ptg.TestPercentPtg
[junitlauncher] Tests run: 1, Failures: 0, Aborted: 0, Skipped: 0, Time elapsed: 0.000000 sec
[junitlauncher] Running org.apache.poi.ss.formula.ptg.TestRangePtg
[junitlauncher] 
[junitlauncher] Running org.apache.poi.ss.formula.ptg.TestRangePtg
[junitlauncher] Tests run: 1, Failures: 0, Aborted: 0, Skipped: 0, Time elapsed: 0.000000 sec
[junitlauncher] Running org.apache.poi.ss.formula.ptg.TestRef3DPtg
[junitlauncher] 
[junitlauncher] Running org.apache.poi.ss.formula.ptg.TestRef3DPtg
[junitlauncher] Tests run: 1, Failures: 0, Aborted: 0, Skipped: 0, Time elapsed: 0.000000 sec
[junitlauncher] Running org.apache.poi.ss.formula.ptg.TestReferencePtg
[junitlauncher] 
[junitlauncher] Running org.apache.poi.ss.formula.ptg.TestReferencePtg
[junitlauncher] Tests run: 4, Failures: 0, Aborted: 0, Skipped: 0, Time elapsed: 0.009000 sec
[junitlauncher] Running org.apache.poi.ss.formula.ptg.TestUnionPtg
[junitlauncher] 
[junitlauncher] Running org.apache.poi.ss.formula.ptg.TestUnionPtg
[junitlauncher] Tests run: 1, Failures: 0, Aborted: 0, Skipped: 0, Time elapsed: 0.001000 sec
[junitlauncher] Running org.apache.poi.ss.formula.udf.TestUDFFinder
[junitlauncher] 
[junitlauncher] Running org.apache.poi.ss.formula.udf.TestUDFFinder
[junitlauncher] Tests run: 4, Failures: 0, Aborted: 0, Skipped: 0, Time elapsed: 0.002000 sec
[junitlauncher] Running org.apache.poi.ss.usermodel.TestDataFormatter
[junitlauncher] 
[junitlauncher] Running org.apache.poi.ss.usermodel.TestDataFormatter
[junitlauncher] Tests run: 45, Failures: 0, Aborted: 0, Skipped: 1, Time elapsed: 0.462000 sec
[junitlauncher] Running org.apache.poi.ss.usermodel.TestDateUtil
[junitlauncher] 
[junitlauncher] Running org.apache.poi.ss.usermodel.TestDateUtil
[junitlauncher] Tests run: 26, Failures: 0, Aborted: 0, Skipped: 0, Time elapsed: 0.013000 sec
[junitlauncher] Running org.apache.poi.ss.usermodel.TestExcelStyleDateFormatter
[junitlauncher] 
[junitlauncher] Running org.apache.poi.ss.usermodel.TestExcelStyleDateFormatter
[junitlauncher] Tests run: 124, Failures: 0, Aborted: 0, Skipped: 0, Time elapsed: 0.057000 sec
[junitlauncher] Running org.apache.poi.ss.usermodel.TestFractionFormat
[junitlauncher] 
[junitlauncher] Running org.apache.poi.ss.usermodel.TestFractionFormat
[junitlauncher] Tests run: 5, Failures: 0, Aborted: 0, Skipped: 1, Time elapsed: 0.215000 sec
[junitlauncher] Running org.apache.poi.ss.usermodel.TestHSSFBorderStyle
[junitlauncher] 
[junitlauncher] Running org.apache.poi.ss.usermodel.TestHSSFBorderStyle
[junitlauncher] Tests run: 1, Failures: 0, Aborted: 0, Skipped: 0, Time elapsed: 0.001000 sec
[junitlauncher] Running org.apache.poi.ss.usermodel.TestIndexedColors
[junitlauncher] 
[junitlauncher] Running org.apache.poi.ss.usermodel.TestIndexedColors
[junitlauncher] Tests run: 3, Failures: 0, Aborted: 0, Skipped: 0, Time elapsed: 0.001000 sec
[junitlauncher] Running org.apache.poi.ss.util.TestAreaReference
[junitlauncher] 
[junitlauncher] Running org.apache.poi.ss.util.TestAreaReference
[junitlauncher] Tests run: 3, Failures: 0, Aborted: 0, Skipped: 0, Time elapsed: 0.001000 sec
[junitlauncher] Running org.apache.poi.ss.util.TestCellAddress
[junitlauncher] 
[junitlauncher] Running org.apache.poi.ss.util.TestCellAddress
[junitlauncher] Tests run: 6, Failures: 0, Aborted: 0, Skipped: 0, Time elapsed: 0.001000 sec
[junitlauncher] Running org.apache.poi.ss.util.TestCellRangeAddress
[junitlauncher] 
[junitlauncher] Running org.apache.poi.ss.util.TestCellRangeAddress
[junitlauncher] Tests run: 15, Failures: 0, Aborted: 0, Skipped: 0, Time elapsed: 0.006000 sec
[junitlauncher] Running org.apache.poi.ss.util.TestCellRangeUtil
[junitlauncher] 
[junitlauncher] Running org.apache.poi.ss.util.TestCellRangeUtil
[junitlauncher] Tests run: 1, Failures: 0, Aborted: 0, Skipped: 0, Time elapsed: 0.001000 sec
[junitlauncher] Running org.apache.poi.ss.util.TestCellReference
[junitlauncher] 
[junitlauncher] Running org.apache.poi.ss.util.TestCellReference
[junitlauncher] Tests run: 27, Failures: 0, Aborted: 0, Skipped: 0, Time elapsed: 0.188000 sec
[junitlauncher] Running org.apache.poi.ss.util.TestDateFormatConverter
[junitlauncher] 
[junitlauncher] Running org.apache.poi.ss.util.TestDateFormatConverter
[junitlauncher] Tests run: 19, Failures: 0, Aborted: 0, Skipped: 0, Time elapsed: 4.075000 sec
[junitlauncher] Running org.apache.poi.ss.util.TestDateParser
[junitlauncher] 
[junitlauncher] Running org.apache.poi.ss.util.TestDateParser
[junitlauncher] Tests run: 6, Failures: 0, Aborted: 0, Skipped: 0, Time elapsed: 0.004000 sec
[junitlauncher] Running org.apache.poi.ss.util.TestExpandedDouble
[junitlauncher] 
[junitlauncher] Running org.apache.poi.ss.util.TestExpandedDouble
[junitlauncher] Tests run: 19, Failures: 0, Aborted: 0, Skipped: 0, Time elapsed: 0.013000 sec
[junitlauncher] Running org.apache.poi.ss.util.TestHSSFCellUtil
[junitlauncher] 
[junitlauncher] Running org.apache.poi.ss.util.TestHSSFCellUtil
[junitlauncher] Tests run: 17, Failures: 0, Aborted: 0, Skipped: 0, Time elapsed: 0.021000 sec
[junitlauncher] Running org.apache.poi.ss.util.TestHSSFCellUtilCopy
[junitlauncher] 
[junitlauncher] Running org.apache.poi.ss.util.TestHSSFCellUtilCopy
[junitlauncher] Tests run: 6, Failures: 0, Aborted: 0, Skipped: 0, Time elapsed: 0.007000 sec
[junitlauncher] Running org.apache.poi.ss.util.TestImageUtils
[junitlauncher] 
[junitlauncher] Running org.apache.poi.ss.util.TestImageUtils
[junitlauncher] Tests run: 2, Failures: 0, Aborted: 0, Skipped: 0, Time elapsed: 0.006000 sec
[junitlauncher] Running org.apache.poi.ss.util.TestNumberComparer
[junitlauncher] 
[junitlauncher] Running org.apache.poi.ss.util.TestNumberComparer
[junitlauncher] Tests run: 116, Failures: 0, Aborted: 0, Skipped: 0, Time elapsed: 0.060000 sec
[junitlauncher] Running org.apache.poi.ss.util.TestNumberToTextConverter
[junitlauncher] 
[junitlauncher] Running org.apache.poi.ss.util.TestNumberToTextConverter
[junitlauncher] Tests run: 2, Failures: 0, Aborted: 0, Skipped: 0, Time elapsed: 0.004000 sec
[junitlauncher] Running org.apache.poi.ss.util.TestPaneInformation
[junitlauncher] 
[junitlauncher] Running org.apache.poi.ss.util.TestPaneInformation
[junitlauncher] Tests run: 2, Failures: 0, Aborted: 0, Skipped: 0, Time elapsed: 0.000000 sec
[junitlauncher] Running org.apache.poi.ss.util.TestPropertyTemplate
[junitlauncher] 
[junitlauncher] Running org.apache.poi.ss.util.TestPropertyTemplate
[junitlauncher] Tests run: 8, Failures: 0, Aborted: 0, Skipped: 0, Time elapsed: 0.015000 sec
[junitlauncher] Running org.apache.poi.ss.util.TestRegionUtil
[junitlauncher] 
[junitlauncher] Running org.apache.poi.ss.util.TestRegionUtil
[junitlauncher] Tests run: 10, Failures: 0, Aborted: 0, Skipped: 0, Time elapsed: 0.016000 sec
[junitlauncher] Running org.apache.poi.ss.util.TestSheetBuilder
[junitlauncher] 
[junitlauncher] Running org.apache.poi.ss.util.TestSheetBuilder
[junitlauncher] Tests run: 3, Failures: 0, Aborted: 0, Skipped: 0, Time elapsed: 0.001000 sec
[junitlauncher] Running org.apache.poi.ss.util.TestSheetUtil
[junitlauncher] 
[junitlauncher] Running org.apache.poi.ss.util.TestSheetUtil
[junitlauncher] Tests run: 10, Failures: 0, Aborted: 0, Skipped: 0, Time elapsed: 0.007000 sec
[junitlauncher] Running org.apache.poi.ss.util.TestWorkbookUtil
[junitlauncher] 
[junitlauncher] Running org.apache.poi.ss.util.TestWorkbookUtil
[junitlauncher] Tests run: 1, Failures: 0, Aborted: 0, Skipped: 0, Time elapsed: 0.000000 sec
[junitlauncher] Running org.apache.poi.ss.util.cellwalk.TestCellWalk
[junitlauncher] 
[junitlauncher] Running org.apache.poi.ss.util.cellwalk.TestCellWalk
[junitlauncher] Tests run: 1, Failures: 0, Aborted: 0, Skipped: 0, Time elapsed: 0.002000 sec
[junitlauncher] Running org.apache.poi.util.TestArrayUtil
[junitlauncher] 
[junitlauncher] Running org.apache.poi.util.TestArrayUtil
[junitlauncher] Tests run: 1, Failures: 0, Aborted: 0, Skipped: 0, Time elapsed: 0.002000 sec
[junitlauncher] Running org.apache.poi.util.TestBitField
[junitlauncher] 
[junitlauncher] Running org.apache.poi.util.TestBitField
[junitlauncher] Tests run: 16, Failures: 0, Aborted: 0, Skipped: 0, Time elapsed: 0.003000 sec
[junitlauncher] Running org.apache.poi.util.TestByteField
[junitlauncher] 
[junitlauncher] Running org.apache.poi.util.TestByteField
[junitlauncher] Tests run: 5, Failures: 0, Aborted: 0, Skipped: 0, Time elapsed: 0.003000 sec
[junitlauncher] Running org.apache.poi.util.TestCodepointsUtil
[junitlauncher] 
[junitlauncher] Running org.apache.poi.util.TestCodepointsUtil
[junitlauncher] Tests run: 2, Failures: 0, Aborted: 0, Skipped: 0, Time elapsed: 0.001000 sec
[junitlauncher] Running org.apache.poi.util.TestHexDump
[junitlauncher] 
[junitlauncher] Running org.apache.poi.util.TestHexDump
[junitlauncher] Tests run: 10, Failures: 0, Aborted: 0, Skipped: 0, Time elapsed: 0.010000 sec
[junitlauncher] Running org.apache.poi.util.TestIOUtils
[junitlauncher] 
[junitlauncher] Running org.apache.poi.util.TestIOUtils
[junitlauncher] Tests run: 59, Failures: 0, Aborted: 0, Skipped: 0, Time elapsed: 0.044000 sec
[junitlauncher] Running org.apache.poi.util.TestIntList
[junitlauncher] 
[junitlauncher] Running org.apache.poi.util.TestIntList
[junitlauncher] Tests run: 19, Failures: 0, Aborted: 0, Skipped: 0, Time elapsed: 0.035000 sec
[junitlauncher] Running org.apache.poi.util.TestIntegerField
[junitlauncher] 
[junitlauncher] Running org.apache.poi.util.TestIntegerField
[junitlauncher] Tests run: 5, Failures: 0, Aborted: 0, Skipped: 0, Time elapsed: 0.004000 sec
[junitlauncher] Running org.apache.poi.util.TestLittleEndian
[junitlauncher] 
[junitlauncher] Running org.apache.poi.util.TestLittleEndian
[junitlauncher] Tests run: 15, Failures: 0, Aborted: 0, Skipped: 0, Time elapsed: 0.003000 sec
[junitlauncher] Running org.apache.poi.util.TestLittleEndianInputStream
[junitlauncher] 
[junitlauncher] Running org.apache.poi.util.TestLittleEndianInputStream
[junitlauncher] Tests run: 2, Failures: 0, Aborted: 0, Skipped: 0, Time elapsed: 0.000000 sec
[junitlauncher] Running org.apache.poi.util.TestLittleEndianStreams
[junitlauncher] 
[junitlauncher] Running org.apache.poi.util.TestLittleEndianStreams
[junitlauncher] Tests run: 5, Failures: 0, Aborted: 0, Skipped: 0, Time elapsed: 0.002000 sec
[junitlauncher] Running org.apache.poi.util.TestLocaleUtil
[junitlauncher] 
[junitlauncher] Running org.apache.poi.util.TestLocaleUtil
[junitlauncher] Tests run: 3, Failures: 0, Aborted: 0, Skipped: 0, Time elapsed: 0.002000 sec
[junitlauncher] Running org.apache.poi.util.TestLongField
[junitlauncher] 
[junitlauncher] Running org.apache.poi.util.TestLongField
[junitlauncher] Tests run: 5, Failures: 0, Aborted: 0, Skipped: 0, Time elapsed: 0.003000 sec
[junitlauncher] Running org.apache.poi.util.TestRLEDecompressingInputStream
[junitlauncher] 
[junitlauncher] Running org.apache.poi.util.TestRLEDecompressingInputStream
[junitlauncher] Tests run: 4, Failures: 0, Aborted: 0, Skipped: 0, Time elapsed: 0.001000 sec
[junitlauncher] Running org.apache.poi.util.TestShortField
[junitlauncher] 
[junitlauncher] Running org.apache.poi.util.TestShortField
[junitlauncher] Tests run: 5, Failures: 0, Aborted: 0, Skipped: 0, Time elapsed: 0.003000 sec
[junitlauncher] Running org.apache.poi.util.TestStringUtil
[junitlauncher] 
[junitlauncher] Running org.apache.poi.util.TestStringUtil
[junitlauncher] Tests run: 7, Failures: 0, Aborted: 0, Skipped: 0, Time elapsed: 0.002000 sec
[junitlauncher] Running org.apache.poi.util.TestTempFile
[junitlauncher] 
[junitlauncher] Running org.apache.poi.util.TestTempFile
[junitlauncher] Tests run: 4, Failures: 0, Aborted: 0, Skipped: 0, Time elapsed: 0.012000 sec
[junitlauncher] Running org.apache.poi.util.TestThreadLocalUtil
[junitlauncher] 
[junitlauncher] Running org.apache.poi.util.TestThreadLocalUtil
[junitlauncher] Tests run: 2, Failures: 0, Aborted: 0, Skipped: 0, Time elapsed: 0.266000 sec
[junitlauncher] Running org.apache.poi.util.TestXMLHelper
[junitlauncher] 
[junitlauncher] Running org.apache.poi.util.TestXMLHelper
[junitlauncher]    Failed: testNewXMLInputFactory(): java.lang.ClassCastException: class java.lang.String cannot be cast to class java.lang.Boolean (java.lang.String and java.lang.Boolean are in module java.base of loader 'bootstrap')
[junitlauncher] Tests run: 9, Failures: 1, Aborted: 0, Skipped: 0, Time elapsed: 0.251000 sec

BUILD FAILED
<https://ci-builds.apache.org/job/POI/job/POI-DSL-1.22/ws/build.xml>:1687: The following error occurred while executing this line:
<https://ci-builds.apache.org/job/POI/job/POI-DSL-1.22/ws/build.xml>:1381: Some test(s) have failure(s)

Total time: 6 minutes 36 seconds
Build step 'Invoke Ant' marked build as failure
ERROR: Not all environment variables could be successfully injected. Check for similarly-named environment variables.
Archiving artifacts
ERROR: Not all environment variables could be successfully injected. Check for similarly-named environment variables.
Recording test results
ERROR: Not all environment variables could be successfully injected. Check for similarly-named environment variables.
[Checks API] No suitable checks publisher found.
ERROR: Not all environment variables could be successfully injected. Check for similarly-named environment variables.

---------------------------------------------------------------------
To unsubscribe, e-mail: dev-unsubscribe@poi.apache.org
For additional commands, e-mail: dev-help@poi.apache.org


Build failed in Jenkins: POI » POI-DSL-1.22 #25

Posted by Apache Jenkins Server <je...@builds.apache.org>.
See <https://ci-builds.apache.org/job/POI/job/POI-DSL-1.22/25/display/redirect?page=changes>

Changes:

[PJ Fanning] [github-582] improve performance CodepointsUtil.iteratorFor. Thanks to Jason Mirra. This closes #582

[PJ Fanning] remove one use of CodepointsUtil.iteratorFor


------------------------------------------
[...truncated 158.88 KB...]
[junitlauncher] Running org.apache.poi.ss.formula.ptg.TestArrayPtg
[junitlauncher] Tests run: 5, Failures: 0, Aborted: 0, Skipped: 0, Time elapsed: 0.002000 sec
[junitlauncher] Running org.apache.poi.ss.formula.ptg.TestAttrPtg
[junitlauncher] 
[junitlauncher] Running org.apache.poi.ss.formula.ptg.TestAttrPtg
[junitlauncher] Tests run: 1, Failures: 0, Aborted: 0, Skipped: 0, Time elapsed: 0.000000 sec
[junitlauncher] Running org.apache.poi.ss.formula.ptg.TestErrPtg
[junitlauncher] 
[junitlauncher] Running org.apache.poi.ss.formula.ptg.TestErrPtg
[junitlauncher] Tests run: 1, Failures: 0, Aborted: 0, Skipped: 0, Time elapsed: 0.001000 sec
[junitlauncher] Running org.apache.poi.ss.formula.ptg.TestExternalFunctionFormulas
[junitlauncher] 
[junitlauncher] Running org.apache.poi.ss.formula.ptg.TestExternalFunctionFormulas
[junitlauncher] Tests run: 3, Failures: 0, Aborted: 0, Skipped: 0, Time elapsed: 0.004000 sec
[junitlauncher] Running org.apache.poi.ss.formula.ptg.TestExternalNameReference
[junitlauncher] 
[junitlauncher] Running org.apache.poi.ss.formula.ptg.TestExternalNameReference
[junitlauncher] Tests run: 3, Failures: 0, Aborted: 0, Skipped: 0, Time elapsed: 0.005000 sec
[junitlauncher] Running org.apache.poi.ss.formula.ptg.TestFuncPtg
[junitlauncher] 
[junitlauncher] Running org.apache.poi.ss.formula.ptg.TestFuncPtg
[junitlauncher] Tests run: 2, Failures: 0, Aborted: 0, Skipped: 0, Time elapsed: 0.001000 sec
[junitlauncher] Running org.apache.poi.ss.formula.ptg.TestFuncVarPtg
[junitlauncher] 
[junitlauncher] Running org.apache.poi.ss.formula.ptg.TestFuncVarPtg
[junitlauncher] Tests run: 1, Failures: 0, Aborted: 0, Skipped: 0, Time elapsed: 0.002000 sec
[junitlauncher] Running org.apache.poi.ss.formula.ptg.TestIntersectionPtg
[junitlauncher] 
[junitlauncher] Running org.apache.poi.ss.formula.ptg.TestIntersectionPtg
[junitlauncher] Tests run: 1, Failures: 0, Aborted: 0, Skipped: 0, Time elapsed: 0.002000 sec
[junitlauncher] Running org.apache.poi.ss.formula.ptg.TestPercentPtg
[junitlauncher] 
[junitlauncher] Running org.apache.poi.ss.formula.ptg.TestPercentPtg
[junitlauncher] Tests run: 1, Failures: 0, Aborted: 0, Skipped: 0, Time elapsed: 0.001000 sec
[junitlauncher] Running org.apache.poi.ss.formula.ptg.TestRangePtg
[junitlauncher] 
[junitlauncher] Running org.apache.poi.ss.formula.ptg.TestRangePtg
[junitlauncher] Tests run: 1, Failures: 0, Aborted: 0, Skipped: 0, Time elapsed: 0.001000 sec
[junitlauncher] Running org.apache.poi.ss.formula.ptg.TestRef3DPtg
[junitlauncher] 
[junitlauncher] Running org.apache.poi.ss.formula.ptg.TestRef3DPtg
[junitlauncher] Tests run: 1, Failures: 0, Aborted: 0, Skipped: 0, Time elapsed: 0.000000 sec
[junitlauncher] Running org.apache.poi.ss.formula.ptg.TestReferencePtg
[junitlauncher] 
[junitlauncher] Running org.apache.poi.ss.formula.ptg.TestReferencePtg
[junitlauncher] Tests run: 4, Failures: 0, Aborted: 0, Skipped: 0, Time elapsed: 0.012000 sec
[junitlauncher] Running org.apache.poi.ss.formula.ptg.TestUnionPtg
[junitlauncher] 
[junitlauncher] Running org.apache.poi.ss.formula.ptg.TestUnionPtg
[junitlauncher] Tests run: 1, Failures: 0, Aborted: 0, Skipped: 0, Time elapsed: 0.001000 sec
[junitlauncher] Running org.apache.poi.ss.formula.udf.TestUDFFinder
[junitlauncher] 
[junitlauncher] Running org.apache.poi.ss.formula.udf.TestUDFFinder
[junitlauncher] Tests run: 4, Failures: 0, Aborted: 0, Skipped: 0, Time elapsed: 0.004000 sec
[junitlauncher] Running org.apache.poi.ss.usermodel.TestDataFormatter
[junitlauncher] 
[junitlauncher] Running org.apache.poi.ss.usermodel.TestDataFormatter
[junitlauncher] Tests run: 45, Failures: 0, Aborted: 0, Skipped: 1, Time elapsed: 0.479000 sec
[junitlauncher] Running org.apache.poi.ss.usermodel.TestDateUtil
[junitlauncher] 
[junitlauncher] Running org.apache.poi.ss.usermodel.TestDateUtil
[junitlauncher] Tests run: 26, Failures: 0, Aborted: 0, Skipped: 0, Time elapsed: 0.015000 sec
[junitlauncher] Running org.apache.poi.ss.usermodel.TestExcelStyleDateFormatter
[junitlauncher] 
[junitlauncher] Running org.apache.poi.ss.usermodel.TestExcelStyleDateFormatter
[junitlauncher] Tests run: 124, Failures: 0, Aborted: 0, Skipped: 0, Time elapsed: 0.065000 sec
[junitlauncher] Running org.apache.poi.ss.usermodel.TestFractionFormat
[junitlauncher] 
[junitlauncher] Running org.apache.poi.ss.usermodel.TestFractionFormat
[junitlauncher] Tests run: 5, Failures: 0, Aborted: 0, Skipped: 1, Time elapsed: 0.283000 sec
[junitlauncher] Running org.apache.poi.ss.usermodel.TestHSSFBorderStyle
[junitlauncher] 
[junitlauncher] Running org.apache.poi.ss.usermodel.TestHSSFBorderStyle
[junitlauncher] Tests run: 1, Failures: 0, Aborted: 0, Skipped: 0, Time elapsed: 0.002000 sec
[junitlauncher] Running org.apache.poi.ss.usermodel.TestIndexedColors
[junitlauncher] 
[junitlauncher] Running org.apache.poi.ss.usermodel.TestIndexedColors
[junitlauncher] Tests run: 3, Failures: 0, Aborted: 0, Skipped: 0, Time elapsed: 0.002000 sec
[junitlauncher] Running org.apache.poi.ss.util.TestAreaReference
[junitlauncher] 
[junitlauncher] Running org.apache.poi.ss.util.TestAreaReference
[junitlauncher] Tests run: 3, Failures: 0, Aborted: 0, Skipped: 0, Time elapsed: 0.001000 sec
[junitlauncher] Running org.apache.poi.ss.util.TestCellAddress
[junitlauncher] 
[junitlauncher] Running org.apache.poi.ss.util.TestCellAddress
[junitlauncher] Tests run: 6, Failures: 0, Aborted: 0, Skipped: 0, Time elapsed: 0.001000 sec
[junitlauncher] Running org.apache.poi.ss.util.TestCellRangeAddress
[junitlauncher] 
[junitlauncher] Running org.apache.poi.ss.util.TestCellRangeAddress
[junitlauncher] Tests run: 15, Failures: 0, Aborted: 0, Skipped: 0, Time elapsed: 0.007000 sec
[junitlauncher] Running org.apache.poi.ss.util.TestCellRangeUtil
[junitlauncher] 
[junitlauncher] Running org.apache.poi.ss.util.TestCellRangeUtil
[junitlauncher] Tests run: 1, Failures: 0, Aborted: 0, Skipped: 0, Time elapsed: 0.001000 sec
[junitlauncher] Running org.apache.poi.ss.util.TestCellReference
[junitlauncher] 
[junitlauncher] Running org.apache.poi.ss.util.TestCellReference
[junitlauncher] Tests run: 27, Failures: 0, Aborted: 0, Skipped: 0, Time elapsed: 0.216000 sec
[junitlauncher] Running org.apache.poi.ss.util.TestDateFormatConverter
[junitlauncher] 
[junitlauncher] Running org.apache.poi.ss.util.TestDateFormatConverter
[junitlauncher] Tests run: 19, Failures: 0, Aborted: 0, Skipped: 0, Time elapsed: 4.190000 sec
[junitlauncher] Running org.apache.poi.ss.util.TestDateParser
[junitlauncher] 
[junitlauncher] Running org.apache.poi.ss.util.TestDateParser
[junitlauncher] Tests run: 6, Failures: 0, Aborted: 0, Skipped: 0, Time elapsed: 0.004000 sec
[junitlauncher] Running org.apache.poi.ss.util.TestExpandedDouble
[junitlauncher] 
[junitlauncher] Running org.apache.poi.ss.util.TestExpandedDouble
[junitlauncher] Tests run: 19, Failures: 0, Aborted: 0, Skipped: 0, Time elapsed: 0.011000 sec
[junitlauncher] Running org.apache.poi.ss.util.TestHSSFCellUtil
[junitlauncher] 
[junitlauncher] Running org.apache.poi.ss.util.TestHSSFCellUtil
[junitlauncher] Tests run: 17, Failures: 0, Aborted: 0, Skipped: 0, Time elapsed: 0.030000 sec
[junitlauncher] Running org.apache.poi.ss.util.TestHSSFCellUtilCopy
[junitlauncher] 
[junitlauncher] Running org.apache.poi.ss.util.TestHSSFCellUtilCopy
[junitlauncher] Tests run: 6, Failures: 0, Aborted: 0, Skipped: 0, Time elapsed: 0.006000 sec
[junitlauncher] Running org.apache.poi.ss.util.TestImageUtils
[junitlauncher] 
[junitlauncher] Running org.apache.poi.ss.util.TestImageUtils
[junitlauncher] Tests run: 2, Failures: 0, Aborted: 0, Skipped: 0, Time elapsed: 0.005000 sec
[junitlauncher] Running org.apache.poi.ss.util.TestNumberComparer
[junitlauncher] 
[junitlauncher] Running org.apache.poi.ss.util.TestNumberComparer
[junitlauncher] Tests run: 116, Failures: 0, Aborted: 0, Skipped: 0, Time elapsed: 0.080000 sec
[junitlauncher] Running org.apache.poi.ss.util.TestNumberToTextConverter
[junitlauncher] 
[junitlauncher] Running org.apache.poi.ss.util.TestNumberToTextConverter
[junitlauncher] Tests run: 2, Failures: 0, Aborted: 0, Skipped: 0, Time elapsed: 0.004000 sec
[junitlauncher] Running org.apache.poi.ss.util.TestPaneInformation
[junitlauncher] 
[junitlauncher] Running org.apache.poi.ss.util.TestPaneInformation
[junitlauncher] Tests run: 2, Failures: 0, Aborted: 0, Skipped: 0, Time elapsed: 0.000000 sec
[junitlauncher] Running org.apache.poi.ss.util.TestPropertyTemplate
[junitlauncher] 
[junitlauncher] Running org.apache.poi.ss.util.TestPropertyTemplate
[junitlauncher] Tests run: 8, Failures: 0, Aborted: 0, Skipped: 0, Time elapsed: 0.017000 sec
[junitlauncher] Running org.apache.poi.ss.util.TestRegionUtil
[junitlauncher] 
[junitlauncher] Running org.apache.poi.ss.util.TestRegionUtil
[junitlauncher] Tests run: 10, Failures: 0, Aborted: 0, Skipped: 0, Time elapsed: 0.021000 sec
[junitlauncher] Running org.apache.poi.ss.util.TestSheetBuilder
[junitlauncher] 
[junitlauncher] Running org.apache.poi.ss.util.TestSheetBuilder
[junitlauncher] Tests run: 3, Failures: 0, Aborted: 0, Skipped: 0, Time elapsed: 0.002000 sec
[junitlauncher] Running org.apache.poi.ss.util.TestSheetUtil
[junitlauncher] 
[junitlauncher] Running org.apache.poi.ss.util.TestSheetUtil
[junitlauncher] Tests run: 10, Failures: 0, Aborted: 0, Skipped: 0, Time elapsed: 0.008000 sec
[junitlauncher] Running org.apache.poi.ss.util.TestWorkbookUtil
[junitlauncher] 
[junitlauncher] Running org.apache.poi.ss.util.TestWorkbookUtil
[junitlauncher] Tests run: 1, Failures: 0, Aborted: 0, Skipped: 0, Time elapsed: 0.000000 sec
[junitlauncher] Running org.apache.poi.ss.util.cellwalk.TestCellWalk
[junitlauncher] 
[junitlauncher] Running org.apache.poi.ss.util.cellwalk.TestCellWalk
[junitlauncher] Tests run: 1, Failures: 0, Aborted: 0, Skipped: 0, Time elapsed: 0.002000 sec
[junitlauncher] Running org.apache.poi.util.TestArrayUtil
[junitlauncher] 
[junitlauncher] Running org.apache.poi.util.TestArrayUtil
[junitlauncher] Tests run: 1, Failures: 0, Aborted: 0, Skipped: 0, Time elapsed: 0.002000 sec
[junitlauncher] Running org.apache.poi.util.TestBitField
[junitlauncher] 
[junitlauncher] Running org.apache.poi.util.TestBitField
[junitlauncher] Tests run: 16, Failures: 0, Aborted: 0, Skipped: 0, Time elapsed: 0.004000 sec
[junitlauncher] Running org.apache.poi.util.TestByteField
[junitlauncher] 
[junitlauncher] Running org.apache.poi.util.TestByteField
[junitlauncher] Tests run: 5, Failures: 0, Aborted: 0, Skipped: 0, Time elapsed: 0.003000 sec
[junitlauncher] Running org.apache.poi.util.TestCodepointsUtil
[junitlauncher] 
[junitlauncher] Running org.apache.poi.util.TestCodepointsUtil
[junitlauncher] Tests run: 2, Failures: 0, Aborted: 0, Skipped: 0, Time elapsed: 0.001000 sec
[junitlauncher] Running org.apache.poi.util.TestHexDump
[junitlauncher] 
[junitlauncher] Running org.apache.poi.util.TestHexDump
[junitlauncher] Tests run: 10, Failures: 0, Aborted: 0, Skipped: 0, Time elapsed: 0.009000 sec
[junitlauncher] Running org.apache.poi.util.TestIOUtils
[junitlauncher] 
[junitlauncher] Running org.apache.poi.util.TestIOUtils
[junitlauncher] Tests run: 59, Failures: 0, Aborted: 0, Skipped: 0, Time elapsed: 0.059000 sec
[junitlauncher] Running org.apache.poi.util.TestIntList
[junitlauncher] 
[junitlauncher] Running org.apache.poi.util.TestIntList
[junitlauncher] Tests run: 19, Failures: 0, Aborted: 0, Skipped: 0, Time elapsed: 0.039000 sec
[junitlauncher] Running org.apache.poi.util.TestIntegerField
[junitlauncher] 
[junitlauncher] Running org.apache.poi.util.TestIntegerField
[junitlauncher] Tests run: 5, Failures: 0, Aborted: 0, Skipped: 0, Time elapsed: 0.003000 sec
[junitlauncher] Running org.apache.poi.util.TestLittleEndian
[junitlauncher] 
[junitlauncher] Running org.apache.poi.util.TestLittleEndian
[junitlauncher] Tests run: 15, Failures: 0, Aborted: 0, Skipped: 0, Time elapsed: 0.005000 sec
[junitlauncher] Running org.apache.poi.util.TestLittleEndianInputStream
[junitlauncher] 
[junitlauncher] Running org.apache.poi.util.TestLittleEndianInputStream
[junitlauncher] Tests run: 2, Failures: 0, Aborted: 0, Skipped: 0, Time elapsed: 0.000000 sec
[junitlauncher] Running org.apache.poi.util.TestLittleEndianStreams
[junitlauncher] 
[junitlauncher] Running org.apache.poi.util.TestLittleEndianStreams
[junitlauncher] Tests run: 5, Failures: 0, Aborted: 0, Skipped: 0, Time elapsed: 0.002000 sec
[junitlauncher] Running org.apache.poi.util.TestLocaleUtil
[junitlauncher] 
[junitlauncher] Running org.apache.poi.util.TestLocaleUtil
[junitlauncher] Tests run: 3, Failures: 0, Aborted: 0, Skipped: 0, Time elapsed: 0.001000 sec
[junitlauncher] Running org.apache.poi.util.TestLongField
[junitlauncher] 
[junitlauncher] Running org.apache.poi.util.TestLongField
[junitlauncher] Tests run: 5, Failures: 0, Aborted: 0, Skipped: 0, Time elapsed: 0.003000 sec
[junitlauncher] Running org.apache.poi.util.TestRLEDecompressingInputStream
[junitlauncher] 
[junitlauncher] Running org.apache.poi.util.TestRLEDecompressingInputStream
[junitlauncher] Tests run: 4, Failures: 0, Aborted: 0, Skipped: 0, Time elapsed: 0.001000 sec
[junitlauncher] Running org.apache.poi.util.TestShortField
[junitlauncher] 
[junitlauncher] Running org.apache.poi.util.TestShortField
[junitlauncher] Tests run: 5, Failures: 0, Aborted: 0, Skipped: 0, Time elapsed: 0.003000 sec
[junitlauncher] Running org.apache.poi.util.TestStringUtil
[junitlauncher] 
[junitlauncher] Running org.apache.poi.util.TestStringUtil
[junitlauncher] Tests run: 7, Failures: 0, Aborted: 0, Skipped: 0, Time elapsed: 0.003000 sec
[junitlauncher] Running org.apache.poi.util.TestTempFile
[junitlauncher] 
[junitlauncher] Running org.apache.poi.util.TestTempFile
[junitlauncher] Tests run: 4, Failures: 0, Aborted: 0, Skipped: 0, Time elapsed: 0.006000 sec
[junitlauncher] Running org.apache.poi.util.TestThreadLocalUtil
[junitlauncher] 
[junitlauncher] Running org.apache.poi.util.TestThreadLocalUtil
[junitlauncher] Tests run: 2, Failures: 0, Aborted: 0, Skipped: 0, Time elapsed: 0.299000 sec
[junitlauncher] Running org.apache.poi.util.TestXMLHelper
[junitlauncher] 
[junitlauncher] Running org.apache.poi.util.TestXMLHelper
[junitlauncher]    Failed: testNewXMLInputFactory(): java.lang.ClassCastException: class java.lang.String cannot be cast to class java.lang.Boolean (java.lang.String and java.lang.Boolean are in module java.base of loader 'bootstrap')
[junitlauncher] Tests run: 9, Failures: 1, Aborted: 0, Skipped: 0, Time elapsed: 0.214000 sec

BUILD FAILED
<https://ci-builds.apache.org/job/POI/job/POI-DSL-1.22/ws/build.xml>:1687: The following error occurred while executing this line:
<https://ci-builds.apache.org/job/POI/job/POI-DSL-1.22/ws/build.xml>:1381: Some test(s) have failure(s)

Total time: 6 minutes 41 seconds
Build step 'Invoke Ant' marked build as failure
ERROR: Not all environment variables could be successfully injected. Check for similarly-named environment variables.
Archiving artifacts
ERROR: Not all environment variables could be successfully injected. Check for similarly-named environment variables.
Recording test results
ERROR: Not all environment variables could be successfully injected. Check for similarly-named environment variables.
[Checks API] No suitable checks publisher found.
ERROR: Not all environment variables could be successfully injected. Check for similarly-named environment variables.

---------------------------------------------------------------------
To unsubscribe, e-mail: dev-unsubscribe@poi.apache.org
For additional commands, e-mail: dev-help@poi.apache.org


Build failed in Jenkins: POI » POI-DSL-1.22 #24

Posted by Apache Jenkins Server <je...@builds.apache.org>.
See <https://ci-builds.apache.org/job/POI/job/POI-DSL-1.22/24/display/redirect?page=changes>

Changes:

[Dominik Stadler] Switch builds for JDK 22 and 23 to Ant for now

Gradle does not yet support newer JDKs

See https://docs.gradle.org/current/userguide/compatibility.html
and https://github.com/gradle/gradle/issues/26162

[Dominik Stadler] SonarQube demands at least JDK 17 now

[Dominik Stadler] Jenknins DSL: Remove builds for JDK 15 and 16

[Dominik Stadler] SonarQube demands at least JDK 17 now

[Dominik Stadler] Fix handling missing font libraries to again not throw on some types of exception

The previous change broke this handling by always re-throwing "Fatal" exceptions.

[Dominik Stadler] Use latest version of rat and rat-plugin

In Gradle builds, this will still use rat 0.15.0, though
as the plugin hardcodes the version of rat that is used.

[Dominik Stadler] Bug 66425: Avoid exceptions found via poi-fuzz

Prevent a few NullPointerException

Fixes https://bugs.chromium.org/p/oss-fuzz/issues/detail?id=65450 and
https://bugs.chromium.org/p/oss-fuzz/issues/detail?id=63907 and
https://bugs.chromium.org/p/oss-fuzz/issues/detail?id=63727

[Dominik Stadler] Fix no-scratchpad CI job


------------------------------------------
[...truncated 172.05 KB...]
[junitlauncher] Running org.apache.poi.ss.formula.ptg.TestArrayPtg
[junitlauncher] Tests run: 5, Failures: 0, Aborted: 0, Skipped: 0, Time elapsed: 0.002000 sec
[junitlauncher] Running org.apache.poi.ss.formula.ptg.TestAttrPtg
[junitlauncher] 
[junitlauncher] Running org.apache.poi.ss.formula.ptg.TestAttrPtg
[junitlauncher] Tests run: 1, Failures: 0, Aborted: 0, Skipped: 0, Time elapsed: 0.000000 sec
[junitlauncher] Running org.apache.poi.ss.formula.ptg.TestErrPtg
[junitlauncher] 
[junitlauncher] Running org.apache.poi.ss.formula.ptg.TestErrPtg
[junitlauncher] Tests run: 1, Failures: 0, Aborted: 0, Skipped: 0, Time elapsed: 0.001000 sec
[junitlauncher] Running org.apache.poi.ss.formula.ptg.TestExternalFunctionFormulas
[junitlauncher] 
[junitlauncher] Running org.apache.poi.ss.formula.ptg.TestExternalFunctionFormulas
[junitlauncher] Tests run: 3, Failures: 0, Aborted: 0, Skipped: 0, Time elapsed: 0.004000 sec
[junitlauncher] Running org.apache.poi.ss.formula.ptg.TestExternalNameReference
[junitlauncher] 
[junitlauncher] Running org.apache.poi.ss.formula.ptg.TestExternalNameReference
[junitlauncher] Tests run: 3, Failures: 0, Aborted: 0, Skipped: 0, Time elapsed: 0.005000 sec
[junitlauncher] Running org.apache.poi.ss.formula.ptg.TestFuncPtg
[junitlauncher] 
[junitlauncher] Running org.apache.poi.ss.formula.ptg.TestFuncPtg
[junitlauncher] Tests run: 2, Failures: 0, Aborted: 0, Skipped: 0, Time elapsed: 0.000000 sec
[junitlauncher] Running org.apache.poi.ss.formula.ptg.TestFuncVarPtg
[junitlauncher] 
[junitlauncher] Running org.apache.poi.ss.formula.ptg.TestFuncVarPtg
[junitlauncher] Tests run: 1, Failures: 0, Aborted: 0, Skipped: 0, Time elapsed: 0.000000 sec
[junitlauncher] Running org.apache.poi.ss.formula.ptg.TestIntersectionPtg
[junitlauncher] 
[junitlauncher] Running org.apache.poi.ss.formula.ptg.TestIntersectionPtg
[junitlauncher] Tests run: 1, Failures: 0, Aborted: 0, Skipped: 0, Time elapsed: 0.001000 sec
[junitlauncher] Running org.apache.poi.ss.formula.ptg.TestPercentPtg
[junitlauncher] 
[junitlauncher] Running org.apache.poi.ss.formula.ptg.TestPercentPtg
[junitlauncher] Tests run: 1, Failures: 0, Aborted: 0, Skipped: 0, Time elapsed: 0.001000 sec
[junitlauncher] Running org.apache.poi.ss.formula.ptg.TestRangePtg
[junitlauncher] 
[junitlauncher] Running org.apache.poi.ss.formula.ptg.TestRangePtg
[junitlauncher] Tests run: 1, Failures: 0, Aborted: 0, Skipped: 0, Time elapsed: 0.001000 sec
[junitlauncher] Running org.apache.poi.ss.formula.ptg.TestRef3DPtg
[junitlauncher] 
[junitlauncher] Running org.apache.poi.ss.formula.ptg.TestRef3DPtg
[junitlauncher] Tests run: 1, Failures: 0, Aborted: 0, Skipped: 0, Time elapsed: 0.000000 sec
[junitlauncher] Running org.apache.poi.ss.formula.ptg.TestReferencePtg
[junitlauncher] 
[junitlauncher] Running org.apache.poi.ss.formula.ptg.TestReferencePtg
[junitlauncher] Tests run: 4, Failures: 0, Aborted: 0, Skipped: 0, Time elapsed: 0.011000 sec
[junitlauncher] Running org.apache.poi.ss.formula.ptg.TestUnionPtg
[junitlauncher] 
[junitlauncher] Running org.apache.poi.ss.formula.ptg.TestUnionPtg
[junitlauncher] Tests run: 1, Failures: 0, Aborted: 0, Skipped: 0, Time elapsed: 0.001000 sec
[junitlauncher] Running org.apache.poi.ss.formula.udf.TestUDFFinder
[junitlauncher] 
[junitlauncher] Running org.apache.poi.ss.formula.udf.TestUDFFinder
[junitlauncher] Tests run: 4, Failures: 0, Aborted: 0, Skipped: 0, Time elapsed: 0.002000 sec
[junitlauncher] Running org.apache.poi.ss.usermodel.TestDataFormatter
[junitlauncher] 
[junitlauncher] Running org.apache.poi.ss.usermodel.TestDataFormatter
[junitlauncher] Tests run: 45, Failures: 0, Aborted: 0, Skipped: 1, Time elapsed: 0.419000 sec
[junitlauncher] Running org.apache.poi.ss.usermodel.TestDateUtil
[junitlauncher] 
[junitlauncher] Running org.apache.poi.ss.usermodel.TestDateUtil
[junitlauncher] Tests run: 26, Failures: 0, Aborted: 0, Skipped: 0, Time elapsed: 0.014000 sec
[junitlauncher] Running org.apache.poi.ss.usermodel.TestExcelStyleDateFormatter
[junitlauncher] 
[junitlauncher] Running org.apache.poi.ss.usermodel.TestExcelStyleDateFormatter
[junitlauncher] Tests run: 124, Failures: 0, Aborted: 0, Skipped: 0, Time elapsed: 0.061000 sec
[junitlauncher] Running org.apache.poi.ss.usermodel.TestFractionFormat
[junitlauncher] 
[junitlauncher] Running org.apache.poi.ss.usermodel.TestFractionFormat
[junitlauncher] Tests run: 5, Failures: 0, Aborted: 0, Skipped: 1, Time elapsed: 0.223000 sec
[junitlauncher] Running org.apache.poi.ss.usermodel.TestHSSFBorderStyle
[junitlauncher] 
[junitlauncher] Running org.apache.poi.ss.usermodel.TestHSSFBorderStyle
[junitlauncher] Tests run: 1, Failures: 0, Aborted: 0, Skipped: 0, Time elapsed: 0.001000 sec
[junitlauncher] Running org.apache.poi.ss.usermodel.TestIndexedColors
[junitlauncher] 
[junitlauncher] Running org.apache.poi.ss.usermodel.TestIndexedColors
[junitlauncher] Tests run: 3, Failures: 0, Aborted: 0, Skipped: 0, Time elapsed: 0.001000 sec
[junitlauncher] Running org.apache.poi.ss.util.TestAreaReference
[junitlauncher] 
[junitlauncher] Running org.apache.poi.ss.util.TestAreaReference
[junitlauncher] Tests run: 3, Failures: 0, Aborted: 0, Skipped: 0, Time elapsed: 0.001000 sec
[junitlauncher] Running org.apache.poi.ss.util.TestCellAddress
[junitlauncher] 
[junitlauncher] Running org.apache.poi.ss.util.TestCellAddress
[junitlauncher] Tests run: 6, Failures: 0, Aborted: 0, Skipped: 0, Time elapsed: 0.001000 sec
[junitlauncher] Running org.apache.poi.ss.util.TestCellRangeAddress
[junitlauncher] 
[junitlauncher] Running org.apache.poi.ss.util.TestCellRangeAddress
[junitlauncher] Tests run: 15, Failures: 0, Aborted: 0, Skipped: 0, Time elapsed: 0.006000 sec
[junitlauncher] Running org.apache.poi.ss.util.TestCellRangeUtil
[junitlauncher] 
[junitlauncher] Running org.apache.poi.ss.util.TestCellRangeUtil
[junitlauncher] Tests run: 1, Failures: 0, Aborted: 0, Skipped: 0, Time elapsed: 0.000000 sec
[junitlauncher] Running org.apache.poi.ss.util.TestCellReference
[junitlauncher] 
[junitlauncher] Running org.apache.poi.ss.util.TestCellReference
[junitlauncher] Tests run: 27, Failures: 0, Aborted: 0, Skipped: 0, Time elapsed: 0.216000 sec
[junitlauncher] Running org.apache.poi.ss.util.TestDateFormatConverter
[junitlauncher] 
[junitlauncher] Running org.apache.poi.ss.util.TestDateFormatConverter
[junitlauncher] Tests run: 19, Failures: 0, Aborted: 0, Skipped: 0, Time elapsed: 4.320000 sec
[junitlauncher] Running org.apache.poi.ss.util.TestDateParser
[junitlauncher] 
[junitlauncher] Running org.apache.poi.ss.util.TestDateParser
[junitlauncher] Tests run: 6, Failures: 0, Aborted: 0, Skipped: 0, Time elapsed: 0.005000 sec
[junitlauncher] Running org.apache.poi.ss.util.TestExpandedDouble
[junitlauncher] 
[junitlauncher] Running org.apache.poi.ss.util.TestExpandedDouble
[junitlauncher] Tests run: 19, Failures: 0, Aborted: 0, Skipped: 0, Time elapsed: 0.014000 sec
[junitlauncher] Running org.apache.poi.ss.util.TestHSSFCellUtil
[junitlauncher] 
[junitlauncher] Running org.apache.poi.ss.util.TestHSSFCellUtil
[junitlauncher] Tests run: 17, Failures: 0, Aborted: 0, Skipped: 0, Time elapsed: 0.020000 sec
[junitlauncher] Running org.apache.poi.ss.util.TestHSSFCellUtilCopy
[junitlauncher] 
[junitlauncher] Running org.apache.poi.ss.util.TestHSSFCellUtilCopy
[junitlauncher] Tests run: 6, Failures: 0, Aborted: 0, Skipped: 0, Time elapsed: 0.008000 sec
[junitlauncher] Running org.apache.poi.ss.util.TestImageUtils
[junitlauncher] 
[junitlauncher] Running org.apache.poi.ss.util.TestImageUtils
[junitlauncher] Tests run: 2, Failures: 0, Aborted: 0, Skipped: 0, Time elapsed: 0.005000 sec
[junitlauncher] Running org.apache.poi.ss.util.TestNumberComparer
[junitlauncher] 
[junitlauncher] Running org.apache.poi.ss.util.TestNumberComparer
[junitlauncher] Tests run: 116, Failures: 0, Aborted: 0, Skipped: 0, Time elapsed: 0.091000 sec
[junitlauncher] Running org.apache.poi.ss.util.TestNumberToTextConverter
[junitlauncher] 
[junitlauncher] Running org.apache.poi.ss.util.TestNumberToTextConverter
[junitlauncher] Tests run: 2, Failures: 0, Aborted: 0, Skipped: 0, Time elapsed: 0.005000 sec
[junitlauncher] Running org.apache.poi.ss.util.TestPaneInformation
[junitlauncher] 
[junitlauncher] Running org.apache.poi.ss.util.TestPaneInformation
[junitlauncher] Tests run: 2, Failures: 0, Aborted: 0, Skipped: 0, Time elapsed: 0.000000 sec
[junitlauncher] Running org.apache.poi.ss.util.TestPropertyTemplate
[junitlauncher] 
[junitlauncher] Running org.apache.poi.ss.util.TestPropertyTemplate
[junitlauncher] Tests run: 8, Failures: 0, Aborted: 0, Skipped: 0, Time elapsed: 0.020000 sec
[junitlauncher] Running org.apache.poi.ss.util.TestRegionUtil
[junitlauncher] 
[junitlauncher] Running org.apache.poi.ss.util.TestRegionUtil
[junitlauncher] Tests run: 10, Failures: 0, Aborted: 0, Skipped: 0, Time elapsed: 0.014000 sec
[junitlauncher] Running org.apache.poi.ss.util.TestSheetBuilder
[junitlauncher] 
[junitlauncher] Running org.apache.poi.ss.util.TestSheetBuilder
[junitlauncher] Tests run: 3, Failures: 0, Aborted: 0, Skipped: 0, Time elapsed: 0.002000 sec
[junitlauncher] Running org.apache.poi.ss.util.TestSheetUtil
[junitlauncher] 
[junitlauncher] Running org.apache.poi.ss.util.TestSheetUtil
[junitlauncher] Tests run: 10, Failures: 0, Aborted: 0, Skipped: 0, Time elapsed: 0.007000 sec
[junitlauncher] Running org.apache.poi.ss.util.TestWorkbookUtil
[junitlauncher] 
[junitlauncher] Running org.apache.poi.ss.util.TestWorkbookUtil
[junitlauncher] Tests run: 1, Failures: 0, Aborted: 0, Skipped: 0, Time elapsed: 0.000000 sec
[junitlauncher] Running org.apache.poi.ss.util.cellwalk.TestCellWalk
[junitlauncher] 
[junitlauncher] Running org.apache.poi.ss.util.cellwalk.TestCellWalk
[junitlauncher] Tests run: 1, Failures: 0, Aborted: 0, Skipped: 0, Time elapsed: 0.002000 sec
[junitlauncher] Running org.apache.poi.util.TestArrayUtil
[junitlauncher] 
[junitlauncher] Running org.apache.poi.util.TestArrayUtil
[junitlauncher] Tests run: 1, Failures: 0, Aborted: 0, Skipped: 0, Time elapsed: 0.001000 sec
[junitlauncher] Running org.apache.poi.util.TestBitField
[junitlauncher] 
[junitlauncher] Running org.apache.poi.util.TestBitField
[junitlauncher] Tests run: 16, Failures: 0, Aborted: 0, Skipped: 0, Time elapsed: 0.003000 sec
[junitlauncher] Running org.apache.poi.util.TestByteField
[junitlauncher] 
[junitlauncher] Running org.apache.poi.util.TestByteField
[junitlauncher] Tests run: 5, Failures: 0, Aborted: 0, Skipped: 0, Time elapsed: 0.002000 sec
[junitlauncher] Running org.apache.poi.util.TestCodepointsUtil
[junitlauncher] 
[junitlauncher] Running org.apache.poi.util.TestCodepointsUtil
[junitlauncher] Tests run: 2, Failures: 0, Aborted: 0, Skipped: 0, Time elapsed: 0.001000 sec
[junitlauncher] Running org.apache.poi.util.TestHexDump
[junitlauncher] 
[junitlauncher] Running org.apache.poi.util.TestHexDump
[junitlauncher] Tests run: 10, Failures: 0, Aborted: 0, Skipped: 0, Time elapsed: 0.009000 sec
[junitlauncher] Running org.apache.poi.util.TestIOUtils
[junitlauncher] 
[junitlauncher] Running org.apache.poi.util.TestIOUtils
[junitlauncher] Tests run: 59, Failures: 0, Aborted: 0, Skipped: 0, Time elapsed: 0.066000 sec
[junitlauncher] Running org.apache.poi.util.TestIntList
[junitlauncher] 
[junitlauncher] Running org.apache.poi.util.TestIntList
[junitlauncher] Tests run: 19, Failures: 0, Aborted: 0, Skipped: 0, Time elapsed: 0.034000 sec
[junitlauncher] Running org.apache.poi.util.TestIntegerField
[junitlauncher] 
[junitlauncher] Running org.apache.poi.util.TestIntegerField
[junitlauncher] Tests run: 5, Failures: 0, Aborted: 0, Skipped: 0, Time elapsed: 0.003000 sec
[junitlauncher] Running org.apache.poi.util.TestLittleEndian
[junitlauncher] 
[junitlauncher] Running org.apache.poi.util.TestLittleEndian
[junitlauncher] Tests run: 15, Failures: 0, Aborted: 0, Skipped: 0, Time elapsed: 0.004000 sec
[junitlauncher] Running org.apache.poi.util.TestLittleEndianInputStream
[junitlauncher] 
[junitlauncher] Running org.apache.poi.util.TestLittleEndianInputStream
[junitlauncher] Tests run: 2, Failures: 0, Aborted: 0, Skipped: 0, Time elapsed: 0.000000 sec
[junitlauncher] Running org.apache.poi.util.TestLittleEndianStreams
[junitlauncher] 
[junitlauncher] Running org.apache.poi.util.TestLittleEndianStreams
[junitlauncher] Tests run: 5, Failures: 0, Aborted: 0, Skipped: 0, Time elapsed: 0.002000 sec
[junitlauncher] Running org.apache.poi.util.TestLocaleUtil
[junitlauncher] 
[junitlauncher] Running org.apache.poi.util.TestLocaleUtil
[junitlauncher] Tests run: 3, Failures: 0, Aborted: 0, Skipped: 0, Time elapsed: 0.001000 sec
[junitlauncher] Running org.apache.poi.util.TestLongField
[junitlauncher] 
[junitlauncher] Running org.apache.poi.util.TestLongField
[junitlauncher] Tests run: 5, Failures: 0, Aborted: 0, Skipped: 0, Time elapsed: 0.003000 sec
[junitlauncher] Running org.apache.poi.util.TestRLEDecompressingInputStream
[junitlauncher] 
[junitlauncher] Running org.apache.poi.util.TestRLEDecompressingInputStream
[junitlauncher] Tests run: 4, Failures: 0, Aborted: 0, Skipped: 0, Time elapsed: 0.001000 sec
[junitlauncher] Running org.apache.poi.util.TestShortField
[junitlauncher] 
[junitlauncher] Running org.apache.poi.util.TestShortField
[junitlauncher] Tests run: 5, Failures: 0, Aborted: 0, Skipped: 0, Time elapsed: 0.003000 sec
[junitlauncher] Running org.apache.poi.util.TestStringUtil
[junitlauncher] 
[junitlauncher] Running org.apache.poi.util.TestStringUtil
[junitlauncher] Tests run: 7, Failures: 0, Aborted: 0, Skipped: 0, Time elapsed: 0.002000 sec
[junitlauncher] Running org.apache.poi.util.TestTempFile
[junitlauncher] 
[junitlauncher] Running org.apache.poi.util.TestTempFile
[junitlauncher] Tests run: 4, Failures: 0, Aborted: 0, Skipped: 0, Time elapsed: 0.006000 sec
[junitlauncher] Running org.apache.poi.util.TestThreadLocalUtil
[junitlauncher] 
[junitlauncher] Running org.apache.poi.util.TestThreadLocalUtil
[junitlauncher] Tests run: 2, Failures: 0, Aborted: 0, Skipped: 0, Time elapsed: 0.265000 sec
[junitlauncher] Running org.apache.poi.util.TestXMLHelper
[junitlauncher] 
[junitlauncher] Running org.apache.poi.util.TestXMLHelper
[junitlauncher]    Failed: testNewXMLInputFactory(): java.lang.ClassCastException: class java.lang.String cannot be cast to class java.lang.Boolean (java.lang.String and java.lang.Boolean are in module java.base of loader 'bootstrap')
[junitlauncher] Tests run: 9, Failures: 1, Aborted: 0, Skipped: 0, Time elapsed: 0.266000 sec

BUILD FAILED
<https://ci-builds.apache.org/job/POI/job/POI-DSL-1.22/ws/build.xml>:1687: The following error occurred while executing this line:
<https://ci-builds.apache.org/job/POI/job/POI-DSL-1.22/ws/build.xml>:1381: Some test(s) have failure(s)

Total time: 7 minutes 1 second
Build step 'Invoke Ant' marked build as failure
ERROR: Not all environment variables could be successfully injected. Check for similarly-named environment variables.
Archiving artifacts
ERROR: Not all environment variables could be successfully injected. Check for similarly-named environment variables.
Recording test results
ERROR: Not all environment variables could be successfully injected. Check for similarly-named environment variables.
[Checks API] No suitable checks publisher found.
ERROR: Not all environment variables could be successfully injected. Check for similarly-named environment variables.

---------------------------------------------------------------------
To unsubscribe, e-mail: dev-unsubscribe@poi.apache.org
For additional commands, e-mail: dev-help@poi.apache.org


Build failed in Jenkins: POI » POI-DSL-1.22 #23

Posted by Apache Jenkins Server <je...@builds.apache.org>.
See <https://ci-builds.apache.org/job/POI/job/POI-DSL-1.22/23/display/redirect?page=changes>

Changes:

[Dominik Stadler] Ignore missing directory 'build/dist/maven' when deleting obsolete jars

Otherwise build may fail on a fresh checkout or after 'clean'

[PJ Fanning] [github-578] allow any non-fatal exception when setting up fonts to indicate that the fonts are probably not installed. This closes #578

[PJ Fanning] cyclonedx 1.8.2

[Dominik Stadler] Try to remove outdated files from the "distribution" folder

Clean directory and keep only the expected files with the current
version.

Otherwise we get strange errors about "duplicate modules" when
building after version was switched.


------------------------------------------
[...truncated 430.04 KB...]
AU        src/documentation/resources/images/built-with-forrest-button.png
AU        src/documentation/resources/images/logoRandyStanard08.png
AU        src/documentation/resources/images/timesheet.jpg
AU        src/documentation/resources/images/poi-logo.png
AU        src/documentation/resources/images/unknown.jpg
AU        src/documentation/resources/images/logoKarmokar1s.png
AU        src/documentation/resources/images/POIFSRootPropertyPreWrite.gif
AU        src/documentation/resources/images/logoWendyWise.png
AU        src/documentation/resources/images/POIFSPropertyTablePreWrite.gif
AU        src/documentation/resources/images/logoKarmokar5s.png
AU        src/documentation/resources/images/ss-features.png
AU        src/documentation/resources/images/businessplan.jpg
AU        src/documentation/resources/images/logoJanssen1.png
AU        src/documentation/resources/images/logoJanssen2.png
AU        src/documentation/resources/images/calendar.jpg
AU        src/documentation/resources/images/loancalc.jpg
AU        src/documentation/resources/images/usermodel.gif
AU        src/documentation/resources/images/logoLoicLefevre.png
AU        src/documentation/resources/images/simple-xls-with-function.jpg
AU        src/documentation/resources/images/logoRaPiGmbH1.png
AU        src/documentation/resources/images/PropertySet.jpg
AU        src/documentation/resources/images/logoRaPiGmbH2.png
AU        src/documentation/resources/images/vba-example.jpg
AU        src/documentation/resources/images/logoKarmokar2s.png
AU        src/documentation/resources/images/logoRaPiGmbH5.png
AU        src/documentation/resources/images/logoRaPiGmbH6.png
AU        src/documentation/resources/images/logoKarmokar6s.png
AU        src/documentation/resources/images/logoRaPiGmbH7.png
AU        src/documentation/resources/images/logoRaPiGmbH8.png
AU        src/documentation/resources/images/logoRaPiGmbH9.png
AU        src/documentation/resources/images/logoDanielFernandez.png
AU        src/documentation/resources/images/logoAndrewClements2.png
AU        src/documentation/resources/images/hslf_shapes.gif
AU        src/documentation/resources/images/logoWendyWise2.png
AU        src/documentation/resources/images/POIFSLifeCycle.gif
AU        src/documentation/resources/images/logoAdria1.png
AU        src/documentation/resources/images/logoAdria2.png
AU        src/documentation/resources/images/logoAdria3.png
AU        src/documentation/resources/images/remove.jpg
AU        src/documentation/resources/images/logoKarmokar3s.png
AU        src/documentation/resources/images/logoGlenStampoutlzis.png
AU        src/documentation/resources/images/logoKarmokar1.png
AU        src/documentation/resources/images/POIFSInitialization.gif
AU        src/documentation/resources/images/logoKarmokar2.png
AU        src/documentation/resources/images/logoRaPiGmbH10.png
AU        src/documentation/resources/images/logoKarmokar3.png
AU        src/documentation/resources/images/logoRaPiGmbH11.png
AU        src/documentation/resources/images/logoMichaelMosmann.png
AU        src/documentation/resources/images/logoKarmokar4.png
AU        src/documentation/resources/images/logoRaPiGmbH12.png
AU        src/documentation/resources/images/logoKarmokar5.png
AU        src/documentation/resources/images/logoKarmokar6.png
AU        src/documentation/resources/images/ApacheConEu08.jpg
AU        src/documentation/resources/images/BlockClassDiagram.gif
AU        src/documentation/resources/images/calculatePayment.jpg
AU        src/documentation/resources/images/PropertyTableClassDiagram.gif
AU        src/documentation/resources/images/logoRussellBeattie1.png
AU        src/documentation/resources/images/logoRussellBeattie2.png
AU        src/documentation/resources/images/logoRussellBeattie3.png
A         src/documentation/sitemap.xmap
A         src/documentation/cli.xconf
AU        src/documentation/README.txt
A         src/documentation/classes
A         src/documentation/classes/CatalogManager.properties
At revision 1915427

At revision 1915427

No changes for https://svn.apache.org/repos/asf/poi/site/forrest.properties since the previous build
No changes for https://svn.apache.org/repos/asf/poi/site/src/documentation since the previous build
ERROR: Not all environment variables could be successfully injected. Check for similarly-named environment variables.
[POI-DSL-1.22] $ /bin/sh -xe /tmp/jenkins6197467696393779537.sh
+ rm -rf examples excelant integrationtest main ooxml ooxml-schema scratchpad build.javacheck.xml
+ svn status
    X   forrest.properties
X       src/documentation

Performing status on external item at 'src/documentation':
+ svn revert poi-examples/src/main/java9/module-info.java poi-excelant/src/main/java9/module-info.java poi-excelant/src/test/java9/module-info.java poi-integration/src/test/java9/module-info.java poi-ooxml-full/src/main/java9/module-info.java poi-ooxml-lite-agent/src/main/java9/module-info.java poi-ooxml-lite/src/main/java9/module-info.java poi-ooxml/src/main/java9/module-info.java poi-ooxml/src/test/java9/module-info.java poi-scratchpad/src/main/java9/module-info.java poi-scratchpad/src/test/java9/module-info.java poi/src/main/java9/module-info.java poi/src/test/java9/module-info.java
+ svn revert src/resources/ooxml-lite-report.clazz src/resources/ooxml-lite-report.xsb
+ echo Java-Home: /home/jenkins/tools/java/latest22
Java-Home: /home/jenkins/tools/java/latest22
+ ls -al /home/jenkins/tools/java/latest22/
total 36
drwxr-xr-x  8 root root 4096 Nov 13 21:48 .
drwxrwxr-x 39 root root 4096 Jan 26 22:07 ..
drwxr-xr-x  2 root root 4096 Nov 13 21:48 bin
drwxr-xr-x  5 root root 4096 Nov 13 21:48 conf
drwxr-xr-x  3 root root 4096 Nov 13 21:48 include
drwxr-xr-x  2 root root 4096 Nov 13 21:48 jmods
drwxr-xr-x 71 root root 4096 Nov 13 21:48 legal
drwxr-xr-x  5 root root 4096 Nov 13 21:48 lib
-rw-r--r--  1 root root 1220 Oct 18 14:34 release
+ ls -al /home/jenkins/tools/java/latest22/bin
total 472
drwxr-xr-x 2 root root  4096 Nov 13 21:48 .
drwxr-xr-x 8 root root  4096 Nov 13 21:48 ..
-rwxr-xr-x 1 root root 12384 Oct 18 14:34 jar
-rwxr-xr-x 1 root root 12392 Oct 18 14:34 jarsigner
-rwxr-xr-x 1 root root 12328 Oct 18 14:34 java
-rwxr-xr-x 1 root root 12416 Oct 18 14:34 javac
-rwxr-xr-x 1 root root 12424 Oct 18 14:34 javadoc
-rwxr-xr-x 1 root root 12384 Oct 18 14:34 javap
-rwxr-xr-x 1 root root 12384 Oct 18 14:34 jcmd
-rwxr-xr-x 1 root root 12456 Oct 18 14:34 jconsole
-rwxr-xr-x 1 root root 12384 Oct 18 14:34 jdb
-rwxr-xr-x 1 root root 12392 Oct 18 14:34 jdeprscan
-rwxr-xr-x 1 root root 12384 Oct 18 14:34 jdeps
-rwxr-xr-x 1 root root 12384 Oct 18 14:34 jfr
-rwxr-xr-x 1 root root 12384 Oct 18 14:34 jhsdb
-rwxr-xr-x 1 root root 12392 Oct 18 14:34 jimage
-rwxr-xr-x 1 root root 12416 Oct 18 14:34 jinfo
-rwxr-xr-x 1 root root 12416 Oct 18 14:34 jlink
-rwxr-xr-x 1 root root 12416 Oct 18 14:34 jmap
-rwxr-xr-x 1 root root 12384 Oct 18 14:34 jmod
-rwxr-xr-x 1 root root 12392 Oct 18 14:34 jpackage
-rwxr-xr-x 1 root root 12384 Oct 18 14:34 jps
-rwxr-xr-x 1 root root 12424 Oct 18 14:34 jrunscript
-rwxr-xr-x 1 root root 12392 Oct 18 14:34 jshell
-rwxr-xr-x 1 root root 12424 Oct 18 14:34 jstack
-rwxr-xr-x 1 root root 12384 Oct 18 14:34 jstat
-rwxr-xr-x 1 root root 12392 Oct 18 14:34 jstatd
-rwxr-xr-x 1 root root 12392 Oct 18 14:34 jwebserver
-rwxr-xr-x 1 root root 12392 Oct 18 14:34 keytool
-rwxr-xr-x 1 root root 12416 Oct 18 14:34 rmiregistry
-rwxr-xr-x 1 root root 12392 Oct 18 14:34 serialver
+ /home/jenkins/tools/java/latest22/bin/java -version
openjdk version "22-ea" 2024-03-19
OpenJDK Runtime Environment (build 22-ea+20-1570)
OpenJDK 64-Bit Server VM (build 22-ea+20-1570, mixed mode, sharing)
+ echo which java
which java
+ which java
/home/jenkins/tools/java/latest22/bin/java
+ java -version
openjdk version "22-ea" 2024-03-19
OpenJDK Runtime Environment (build 22-ea+20-1570)
OpenJDK 64-Bit Server VM (build 22-ea+20-1570, mixed mode, sharing)
+ echo which javac
which javac
+ which javac
/home/jenkins/tools/java/latest22/bin/javac
+ javac -version
javac 22-ea
+ echo Ant-Home:
Ant-Home:
+ ls -al
total 508
drwxr-xr-x 20 jenkins jenkins   4096 Jan 28 03:41 .
drwxr-xr-x  4 jenkins jenkins   4096 Jan 28 03:36 ..
-rw-r--r--  1 jenkins jenkins    520 Jan 28 03:41 .asf.yaml
-rw-r--r--  1 jenkins jenkins  33256 Jan 28 03:40 build.gradle
-rw-r--r--  1 jenkins jenkins 151020 Jan 28 03:40 build.xml
-rw-r--r--  1 jenkins jenkins   7536 Jan 28 03:41 doap_POI.rdf
-rw-r--r--  1 jenkins jenkins   3261 Jan 28 03:41 file-leak-detector.exclude
-rw-r--r--  1 jenkins jenkins   6229 Jan 28 03:41 forrest.properties
-rw-r--r--  1 jenkins jenkins     53 Jan 28 03:41 .gitattributes
drwxr-xr-x  3 jenkins jenkins   4096 Jan 28 03:41 .github
-rw-r--r--  1 jenkins jenkins    396 Jan 28 03:41 .gitignore
drwxr-xr-x  3 jenkins jenkins   4096 Jan 28 03:41 gradle
-rw-r--r--  1 jenkins jenkins    599 Jan 28 03:41 gradle.properties
-rwxr-xr-x  1 jenkins jenkins   8639 Jan 28 03:41 gradlew
-rw-r--r--  1 jenkins jenkins   2868 Jan 28 03:41 gradlew.bat
drwxr-xr-x  2 jenkins jenkins   4096 Jan 28 03:41 jenkins
-rw-r--r--  1 jenkins jenkins 167516 Jan 28 03:41 KEYS
drwxr-xr-x  2 jenkins jenkins   4096 Jan 28 03:40 legal
drwxr-xr-x  2 jenkins jenkins   4096 Jan 28 03:41 lib.stored
drwxr-xr-x  3 jenkins jenkins   4096 Jan 28 03:41 osgi
-rw-r--r--  1 jenkins jenkins   4813 Jan 28 03:41 patch.xml
drwxr-xr-x  4 jenkins jenkins   4096 Jan 28 03:40 poi
drwxr-xr-x  3 jenkins jenkins   4096 Jan 28 03:41 poi-examples
drwxr-xr-x  3 jenkins jenkins   4096 Jan 28 03:40 poi-excelant
drwxr-xr-x  3 jenkins jenkins   4096 Jan 28 03:40 poi-integration
drwxr-xr-x  3 jenkins jenkins   4096 Jan 28 03:40 poi-ooxml
drwxr-xr-x  3 jenkins jenkins   4096 Jan 28 03:41 poi-ooxml-full
drwxr-xr-x  3 jenkins jenkins   4096 Jan 28 03:41 poi-ooxml-lite
drwxr-xr-x  3 jenkins jenkins   4096 Jan 28 03:41 poi-ooxml-lite-agent
drwxr-xr-x  4 jenkins jenkins   4096 Jan 28 03:41 poi-scratchpad
-rw-r--r--  1 jenkins jenkins   4351 Jan 28 03:41 README.rst
-rw-r--r--  1 jenkins jenkins    428 Jan 28 03:41 SECURITY.md
-rw-r--r--  1 jenkins jenkins    190 Jan 28 03:41 settings.gradle
drwxr-xr-x  4 jenkins jenkins   4096 Jan 28 03:41 src
drwxr-xr-x  4 jenkins jenkins   4096 Jan 28 03:41 .svn
drwxr-xr-x 15 jenkins jenkins   4096 Jan 28 03:41 test-data
-rw-r--r--  1 jenkins jenkins   3803 Jan 28 03:41 wrapper.gradle
+ echo which ant
which ant
+ which ant
/usr/bin/ant
+ ant -version
Apache Ant(TM) version 1.10.12 compiled on January 17 1970
+ echo <project default="test"><target name="test"><echo>Java ${ant.java.version}/${java.version}</echo><exec executable="javac"><arg value="-version"/></exec></target></project>
+ ant -f build.javacheck.xml -v
Apache Ant(TM) version 1.10.12 compiled on January 17 1970
Buildfile: <https://ci-builds.apache.org/job/POI/job/POI-DSL-1.22/ws/build.javacheck.xml>
Detected Java version: 22 in: /usr/local/asfpackages/java/openjdk-22-ea+20
Detected OS: Linux
parsing buildfile <https://ci-builds.apache.org/job/POI/job/POI-DSL-1.22/ws/build.javacheck.xml> with URI = <https://ci-builds.apache.org/job/POI/job/POI-DSL-1.22/ws/build.javacheck.xml>
Project base dir set to: <https://ci-builds.apache.org/job/POI/job/POI-DSL-1.22/ws/>
Build sequence for target(s) `test' is [test]
Complete build sequence is [test, ]

test:
parsing buildfile jar:file:/usr/share/ant/lib/ant.jar!/org/apache/tools/ant/antlib.xml with URI = jar:file:/usr/share/ant/lib/ant.jar!/org/apache/tools/ant/antlib.xml from a zip file
     [echo] Java 22/22-ea
     [exec] Current OS is Linux
     [exec] Executing 'javac' with arguments:
     [exec] '-version'
     [exec] 
     [exec] The ' characters around the executable and arguments are
     [exec] not part of the command.
     [exec] javac 22-ea

BUILD SUCCESSFUL
Total time: 1 second
+ exit 0
ERROR: Not all environment variables could be successfully injected. Check for similarly-named environment variables.
[POI-DSL-1.22] $ /bin/sh -xe /tmp/jenkins8376004563122221745.sh
+ touch --no-create build/*/build/test-results/TEST-*.xml build/*/build/test-results/test/TEST-*.xml
[Gradle] - Launching build.
ERROR: Not all environment variables could be successfully injected. Check for similarly-named environment variables.
[POI-DSL-1.22] $ <https://ci-builds.apache.org/job/POI/job/POI-DSL-1.22/ws/gradlew> -PjdkVersion=22 --refresh-dependencies clean jenkins
To honour the JVM settings for this build a single-use Daemon process will be forked. For more on this, please refer to https://docs.gradle.org/8.5/userguide/gradle_daemon.html#sec:disabling_the_daemon in the Gradle documentation.
Daemon will be stopped at the end of the build 
Configuration on demand is an incubating feature.

FAILURE: Build failed with an exception.

* What went wrong:
A problem occurred configuring root project 'poi'.
> Could not open cp_proj generic class cache for build file '<https://ci-builds.apache.org/job/POI/job/POI-DSL-1.22/ws/build.gradle'> (/home/jenkins/.gradle/caches/8.5/scripts/b1z6topld60s8iqmc7c6kj1wj).
   > BUG! exception in phase 'semantic analysis' in source unit '_BuildScript_' Unsupported class file major version 66

* Try:
> Run with --stacktrace option to get the stack trace.
> Run with --info or --debug option to get more log output.
> Run with --scan to get full insights.
> Get more help at https://help.gradle.org.

BUILD FAILED in 18s
Build step 'Invoke Gradle script' changed build result to FAILURE
Build step 'Invoke Gradle script' marked build as failure
ERROR: Not all environment variables could be successfully injected. Check for similarly-named environment variables.
Archiving artifacts
ERROR: Not all environment variables could be successfully injected. Check for similarly-named environment variables.
Recording test results
ERROR: Not all environment variables could be successfully injected. Check for similarly-named environment variables.
ERROR: Step ‘Publish JUnit test result report’ failed: No test report files were found. Configuration error?
ERROR: Not all environment variables could be successfully injected. Check for similarly-named environment variables.

---------------------------------------------------------------------
To unsubscribe, e-mail: dev-unsubscribe@poi.apache.org
For additional commands, e-mail: dev-help@poi.apache.org


Build failed in Jenkins: POI » POI-DSL-1.22 #22

Posted by Apache Jenkins Server <je...@builds.apache.org>.
See <https://ci-builds.apache.org/job/POI/job/POI-DSL-1.22/22/display/redirect?page=changes>

Changes:

[PJ Fanning] revert woodstox upgrade

[PJ Fanning] woodstox upgrade

[PJ Fanning] remove ant release logic (not used for our releases and dependent on libs that don't seem to be maintained)

[PJ Fanning] remove ant release logic (not used for our releases and dependent on libs that don't seem to be maintained)


------------------------------------------
Started by an SCM change
Running as SYSTEM
ERROR: Not all environment variables could be successfully injected. Check for similarly-named environment variables.
[EnvInject] - Loading node environment variables.
[EnvInject] - Preparing an environment for the build.
[EnvInject] - Keeping Jenkins system variables.
[EnvInject] - Keeping Jenkins build variables.
[EnvInject] - Injecting as environment variables the properties content 
FORREST_HOME=/home/jenkins/tools/forrest/latest
LANG=en_US.UTF-8
CI_BUILD=TRUE

[EnvInject] - Variables injected successfully.
[EnvInject] - Injecting contributions.
Building remotely on builds26 (ubuntu) in workspace <https://ci-builds.apache.org/job/POI/job/POI-DSL-1.22/ws/>
[WS-CLEANUP] Deleting project workspace...
[WS-CLEANUP] Done
ERROR: Not all environment variables could be successfully injected. Check for similarly-named environment variables.
Updating https://svn.apache.org/repos/asf/poi/trunk at revision '2024-01-21T03:36:12.452 +0000'
U         build.xml

<-- Got one external: forrest.properties, svn url: https://svn.apache.org/repos/asf/poi/site/forrest.properties -->
Fetching 'https://svn.apache.org/repos/asf/poi/site/forrest.properties' at -1 into '<https://ci-builds.apache.org/job/POI/job/POI-DSL-1.22/ws/forrest.properties'>
At revision 1915346


<-- Got one external: documentation, svn url: https://svn.apache.org/repos/asf/poi/site/src/documentation -->
Fetching 'https://svn.apache.org/repos/asf/poi/site/src/documentation' at -1 into '<https://ci-builds.apache.org/job/POI/job/POI-DSL-1.22/ws/src/documentation'>
At revision 1915346

At revision 1915346

No changes for https://svn.apache.org/repos/asf/poi/site/forrest.properties since the previous build
No changes for https://svn.apache.org/repos/asf/poi/site/src/documentation since the previous build
ERROR: Not all environment variables could be successfully injected. Check for similarly-named environment variables.
[POI-DSL-1.22] $ /bin/sh -xe /tmp/jenkins4813742658388693956.sh
+ rm -rf examples excelant integrationtest main ooxml ooxml-schema scratchpad build.javacheck.xml
+ svn status
    X   forrest.properties
X       src/documentation

Performing status on external item at 'src/documentation':
+ svn revert poi-examples/src/main/java9/module-info.java poi-excelant/src/main/java9/module-info.java poi-excelant/src/test/java9/module-info.java poi-integration/src/test/java9/module-info.java poi-ooxml-full/src/main/java9/module-info.java poi-ooxml-lite-agent/src/main/java9/module-info.java poi-ooxml-lite/src/main/java9/module-info.java poi-ooxml/src/main/java9/module-info.java poi-ooxml/src/test/java9/module-info.java poi-scratchpad/src/main/java9/module-info.java poi-scratchpad/src/test/java9/module-info.java poi/src/main/java9/module-info.java poi/src/test/java9/module-info.java
+ svn revert src/resources/ooxml-lite-report.clazz src/resources/ooxml-lite-report.xsb
+ echo Java-Home: /home/jenkins/tools/java/latest22
Java-Home: /home/jenkins/tools/java/latest22
+ ls -al /home/jenkins/tools/java/latest22/
total 36
drwxr-xr-x  8 root root 4096 Nov 15 13:53 .
drwxrwxr-x 38 root root 4096 Dec 14 17:45 ..
drwxr-xr-x  2 root root 4096 Nov 15 13:53 bin
drwxr-xr-x  5 root root 4096 Nov 15 13:53 conf
drwxr-xr-x  3 root root 4096 Nov 15 13:53 include
drwxr-xr-x  2 root root 4096 Nov 15 13:53 jmods
drwxr-xr-x 71 root root 4096 Nov 15 13:53 legal
drwxr-xr-x  5 root root 4096 Nov 15 13:53 lib
-rw-r--r--  1 root root 1220 Oct 18 14:34 release
+ ls -al /home/jenkins/tools/java/latest22/bin
total 472
drwxr-xr-x 2 root root  4096 Nov 15 13:53 .
drwxr-xr-x 8 root root  4096 Nov 15 13:53 ..
-rwxr-xr-x 1 root root 12384 Oct 18 14:34 jar
-rwxr-xr-x 1 root root 12392 Oct 18 14:34 jarsigner
-rwxr-xr-x 1 root root 12328 Oct 18 14:34 java
-rwxr-xr-x 1 root root 12416 Oct 18 14:34 javac
-rwxr-xr-x 1 root root 12424 Oct 18 14:34 javadoc
-rwxr-xr-x 1 root root 12384 Oct 18 14:34 javap
-rwxr-xr-x 1 root root 12384 Oct 18 14:34 jcmd
-rwxr-xr-x 1 root root 12456 Oct 18 14:34 jconsole
-rwxr-xr-x 1 root root 12384 Oct 18 14:34 jdb
-rwxr-xr-x 1 root root 12392 Oct 18 14:34 jdeprscan
-rwxr-xr-x 1 root root 12384 Oct 18 14:34 jdeps
-rwxr-xr-x 1 root root 12384 Oct 18 14:34 jfr
-rwxr-xr-x 1 root root 12384 Oct 18 14:34 jhsdb
-rwxr-xr-x 1 root root 12392 Oct 18 14:34 jimage
-rwxr-xr-x 1 root root 12416 Oct 18 14:34 jinfo
-rwxr-xr-x 1 root root 12416 Oct 18 14:34 jlink
-rwxr-xr-x 1 root root 12416 Oct 18 14:34 jmap
-rwxr-xr-x 1 root root 12384 Oct 18 14:34 jmod
-rwxr-xr-x 1 root root 12392 Oct 18 14:34 jpackage
-rwxr-xr-x 1 root root 12384 Oct 18 14:34 jps
-rwxr-xr-x 1 root root 12424 Oct 18 14:34 jrunscript
-rwxr-xr-x 1 root root 12392 Oct 18 14:34 jshell
-rwxr-xr-x 1 root root 12424 Oct 18 14:34 jstack
-rwxr-xr-x 1 root root 12384 Oct 18 14:34 jstat
-rwxr-xr-x 1 root root 12392 Oct 18 14:34 jstatd
-rwxr-xr-x 1 root root 12392 Oct 18 14:34 jwebserver
-rwxr-xr-x 1 root root 12392 Oct 18 14:34 keytool
-rwxr-xr-x 1 root root 12416 Oct 18 14:34 rmiregistry
-rwxr-xr-x 1 root root 12392 Oct 18 14:34 serialver
+ /home/jenkins/tools/java/latest22/bin/java -version
openjdk version "22-ea" 2024-03-19
OpenJDK Runtime Environment (build 22-ea+20-1570)
OpenJDK 64-Bit Server VM (build 22-ea+20-1570, mixed mode, sharing)
+ echo which java
which java
+ which java
/home/jenkins/tools/java/latest22/bin/java
+ java -version
openjdk version "22-ea" 2024-03-19
OpenJDK Runtime Environment (build 22-ea+20-1570)
OpenJDK 64-Bit Server VM (build 22-ea+20-1570, mixed mode, sharing)
+ echo which javac
which javac
+ which javac
/home/jenkins/tools/java/latest22/bin/javac
+ javac -version
javac 22-ea
+ echo Ant-Home:
Ant-Home:
+ ls -al
total 512
drwxr-xr-x 22 jenkins jenkins   4096 Jan 21 03:39 .
drwxr-xr-x  3 jenkins jenkins   4096 Jan 13 22:54 ..
-rw-r--r--  1 jenkins jenkins    520 Nov 19 03:39 .asf.yaml
drwxr-xr-x  3 jenkins jenkins   4096 Dec 24 03:38 build
-rw-r--r--  1 jenkins jenkins  30456 Jan 14 03:36 build.gradle
-rw-r--r--  1 jenkins jenkins 151020 Jan 21 03:38 build.xml
-rw-r--r--  1 jenkins jenkins   7536 Nov 26 03:36 doap_POI.rdf
-rw-r--r--  1 jenkins jenkins   3261 Nov 19 03:39 file-leak-detector.exclude
-rw-r--r--  1 jenkins jenkins   6229 Nov 19 03:39 forrest.properties
-rw-r--r--  1 jenkins jenkins     53 Nov 19 03:39 .gitattributes
drwxr-xr-x  3 jenkins jenkins   4096 Nov 19 03:39 .github
-rw-r--r--  1 jenkins jenkins    396 Nov 19 03:39 .gitignore
drwxr-xr-x  5 jenkins jenkins   4096 Dec 17 03:58 .gradle
drwxr-xr-x  3 jenkins jenkins   4096 Nov 19 03:39 gradle
-rw-r--r--  1 jenkins jenkins    599 Nov 19 03:39 gradle.properties
-rwxr-xr-x  1 jenkins jenkins   8639 Nov 19 03:39 gradlew
-rw-r--r--  1 jenkins jenkins   2868 Nov 19 03:39 gradlew.bat
drwxr-xr-x  2 jenkins jenkins   4096 Jan  7 03:38 jenkins
-rw-r--r--  1 jenkins jenkins 167516 Nov 19 03:39 KEYS
drwxr-xr-x  2 jenkins jenkins   4096 Nov 19 03:39 legal
drwxr-xr-x  2 jenkins jenkins   4096 Nov 19 03:39 lib.stored
drwxr-xr-x  3 jenkins jenkins   4096 Jan  7 03:38 osgi
-rw-r--r--  1 jenkins jenkins   4813 Nov 19 03:39 patch.xml
drwxr-xr-x  5 jenkins jenkins   4096 Dec 24 03:40 poi
drwxr-xr-x  4 jenkins jenkins   4096 Dec 24 03:38 poi-examples
drwxr-xr-x  4 jenkins jenkins   4096 Jan 14 03:36 poi-excelant
drwxr-xr-x  4 jenkins jenkins   4096 Jan 14 03:36 poi-integration
drwxr-xr-x  4 jenkins jenkins   4096 Jan 14 03:36 poi-ooxml
drwxr-xr-x  4 jenkins jenkins   4096 Dec 24 03:38 poi-ooxml-full
drwxr-xr-x  4 jenkins jenkins   4096 Dec 24 03:41 poi-ooxml-lite
drwxr-xr-x  4 jenkins jenkins   4096 Dec 24 03:38 poi-ooxml-lite-agent
drwxr-xr-x  5 jenkins jenkins   4096 Dec 24 03:38 poi-scratchpad
-rw-r--r--  1 jenkins jenkins   4351 Nov 19 03:39 README.rst
-rw-r--r--  1 jenkins jenkins    428 Nov 19 03:39 SECURITY.md
-rw-r--r--  1 jenkins jenkins    190 Nov 19 03:39 settings.gradle
drwxr-xr-x  4 jenkins jenkins   4096 Nov 19 03:39 src
drwxr-xr-x  4 jenkins jenkins   4096 Jan 21 03:39 .svn
drwxr-xr-x 15 jenkins jenkins   4096 Nov 19 03:39 test-data
-rw-r--r--  1 jenkins jenkins   3803 Nov 19 03:39 wrapper.gradle
+ echo which ant
which ant
+ which ant
/usr/bin/ant
+ ant -version
Apache Ant(TM) version 1.10.12 compiled on January 17 1970
+ echo <project default="test"><target name="test"><echo>Java ${ant.java.version}/${java.version}</echo><exec executable="javac"><arg value="-version"/></exec></target></project>
+ ant -f build.javacheck.xml -v
Apache Ant(TM) version 1.10.12 compiled on January 17 1970
Buildfile: <https://ci-builds.apache.org/job/POI/job/POI-DSL-1.22/ws/build.javacheck.xml>
Detected Java version: 22 in: /usr/local/asfpackages/java/openjdk-22-ea+20
Detected OS: Linux
parsing buildfile <https://ci-builds.apache.org/job/POI/job/POI-DSL-1.22/ws/build.javacheck.xml> with URI = <https://ci-builds.apache.org/job/POI/job/POI-DSL-1.22/ws/build.javacheck.xml>
Project base dir set to: <https://ci-builds.apache.org/job/POI/job/POI-DSL-1.22/ws/>
Build sequence for target(s) `test' is [test]
Complete build sequence is [test, ]

test:
parsing buildfile jar:file:/usr/share/ant/lib/ant.jar!/org/apache/tools/ant/antlib.xml with URI = jar:file:/usr/share/ant/lib/ant.jar!/org/apache/tools/ant/antlib.xml from a zip file
     [echo] Java 22/22-ea
     [exec] Current OS is Linux
     [exec] Executing 'javac' with arguments:
     [exec] '-version'
     [exec] 
     [exec] The ' characters around the executable and arguments are
     [exec] not part of the command.
     [exec] javac 22-ea

BUILD SUCCESSFUL
Total time: 0 seconds
+ exit 0
ERROR: Not all environment variables could be successfully injected. Check for similarly-named environment variables.
[POI-DSL-1.22] $ /bin/sh -xe /tmp/jenkins3309874955908357082.sh
+ touch --no-create build/*/build/test-results/TEST-*.xml build/*/build/test-results/test/TEST-*.xml
[Gradle] - Launching build.
ERROR: Not all environment variables could be successfully injected. Check for similarly-named environment variables.
[POI-DSL-1.22] $ <https://ci-builds.apache.org/job/POI/job/POI-DSL-1.22/ws/gradlew> -PjdkVersion=22 --refresh-dependencies clean jenkins
To honour the JVM settings for this build a single-use Daemon process will be forked. For more on this, please refer to https://docs.gradle.org/8.5/userguide/gradle_daemon.html#sec:disabling_the_daemon in the Gradle documentation.
Daemon will be stopped at the end of the build 
Configuration on demand is an incubating feature.

FAILURE: Build failed with an exception.

* What went wrong:
A problem occurred configuring root project 'poi'.
> Could not open cp_proj generic class cache for build file '<https://ci-builds.apache.org/job/POI/job/POI-DSL-1.22/ws/build.gradle'> (/home/jenkins/.gradle/caches/8.5/scripts/ff1y75c9b39hqi7fzgthbojy).
   > BUG! exception in phase 'semantic analysis' in source unit '_BuildScript_' Unsupported class file major version 66

* Try:
> Run with --stacktrace option to get the stack trace.
> Run with --info or --debug option to get more log output.
> Run with --scan to get full insights.
> Get more help at https://help.gradle.org.

BUILD FAILED in 20s
Build step 'Invoke Gradle script' changed build result to FAILURE
Build step 'Invoke Gradle script' marked build as failure
ERROR: Not all environment variables could be successfully injected. Check for similarly-named environment variables.
Archiving artifacts
ERROR: Not all environment variables could be successfully injected. Check for similarly-named environment variables.
Recording test results
ERROR: Not all environment variables could be successfully injected. Check for similarly-named environment variables.
[Checks API] No suitable checks publisher found.
ERROR: Not all environment variables could be successfully injected. Check for similarly-named environment variables.

---------------------------------------------------------------------
To unsubscribe, e-mail: dev-unsubscribe@poi.apache.org
For additional commands, e-mail: dev-help@poi.apache.org


Build failed in Jenkins: POI » POI-DSL-1.22 #21

Posted by Apache Jenkins Server <je...@builds.apache.org>.
See <https://ci-builds.apache.org/job/POI/job/POI-DSL-1.22/21/display/redirect?page=changes>

Changes:

[PJ Fanning] slf4j 2.0.11

[PJ Fanning] slf4j 2.0.11


------------------------------------------
Started by an SCM change
Running as SYSTEM
ERROR: Not all environment variables could be successfully injected. Check for similarly-named environment variables.
[EnvInject] - Loading node environment variables.
[EnvInject] - Preparing an environment for the build.
[EnvInject] - Keeping Jenkins system variables.
[EnvInject] - Keeping Jenkins build variables.
[EnvInject] - Injecting as environment variables the properties content 
FORREST_HOME=/home/jenkins/tools/forrest/latest
LANG=en_US.UTF-8
CI_BUILD=TRUE

[EnvInject] - Variables injected successfully.
[EnvInject] - Injecting contributions.
Building remotely on builds26 (ubuntu) in workspace <https://ci-builds.apache.org/job/POI/job/POI-DSL-1.22/ws/>
[WS-CLEANUP] Deleting project workspace...
[WS-CLEANUP] Done
ERROR: Not all environment variables could be successfully injected. Check for similarly-named environment variables.
Updating https://svn.apache.org/repos/asf/poi/trunk at revision '2024-01-14T03:36:15.450 +0000'
U         build.gradle
U         build.xml
U         poi-excelant/build.gradle
U         poi-integration/build.gradle
U         poi-ooxml/build.gradle

<-- Got one external: forrest.properties, svn url: https://svn.apache.org/repos/asf/poi/site/forrest.properties -->
Fetching 'https://svn.apache.org/repos/asf/poi/site/forrest.properties' at -1 into '<https://ci-builds.apache.org/job/POI/job/POI-DSL-1.22/ws/forrest.properties'>
At revision 1915230


<-- Got one external: documentation, svn url: https://svn.apache.org/repos/asf/poi/site/src/documentation -->
Fetching 'https://svn.apache.org/repos/asf/poi/site/src/documentation' at -1 into '<https://ci-builds.apache.org/job/POI/job/POI-DSL-1.22/ws/src/documentation'>
U         src/documentation/content/xdocs/components/index.xml
At revision 1915230

At revision 1915230

No changes for https://svn.apache.org/repos/asf/poi/site/forrest.properties since the previous build
ERROR: Not all environment variables could be successfully injected. Check for similarly-named environment variables.
[POI-DSL-1.22] $ /bin/sh -xe /tmp/jenkins17784066531726459409.sh
+ rm -rf examples excelant integrationtest main ooxml ooxml-schema scratchpad build.javacheck.xml
+ svn status
    X   forrest.properties
X       src/documentation

Performing status on external item at 'src/documentation':
+ svn revert poi-examples/src/main/java9/module-info.java poi-excelant/src/main/java9/module-info.java poi-excelant/src/test/java9/module-info.java poi-integration/src/test/java9/module-info.java poi-ooxml-full/src/main/java9/module-info.java poi-ooxml-lite-agent/src/main/java9/module-info.java poi-ooxml-lite/src/main/java9/module-info.java poi-ooxml/src/main/java9/module-info.java poi-ooxml/src/test/java9/module-info.java poi-scratchpad/src/main/java9/module-info.java poi-scratchpad/src/test/java9/module-info.java poi/src/main/java9/module-info.java poi/src/test/java9/module-info.java
+ svn revert src/resources/ooxml-lite-report.clazz src/resources/ooxml-lite-report.xsb
+ echo Java-Home: /home/jenkins/tools/java/latest22
Java-Home: /home/jenkins/tools/java/latest22
+ ls -al /home/jenkins/tools/java/latest22/
total 36
drwxr-xr-x  8 root root 4096 Nov 15 13:53 .
drwxrwxr-x 38 root root 4096 Dec 14 17:45 ..
drwxr-xr-x  2 root root 4096 Nov 15 13:53 bin
drwxr-xr-x  5 root root 4096 Nov 15 13:53 conf
drwxr-xr-x  3 root root 4096 Nov 15 13:53 include
drwxr-xr-x  2 root root 4096 Nov 15 13:53 jmods
drwxr-xr-x 71 root root 4096 Nov 15 13:53 legal
drwxr-xr-x  5 root root 4096 Nov 15 13:53 lib
-rw-r--r--  1 root root 1220 Oct 18 14:34 release
+ ls -al /home/jenkins/tools/java/latest22/bin
total 472
drwxr-xr-x 2 root root  4096 Nov 15 13:53 .
drwxr-xr-x 8 root root  4096 Nov 15 13:53 ..
-rwxr-xr-x 1 root root 12384 Oct 18 14:34 jar
-rwxr-xr-x 1 root root 12392 Oct 18 14:34 jarsigner
-rwxr-xr-x 1 root root 12328 Oct 18 14:34 java
-rwxr-xr-x 1 root root 12416 Oct 18 14:34 javac
-rwxr-xr-x 1 root root 12424 Oct 18 14:34 javadoc
-rwxr-xr-x 1 root root 12384 Oct 18 14:34 javap
-rwxr-xr-x 1 root root 12384 Oct 18 14:34 jcmd
-rwxr-xr-x 1 root root 12456 Oct 18 14:34 jconsole
-rwxr-xr-x 1 root root 12384 Oct 18 14:34 jdb
-rwxr-xr-x 1 root root 12392 Oct 18 14:34 jdeprscan
-rwxr-xr-x 1 root root 12384 Oct 18 14:34 jdeps
-rwxr-xr-x 1 root root 12384 Oct 18 14:34 jfr
-rwxr-xr-x 1 root root 12384 Oct 18 14:34 jhsdb
-rwxr-xr-x 1 root root 12392 Oct 18 14:34 jimage
-rwxr-xr-x 1 root root 12416 Oct 18 14:34 jinfo
-rwxr-xr-x 1 root root 12416 Oct 18 14:34 jlink
-rwxr-xr-x 1 root root 12416 Oct 18 14:34 jmap
-rwxr-xr-x 1 root root 12384 Oct 18 14:34 jmod
-rwxr-xr-x 1 root root 12392 Oct 18 14:34 jpackage
-rwxr-xr-x 1 root root 12384 Oct 18 14:34 jps
-rwxr-xr-x 1 root root 12424 Oct 18 14:34 jrunscript
-rwxr-xr-x 1 root root 12392 Oct 18 14:34 jshell
-rwxr-xr-x 1 root root 12424 Oct 18 14:34 jstack
-rwxr-xr-x 1 root root 12384 Oct 18 14:34 jstat
-rwxr-xr-x 1 root root 12392 Oct 18 14:34 jstatd
-rwxr-xr-x 1 root root 12392 Oct 18 14:34 jwebserver
-rwxr-xr-x 1 root root 12392 Oct 18 14:34 keytool
-rwxr-xr-x 1 root root 12416 Oct 18 14:34 rmiregistry
-rwxr-xr-x 1 root root 12392 Oct 18 14:34 serialver
+ /home/jenkins/tools/java/latest22/bin/java -version
openjdk version "22-ea" 2024-03-19
OpenJDK Runtime Environment (build 22-ea+20-1570)
OpenJDK 64-Bit Server VM (build 22-ea+20-1570, mixed mode, sharing)
+ echo which java
which java
+ which java
/home/jenkins/tools/java/latest22/bin/java
+ java -version
openjdk version "22-ea" 2024-03-19
OpenJDK Runtime Environment (build 22-ea+20-1570)
OpenJDK 64-Bit Server VM (build 22-ea+20-1570, mixed mode, sharing)
+ echo which javac
which javac
+ which javac
/home/jenkins/tools/java/latest22/bin/javac
+ javac -version
javac 22-ea
+ echo Ant-Home:
Ant-Home:
+ ls -al
total 532
drwxr-xr-x 22 jenkins jenkins   4096 Jan 14 03:36 .
drwxr-xr-x  3 jenkins jenkins   4096 Jan 13 22:54 ..
-rw-r--r--  1 jenkins jenkins    520 Nov 19 03:39 .asf.yaml
drwxr-xr-x  3 jenkins jenkins   4096 Dec 24 03:38 build
-rw-r--r--  1 jenkins jenkins  30456 Jan 14 03:36 build.gradle
-rw-r--r--  1 jenkins jenkins 169141 Jan 14 03:36 build.xml
-rw-r--r--  1 jenkins jenkins   7536 Nov 26 03:36 doap_POI.rdf
-rw-r--r--  1 jenkins jenkins   3261 Nov 19 03:39 file-leak-detector.exclude
-rw-r--r--  1 jenkins jenkins   6229 Nov 19 03:39 forrest.properties
-rw-r--r--  1 jenkins jenkins     53 Nov 19 03:39 .gitattributes
drwxr-xr-x  3 jenkins jenkins   4096 Nov 19 03:39 .github
-rw-r--r--  1 jenkins jenkins    396 Nov 19 03:39 .gitignore
drwxr-xr-x  5 jenkins jenkins   4096 Dec 17 03:58 .gradle
drwxr-xr-x  3 jenkins jenkins   4096 Nov 19 03:39 gradle
-rw-r--r--  1 jenkins jenkins    599 Nov 19 03:39 gradle.properties
-rwxr-xr-x  1 jenkins jenkins   8639 Nov 19 03:39 gradlew
-rw-r--r--  1 jenkins jenkins   2868 Nov 19 03:39 gradlew.bat
drwxr-xr-x  2 jenkins jenkins   4096 Jan  7 03:38 jenkins
-rw-r--r--  1 jenkins jenkins 167516 Nov 19 03:39 KEYS
drwxr-xr-x  2 jenkins jenkins   4096 Nov 19 03:39 legal
drwxr-xr-x  2 jenkins jenkins   4096 Nov 19 03:39 lib.stored
drwxr-xr-x  3 jenkins jenkins   4096 Jan  7 03:38 osgi
-rw-r--r--  1 jenkins jenkins   4813 Nov 19 03:39 patch.xml
drwxr-xr-x  5 jenkins jenkins   4096 Dec 24 03:40 poi
drwxr-xr-x  4 jenkins jenkins   4096 Dec 24 03:38 poi-examples
drwxr-xr-x  4 jenkins jenkins   4096 Jan 14 03:36 poi-excelant
drwxr-xr-x  4 jenkins jenkins   4096 Jan 14 03:36 poi-integration
drwxr-xr-x  4 jenkins jenkins   4096 Jan 14 03:36 poi-ooxml
drwxr-xr-x  4 jenkins jenkins   4096 Dec 24 03:38 poi-ooxml-full
drwxr-xr-x  4 jenkins jenkins   4096 Dec 24 03:41 poi-ooxml-lite
drwxr-xr-x  4 jenkins jenkins   4096 Dec 24 03:38 poi-ooxml-lite-agent
drwxr-xr-x  5 jenkins jenkins   4096 Dec 24 03:38 poi-scratchpad
-rw-r--r--  1 jenkins jenkins   4351 Nov 19 03:39 README.rst
-rw-r--r--  1 jenkins jenkins    428 Nov 19 03:39 SECURITY.md
-rw-r--r--  1 jenkins jenkins    190 Nov 19 03:39 settings.gradle
drwxr-xr-x  4 jenkins jenkins   4096 Nov 19 03:39 src
drwxr-xr-x  4 jenkins jenkins   4096 Jan 14 03:36 .svn
drwxr-xr-x 15 jenkins jenkins   4096 Nov 19 03:39 test-data
-rw-r--r--  1 jenkins jenkins   3803 Nov 19 03:39 wrapper.gradle
+ echo which ant
which ant
+ which ant
/usr/bin/ant
+ ant -version
Apache Ant(TM) version 1.10.12 compiled on January 17 1970
+ echo <project default="test"><target name="test"><echo>Java ${ant.java.version}/${java.version}</echo><exec executable="javac"><arg value="-version"/></exec></target></project>
+ ant -f build.javacheck.xml -v
Apache Ant(TM) version 1.10.12 compiled on January 17 1970
Buildfile: <https://ci-builds.apache.org/job/POI/job/POI-DSL-1.22/ws/build.javacheck.xml>
Detected Java version: 22 in: /usr/local/asfpackages/java/openjdk-22-ea+20
Detected OS: Linux
parsing buildfile <https://ci-builds.apache.org/job/POI/job/POI-DSL-1.22/ws/build.javacheck.xml> with URI = <https://ci-builds.apache.org/job/POI/job/POI-DSL-1.22/ws/build.javacheck.xml>
Project base dir set to: <https://ci-builds.apache.org/job/POI/job/POI-DSL-1.22/ws/>
Build sequence for target(s) `test' is [test]
Complete build sequence is [test, ]

test:
parsing buildfile jar:file:/usr/share/ant/lib/ant.jar!/org/apache/tools/ant/antlib.xml with URI = jar:file:/usr/share/ant/lib/ant.jar!/org/apache/tools/ant/antlib.xml from a zip file
     [echo] Java 22/22-ea
     [exec] Current OS is Linux
     [exec] Executing 'javac' with arguments:
     [exec] '-version'
     [exec] 
     [exec] The ' characters around the executable and arguments are
     [exec] not part of the command.
     [exec] javac 22-ea

BUILD SUCCESSFUL
Total time: 0 seconds
+ exit 0
ERROR: Not all environment variables could be successfully injected. Check for similarly-named environment variables.
[POI-DSL-1.22] $ /bin/sh -xe /tmp/jenkins804471406141686708.sh
+ touch --no-create build/*/build/test-results/TEST-*.xml build/*/build/test-results/test/TEST-*.xml
[Gradle] - Launching build.
ERROR: Not all environment variables could be successfully injected. Check for similarly-named environment variables.
[POI-DSL-1.22] $ <https://ci-builds.apache.org/job/POI/job/POI-DSL-1.22/ws/gradlew> -PjdkVersion=22 --refresh-dependencies clean jenkins
To honour the JVM settings for this build a single-use Daemon process will be forked. For more on this, please refer to https://docs.gradle.org/8.5/userguide/gradle_daemon.html#sec:disabling_the_daemon in the Gradle documentation.
Daemon will be stopped at the end of the build 
Configuration on demand is an incubating feature.

FAILURE: Build failed with an exception.

* What went wrong:
A problem occurred configuring root project 'poi'.
> Could not open cp_proj generic class cache for build file '<https://ci-builds.apache.org/job/POI/job/POI-DSL-1.22/ws/build.gradle'> (/home/jenkins/.gradle/caches/8.5/scripts/ff1y75c9b39hqi7fzgthbojy).
   > BUG! exception in phase 'semantic analysis' in source unit '_BuildScript_' Unsupported class file major version 66

* Try:
> Run with --stacktrace option to get the stack trace.
> Run with --info or --debug option to get more log output.
> Run with --scan to get full insights.
> Get more help at https://help.gradle.org.

BUILD FAILED in 19s
Build step 'Invoke Gradle script' changed build result to FAILURE
Build step 'Invoke Gradle script' marked build as failure
ERROR: Not all environment variables could be successfully injected. Check for similarly-named environment variables.
Archiving artifacts
ERROR: Not all environment variables could be successfully injected. Check for similarly-named environment variables.
Recording test results
ERROR: Not all environment variables could be successfully injected. Check for similarly-named environment variables.
[Checks API] No suitable checks publisher found.
ERROR: Not all environment variables could be successfully injected. Check for similarly-named environment variables.

---------------------------------------------------------------------
To unsubscribe, e-mail: dev-unsubscribe@poi.apache.org
For additional commands, e-mail: dev-help@poi.apache.org