You are viewing a plain text version of this content. The canonical link for it is here.
Posted to builds@cassandra.apache.org by Apache Jenkins Server <je...@builds.apache.org> on 2025/04/25 20:45:14 UTC

Build complete: Cassandra-trunk #2128 [UNSTABLE] fc97fd1037843ddb320011c52faa5a3896368731

-------------------------------------------------------------------------------
  Build Cassandra-trunk #2128 Still unstable
  URL: https://ci-cassandra.apache.org/job/Cassandra-trunk/2128/
  -------------------------------------------------------------------------------
  Changes:
  [Stefan Miklosovic] Upgrade logback version to 1.5.18 and slf4j dependencies to 2.0.17


  -------------------------------------------------------------------------------
  Failed Tests:
  17 tests failed.
FAILED:  dtest-novnode.repair_tests.repair_test.TestRepair.Tests / dtest-novnode jdk11 54/64 / test_local_dc_repair
FAILED:  dtest-upgrade-large.upgrade_tests.upgrade_through_versions_test.TestProtoV5Upgrade_AllVersions_RandomPartitioner_EndsAt_Trunk_HEAD.Tests / dtest-upgrade-large jdk11 25/32 / test_parallel_upgrade
FAILED:  dtest-upgrade-large.upgrade_tests.upgrade_through_versions_test.TestUpgrade_indev_4_1_x_To_indev_trunk.Tests / dtest-upgrade-large jdk11 25/32 / test_parallel_upgrade_with_internode_ssl
FAILED:  dtest-upgrade-novnode.upgrade_tests.cql_tests.TestCQLNodes2RF1_Upgrade_indev_4_0_x_To_indev_trunk.Tests / dtest-upgrade-novnode jdk11 43/128 / test_composite_partition_key_validation
FAILED:  dtest-upgrade-novnode.upgrade_tests.cql_tests.TestCQLNodes3RF3_Upgrade_indev_4_0_x_To_indev_trunk.Tests / dtest-upgrade-novnode jdk11 71/128 / test_conditional_update
FAILED:  dtest-upgrade-novnode.upgrade_tests.cql_tests.TestCQLNodes3RF3_Upgrade_indev_4_0_x_To_indev_trunk.Tests / dtest-upgrade-novnode jdk11 33/128 / test_limit_bugs
FAILED:  dtest-upgrade-novnode.upgrade_tests.cql_tests.TestCQLNodes3RF3_Upgrade_indev_4_0_x_To_indev_trunk.Tests / dtest-upgrade-novnode jdk11 22/128 / test_multi_collection
FAILED:  dtest-upgrade.upgrade_tests.cql_tests.TestCQLNodes3RF3_Upgrade_indev_4_0_x_To_indev_trunk.Tests / dtest-upgrade jdk11 95/128 / test_no_range_ghost
FAILED:  dtest.global_row_key_cache_test.TestGlobalRowKeyCache.Tests / dtest jdk17 57/64 / test_functional
FAILED:  org.apache.cassandra.distributed.test.accord.AccordHostReplacementTest.Tests / jvm-dtest jdk17 10/12 / hostReplace-_jdk17_x86_64
FAILED:  org.apache.cassandra.index.accord.RouteIndexTest.Tests / test-compression jdk17 6/16 / test-cassandra.testtag_IS_UNDEFINED
FAILED:  org.apache.cassandra.io.sstable.indexsummary.IndexSummaryTest.Tests / test-system-keyspace-directory jdk11 15/16 / testLargeIndexSummary-cassandra.testtag_IS_UNDEFINED
FAILED:  org.apache.cassandra.io.sstable.indexsummary.IndexSummaryTest.Tests / test-cdc jdk11 7/8 / testLargeIndexSummary-cassandra.testtag_IS_UNDEFINED
FAILED:  org.apache.cassandra.io.sstable.indexsummary.IndexSummaryTest.Tests / test-latest jdk17 15/16 / testLargeIndexSummary-cassandra.testtag_IS_UNDEFINED
FAILED:  org.apache.cassandra.io.sstable.indexsummary.IndexSummaryTest.Tests / test-compression jdk11 15/16 / testLargeIndexSummary-cassandra.testtag_IS_UNDEFINED
FAILED:  org.apache.cassandra.io.sstable.indexsummary.IndexSummaryTest.Tests / test-cdc jdk17 7/8 / testLargeIndexSummary-cassandra.testtag_IS_UNDEFINED
FAILED:  org.apache.cassandra.fuzz.sai.MultiNodeSAITest.Tests / jvm-dtest jdk17 1/12 / mixedFilteringSaiTest-cassandra.testtag_IS_UNDEFINED

  -------------------------------------------------------------------------------
  For complete test report and logs see https://nightlies.apache.org/cassandra/Cassandra-trunk/2128/