You are viewing a plain text version of this content. The canonical link for it is here.
Posted to commits@phoenix.apache.org by Apache Jenkins Server <je...@builds.apache.org> on 2014/07/22 05:03:25 UTC
Build failed in Jenkins: Phoenix | 4.0 | Hadoop1 #216
See <https://builds.apache.org/job/Phoenix-4.0-hadoop1/216/changes>
Changes:
[mujtabachohan] PHOENIX-1104 Do not shutdown threadpool when initialization fails
------------------------------------------
[...truncated 535 lines...]
at java.util.concurrent.FutureTask.run(FutureTask.java:262)
at java.util.concurrent.ThreadPoolExecutor.runWorker(ThreadPoolExecutor.java:1145)
at java.util.concurrent.ThreadPoolExecutor$Worker.run(ThreadPoolExecutor.java:615)
at java.lang.Thread.run(Thread.java:744)
Caused by: org.apache.hadoop.hbase.ipc.RemoteWithExtrasException: org.apache.hadoop.hbase.DoNotRetryIOException: ATABLE: Didn't find expected key values for table row in metadata row
at org.apache.phoenix.util.ServerUtil.createIOException(ServerUtil.java:77)
at org.apache.phoenix.coprocessor.MetaDataEndpointImpl.getTable(MetaDataEndpointImpl.java:347)
at org.apache.phoenix.coprocessor.generated.MetaDataProtos$MetaDataService.callMethod(MetaDataProtos.java:6576)
at org.apache.hadoop.hbase.regionserver.HRegion.execService(HRegion.java:5493)
at org.apache.hadoop.hbase.regionserver.HRegionServer.execServiceOnRegion(HRegionServer.java:3300)
at org.apache.hadoop.hbase.regionserver.HRegionServer.execService(HRegionServer.java:3282)
at org.apache.hadoop.hbase.protobuf.generated.ClientProtos$ClientService$2.callBlockingMethod(ClientProtos.java:29501)
at org.apache.hadoop.hbase.ipc.RpcServer.call(RpcServer.java:2012)
at org.apache.hadoop.hbase.ipc.CallRunner.run(CallRunner.java:98)
at org.apache.hadoop.hbase.ipc.SimpleRpcScheduler.consumerLoop(SimpleRpcScheduler.java:160)
at org.apache.hadoop.hbase.ipc.SimpleRpcScheduler.access$000(SimpleRpcScheduler.java:38)
at org.apache.hadoop.hbase.ipc.SimpleRpcScheduler$1.run(SimpleRpcScheduler.java:110)
at java.lang.Thread.run(Thread.java:744)
Caused by: java.lang.IllegalStateException: Didn't find expected key values for table row in metadata row
at org.apache.phoenix.coprocessor.MetaDataEndpointImpl.getTable(MetaDataEndpointImpl.java:584)
at org.apache.phoenix.coprocessor.MetaDataEndpointImpl.buildTable(MetaDataEndpointImpl.java:420)
at org.apache.phoenix.coprocessor.MetaDataEndpointImpl.doGetTable(MetaDataEndpointImpl.java:399)
at org.apache.phoenix.coprocessor.MetaDataEndpointImpl.getTable(MetaDataEndpointImpl.java:331)
... 11 more
at org.apache.hadoop.hbase.ipc.RpcClient.call(RpcClient.java:1450)
at org.apache.hadoop.hbase.ipc.RpcClient.callBlockingMethod(RpcClient.java:1654)
at org.apache.hadoop.hbase.ipc.RpcClient$BlockingRpcChannelImplementation.callBlockingMethod(RpcClient.java:1712)
at org.apache.hadoop.hbase.protobuf.generated.ClientProtos$ClientService$BlockingStub.execService(ClientProtos.java:29924)
at org.apache.hadoop.hbase.protobuf.ProtobufUtil.execService(ProtobufUtil.java:1508)
at org.apache.hadoop.hbase.ipc.RegionCoprocessorRpcChannel$1.call(RegionCoprocessorRpcChannel.java:87)
at org.apache.hadoop.hbase.ipc.RegionCoprocessorRpcChannel$1.call(RegionCoprocessorRpcChannel.java:84)
at org.apache.hadoop.hbase.client.RpcRetryingCaller.callWithRetries(RpcRetryingCaller.java:114)
at org.apache.hadoop.hbase.client.RpcRetryingCaller.callWithRetries(RpcRetryingCaller.java:90)
at org.apache.hadoop.hbase.ipc.RegionCoprocessorRpcChannel.callExecService(RegionCoprocessorRpcChannel.java:90)
at org.apache.hadoop.hbase.ipc.CoprocessorRpcChannel.callMethod(CoprocessorRpcChannel.java:51)
at org.apache.phoenix.coprocessor.generated.MetaDataProtos$MetaDataService$Stub.getTable(MetaDataProtos.java:6700)
at org.apache.phoenix.query.ConnectionQueryServicesImpl$5.call(ConnectionQueryServicesImpl.java:1224)
at org.apache.phoenix.query.ConnectionQueryServicesImpl$5.call(ConnectionQueryServicesImpl.java:1211)
at org.apache.hadoop.hbase.client.HTable$16.call(HTable.java:1527)
at java.util.concurrent.FutureTask.run(FutureTask.java:262)
at java.util.concurrent.ThreadPoolExecutor.runWorker(ThreadPoolExecutor.java:1145)
at java.util.concurrent.ThreadPoolExecutor$Worker.run(ThreadPoolExecutor.java:615)
at java.lang.Thread.run(Thread.java:744)
testExecuteStatements(org.apache.phoenix.end2end.ExecuteStatementsIT) Time elapsed: 0.109 sec <<< ERROR!
org.apache.phoenix.exception.PhoenixIOException: org.apache.hadoop.hbase.DoNotRetryIOException: ATABLE: Didn't find expected key values for table row in metadata row
at org.apache.phoenix.util.ServerUtil.parseServerException(ServerUtil.java:101)
at org.apache.phoenix.query.ConnectionQueryServicesImpl.metaDataCoprocessorExec(ConnectionQueryServicesImpl.java:990)
at org.apache.phoenix.query.ConnectionQueryServicesImpl.createTable(ConnectionQueryServicesImpl.java:1183)
at org.apache.phoenix.query.DelegateConnectionQueryServices.createTable(DelegateConnectionQueryServices.java:114)
at org.apache.phoenix.schema.MetaDataClient.createTableInternal(MetaDataClient.java:1265)
at org.apache.phoenix.schema.MetaDataClient.createTable(MetaDataClient.java:434)
at org.apache.phoenix.compile.CreateTableCompiler$2.execute(CreateTableCompiler.java:183)
at org.apache.phoenix.jdbc.PhoenixStatement$2.call(PhoenixStatement.java:247)
at org.apache.phoenix.jdbc.PhoenixStatement$2.call(PhoenixStatement.java:238)
at org.apache.phoenix.util.PhoenixContextExecutor.call(PhoenixContextExecutor.java:54)
at org.apache.phoenix.jdbc.PhoenixStatement.executeMutation(PhoenixStatement.java:237)
at org.apache.phoenix.jdbc.PhoenixStatement.execute(PhoenixStatement.java:961)
at org.apache.phoenix.query.BaseTest.createTestTable(BaseTest.java:644)
at org.apache.phoenix.query.BaseTest.createTestTable(BaseTest.java:618)
at org.apache.phoenix.query.BaseTest.ensureTableCreated(BaseTest.java:610)
at org.apache.phoenix.query.BaseTest.ensureTableCreated(BaseTest.java:601)
at org.apache.phoenix.query.BaseTest.initATableValues(BaseTest.java:805)
at org.apache.phoenix.query.BaseTest.initATableValues(BaseTest.java:798)
at org.apache.phoenix.query.BaseTest.initATableValues(BaseTest.java:794)
at org.apache.phoenix.end2end.ExecuteStatementsIT.testExecuteStatements(ExecuteStatementsIT.java:57)
Caused by: org.apache.hadoop.hbase.DoNotRetryIOException: org.apache.hadoop.hbase.DoNotRetryIOException: ATABLE: Didn't find expected key values for table row in metadata row
at sun.reflect.NativeConstructorAccessorImpl.newInstance0(Native Method)
at sun.reflect.NativeConstructorAccessorImpl.newInstance(NativeConstructorAccessorImpl.java:57)
at sun.reflect.DelegatingConstructorAccessorImpl.newInstance(DelegatingConstructorAccessorImpl.java:45)
at java.lang.reflect.Constructor.newInstance(Constructor.java:526)
at org.apache.hadoop.ipc.RemoteException.instantiateException(RemoteException.java:95)
at org.apache.hadoop.ipc.RemoteException.unwrapRemoteException(RemoteException.java:79)
at org.apache.hadoop.hbase.protobuf.ProtobufUtil.getRemoteException(ProtobufUtil.java:284)
at org.apache.hadoop.hbase.protobuf.ProtobufUtil.execService(ProtobufUtil.java:1512)
at org.apache.hadoop.hbase.ipc.RegionCoprocessorRpcChannel$1.call(RegionCoprocessorRpcChannel.java:87)
at org.apache.hadoop.hbase.ipc.RegionCoprocessorRpcChannel$1.call(RegionCoprocessorRpcChannel.java:84)
at org.apache.hadoop.hbase.client.RpcRetryingCaller.callWithRetries(RpcRetryingCaller.java:114)
at org.apache.hadoop.hbase.client.RpcRetryingCaller.callWithRetries(RpcRetryingCaller.java:90)
at org.apache.hadoop.hbase.ipc.RegionCoprocessorRpcChannel.callExecService(RegionCoprocessorRpcChannel.java:90)
at org.apache.hadoop.hbase.ipc.CoprocessorRpcChannel.callMethod(CoprocessorRpcChannel.java:51)
at org.apache.phoenix.coprocessor.generated.MetaDataProtos$MetaDataService$Stub.createTable(MetaDataProtos.java:6715)
at org.apache.phoenix.query.ConnectionQueryServicesImpl$4.call(ConnectionQueryServicesImpl.java:1195)
at org.apache.phoenix.query.ConnectionQueryServicesImpl$4.call(ConnectionQueryServicesImpl.java:1184)
at org.apache.hadoop.hbase.client.HTable$16.call(HTable.java:1527)
at java.util.concurrent.FutureTask.run(FutureTask.java:262)
at java.util.concurrent.ThreadPoolExecutor.runWorker(ThreadPoolExecutor.java:1145)
at java.util.concurrent.ThreadPoolExecutor$Worker.run(ThreadPoolExecutor.java:615)
at java.lang.Thread.run(Thread.java:744)
Caused by: org.apache.hadoop.hbase.ipc.RemoteWithExtrasException: org.apache.hadoop.hbase.DoNotRetryIOException: ATABLE: Didn't find expected key values for table row in metadata row
at org.apache.phoenix.util.ServerUtil.createIOException(ServerUtil.java:77)
at org.apache.phoenix.coprocessor.MetaDataEndpointImpl.createTable(MetaDataEndpointImpl.java:840)
at org.apache.phoenix.coprocessor.generated.MetaDataProtos$MetaDataService.callMethod(MetaDataProtos.java:6581)
at org.apache.hadoop.hbase.regionserver.HRegion.execService(HRegion.java:5493)
at org.apache.hadoop.hbase.regionserver.HRegionServer.execServiceOnRegion(HRegionServer.java:3300)
at org.apache.hadoop.hbase.regionserver.HRegionServer.execService(HRegionServer.java:3282)
at org.apache.hadoop.hbase.protobuf.generated.ClientProtos$ClientService$2.callBlockingMethod(ClientProtos.java:29501)
at org.apache.hadoop.hbase.ipc.RpcServer.call(RpcServer.java:2012)
at org.apache.hadoop.hbase.ipc.CallRunner.run(CallRunner.java:98)
at org.apache.hadoop.hbase.ipc.SimpleRpcScheduler.consumerLoop(SimpleRpcScheduler.java:160)
at org.apache.hadoop.hbase.ipc.SimpleRpcScheduler.access$000(SimpleRpcScheduler.java:38)
at org.apache.hadoop.hbase.ipc.SimpleRpcScheduler$1.run(SimpleRpcScheduler.java:110)
at java.lang.Thread.run(Thread.java:744)
Caused by: java.lang.IllegalStateException: Didn't find expected key values for table row in metadata row
at org.apache.phoenix.coprocessor.MetaDataEndpointImpl.getTable(MetaDataEndpointImpl.java:584)
at org.apache.phoenix.coprocessor.MetaDataEndpointImpl.buildTable(MetaDataEndpointImpl.java:420)
at org.apache.phoenix.coprocessor.MetaDataEndpointImpl.loadTable(MetaDataEndpointImpl.java:711)
at org.apache.phoenix.coprocessor.MetaDataEndpointImpl.createTable(MetaDataEndpointImpl.java:789)
... 11 more
at org.apache.hadoop.hbase.ipc.RpcClient.call(RpcClient.java:1450)
at org.apache.hadoop.hbase.ipc.RpcClient.callBlockingMethod(RpcClient.java:1654)
at org.apache.hadoop.hbase.ipc.RpcClient$BlockingRpcChannelImplementation.callBlockingMethod(RpcClient.java:1712)
at org.apache.hadoop.hbase.protobuf.generated.ClientProtos$ClientService$BlockingStub.execService(ClientProtos.java:29924)
at org.apache.hadoop.hbase.protobuf.ProtobufUtil.execService(ProtobufUtil.java:1508)
at org.apache.hadoop.hbase.ipc.RegionCoprocessorRpcChannel$1.call(RegionCoprocessorRpcChannel.java:87)
at org.apache.hadoop.hbase.ipc.RegionCoprocessorRpcChannel$1.call(RegionCoprocessorRpcChannel.java:84)
at org.apache.hadoop.hbase.client.RpcRetryingCaller.callWithRetries(RpcRetryingCaller.java:114)
at org.apache.hadoop.hbase.client.RpcRetryingCaller.callWithRetries(RpcRetryingCaller.java:90)
at org.apache.hadoop.hbase.ipc.RegionCoprocessorRpcChannel.callExecService(RegionCoprocessorRpcChannel.java:90)
at org.apache.hadoop.hbase.ipc.CoprocessorRpcChannel.callMethod(CoprocessorRpcChannel.java:51)
at org.apache.phoenix.coprocessor.generated.MetaDataProtos$MetaDataService$Stub.createTable(MetaDataProtos.java:6715)
at org.apache.phoenix.query.ConnectionQueryServicesImpl$4.call(ConnectionQueryServicesImpl.java:1195)
at org.apache.phoenix.query.ConnectionQueryServicesImpl$4.call(ConnectionQueryServicesImpl.java:1184)
at org.apache.hadoop.hbase.client.HTable$16.call(HTable.java:1527)
at java.util.concurrent.FutureTask.run(FutureTask.java:262)
at java.util.concurrent.ThreadPoolExecutor.runWorker(ThreadPoolExecutor.java:1145)
at java.util.concurrent.ThreadPoolExecutor$Worker.run(ThreadPoolExecutor.java:615)
at java.lang.Thread.run(Thread.java:744)
Running org.apache.phoenix.end2end.ServerExceptionIT
Tests run: 1, Failures: 0, Errors: 0, Skipped: 0, Time elapsed: 2.195 sec - in org.apache.phoenix.end2end.ServerExceptionIT
Running org.apache.phoenix.end2end.CSVCommonsLoaderIT
Tests run: 26, Failures: 0, Errors: 0, Skipped: 0, Time elapsed: 136.803 sec - in org.apache.phoenix.end2end.index.MutableIndexIT
Running org.apache.phoenix.end2end.TenantSpecificViewIndexIT
Tests run: 13, Failures: 0, Errors: 0, Skipped: 0, Time elapsed: 11.103 sec - in org.apache.phoenix.end2end.CSVCommonsLoaderIT
Running org.apache.phoenix.end2end.StatementHintsIT
Tests run: 2, Failures: 0, Errors: 0, Skipped: 0, Time elapsed: 2.775 sec - in org.apache.phoenix.end2end.StatementHintsIT
Running org.apache.phoenix.end2end.TenantSpecificViewIndexSaltedIT
Tests run: 6, Failures: 0, Errors: 0, Skipped: 0, Time elapsed: 16.223 sec - in org.apache.phoenix.end2end.TenantSpecificViewIndexIT
Running org.apache.phoenix.end2end.TimezoneOffsetFunctionIT
Tests run: 6, Failures: 0, Errors: 0, Skipped: 0, Time elapsed: 3.197 sec - in org.apache.phoenix.end2end.TimezoneOffsetFunctionIT
Running org.apache.phoenix.end2end.QueryExecWithoutSCNIT
Tests run: 4, Failures: 0, Errors: 0, Skipped: 0, Time elapsed: 9.326 sec - in org.apache.phoenix.end2end.TenantSpecificViewIndexSaltedIT
Running org.apache.phoenix.end2end.LpadFunctionIT
Tests run: 90, Failures: 0, Errors: 0, Skipped: 0, Time elapsed: 67.354 sec - in org.apache.phoenix.end2end.HashJoinIT
Running org.apache.phoenix.end2end.LastValueFunctionIT
Tests run: 1, Failures: 0, Errors: 0, Skipped: 0, Time elapsed: 2.841 sec - in org.apache.phoenix.end2end.QueryExecWithoutSCNIT
Running org.apache.phoenix.end2end.salted.SaltedTableUpsertSelectIT
Tests run: 10, Failures: 0, Errors: 0, Skipped: 0, Time elapsed: 6.915 sec - in org.apache.phoenix.end2end.LpadFunctionIT
Running org.apache.phoenix.end2end.DynamicFamilyIT
Tests run: 11, Failures: 0, Errors: 0, Skipped: 0, Time elapsed: 6.31 sec - in org.apache.phoenix.end2end.LastValueFunctionIT
Running org.apache.phoenix.end2end.SaltedViewIT
Tests run: 5, Failures: 0, Errors: 0, Skipped: 0, Time elapsed: 6.286 sec - in org.apache.phoenix.end2end.salted.SaltedTableUpsertSelectIT
Running org.apache.phoenix.end2end.AlterTableIT
Tests run: 4, Failures: 0, Errors: 0, Skipped: 0, Time elapsed: 5.457 sec - in org.apache.phoenix.end2end.DynamicFamilyIT
Running org.apache.phoenix.end2end.SpillableGroupByIT
Tests run: 2, Failures: 0, Errors: 0, Skipped: 0, Time elapsed: 8.454 sec - in org.apache.phoenix.end2end.SaltedViewIT
Running org.apache.phoenix.end2end.ConvertTimezoneFunctionIT
Tests run: 1, Failures: 0, Errors: 0, Skipped: 0, Time elapsed: 3.347 sec - in org.apache.phoenix.end2end.SpillableGroupByIT
Tests run: 6, Failures: 0, Errors: 0, Skipped: 0, Time elapsed: 2.305 sec - in org.apache.phoenix.end2end.ConvertTimezoneFunctionIT
Tests run: 14, Failures: 0, Errors: 0, Skipped: 0, Time elapsed: 29.366 sec - in org.apache.phoenix.end2end.AlterTableIT
Results :
Tests in error:
ExecuteStatementsIT.testCharPadding:201->BaseTest.initATableValues:1003 ? PhoenixIO
ExecuteStatementsIT.testExecuteStatements:57->BaseTest.initATableValues:794->BaseTest.initATableValues:798->BaseTest.initATableValues:805->BaseTest.ensureTableCreated:601->BaseTest.ensureTableCreated:610->BaseTest.createTestTable:618->BaseTest.createTestTable:644 ? PhoenixIO
Tests run: 401, Failures: 0, Errors: 2, Skipped: 0
[INFO]
[INFO] --- maven-failsafe-plugin:2.17:integration-test (NeedTheirOwnClusterTests) @ phoenix-core ---
[INFO] Failsafe report directory: <https://builds.apache.org/job/Phoenix-4.0-hadoop1/ws/phoenix-core/target/failsafe-reports>
[INFO] parallel='none', perCoreThreadCount=true, threadCount=0, useUnlimitedThreads=false, threadCountSuites=0, threadCountClasses=0, threadCountMethods=0, parallelOptimized=true
-------------------------------------------------------
T E S T S
-------------------------------------------------------
-------------------------------------------------------
T E S T S
-------------------------------------------------------
Running org.apache.phoenix.end2end.index.MutableIndexFailureIT
Running org.apache.phoenix.end2end.ContextClassloaderIT
Running org.apache.phoenix.mapreduce.CsvBulkLoadToolIT
Tests run: 3, Failures: 0, Errors: 0, Skipped: 0, Time elapsed: 7.809 sec - in org.apache.phoenix.end2end.ContextClassloaderIT
Running org.apache.phoenix.hbase.index.FailForUnsupportedHBaseVersionsIT
Tests run: 1, Failures: 0, Errors: 0, Skipped: 0, Time elapsed: 9.298 sec - in org.apache.phoenix.end2end.index.MutableIndexFailureIT
Running org.apache.phoenix.hbase.index.covered.example.EndToEndCoveredIndexingIT
Tests run: 2, Failures: 0, Errors: 0, Skipped: 0, Time elapsed: 18.217 sec - in org.apache.phoenix.hbase.index.FailForUnsupportedHBaseVersionsIT
Running org.apache.phoenix.hbase.index.covered.example.EndtoEndIndexingWithCompressionIT
Tests run: 11, Failures: 0, Errors: 0, Skipped: 0, Time elapsed: 59.18 sec - in org.apache.phoenix.hbase.index.covered.example.EndToEndCoveredIndexingIT
Running org.apache.phoenix.hbase.index.covered.example.FailWithoutRetriesIT
Tests run: 11, Failures: 0, Errors: 0, Skipped: 0, Time elapsed: 59.101 sec - in org.apache.phoenix.hbase.index.covered.example.EndtoEndIndexingWithCompressionIT
Tests run: 1, Failures: 0, Errors: 0, Skipped: 0, Time elapsed: 9.165 sec - in org.apache.phoenix.hbase.index.covered.example.FailWithoutRetriesIT
Running org.apache.phoenix.hbase.index.covered.EndToEndCoveredColumnsIndexBuilderIT
Running org.apache.phoenix.hbase.index.balancer.IndexLoadBalancerIT
Tests run: 2, Failures: 0, Errors: 0, Skipped: 0, Time elapsed: 8.965 sec - in org.apache.phoenix.hbase.index.covered.EndToEndCoveredColumnsIndexBuilderIT
Tests run: 4, Failures: 0, Errors: 0, Skipped: 0, Time elapsed: 182.862 sec - in org.apache.phoenix.mapreduce.CsvBulkLoadToolIT
Tests run: 9, Failures: 0, Errors: 0, Skipped: 0, Time elapsed: 106.62 sec - in org.apache.phoenix.hbase.index.balancer.IndexLoadBalancerIT
Results :
Tests run: 44, Failures: 0, Errors: 0, Skipped: 0
[INFO]
[INFO] --- maven-failsafe-plugin:2.17:verify (ClientManagedTimeTests) @ phoenix-core ---
[INFO] Failsafe report directory: <https://builds.apache.org/job/Phoenix-4.0-hadoop1/ws/phoenix-core/target/failsafe-reports>
[INFO] ------------------------------------------------------------------------
[INFO] Reactor Summary:
[INFO]
[INFO] Apache Phoenix .................................... SUCCESS [2.212s]
[INFO] Phoenix Hadoop Compatibility ...................... SUCCESS [0.634s]
[INFO] Phoenix Core ...................................... FAILURE [16:08.426s]
[INFO] Phoenix - Flume ................................... SKIPPED
[INFO] Phoenix - Pig ..................................... SKIPPED
[INFO] Phoenix Hadoop1 Compatibility ..................... SKIPPED
[INFO] Phoenix Assembly .................................. SKIPPED
[INFO] ------------------------------------------------------------------------
[INFO] BUILD FAILURE
[INFO] ------------------------------------------------------------------------
[INFO] Total time: 16:11.810s
[INFO] Finished at: Tue Jul 22 03:02:38 UTC 2014
[INFO] Final Memory: 39M/1180M
[INFO] ------------------------------------------------------------------------
[ERROR] Failed to execute goal org.apache.maven.plugins:maven-failsafe-plugin:2.17:verify (ClientManagedTimeTests) on project phoenix-core: There are test failures.
[ERROR]
[ERROR] Please refer to <https://builds.apache.org/job/Phoenix-4.0-hadoop1/ws/phoenix-core/target/failsafe-reports> for the individual test results.
[ERROR] -> [Help 1]
[ERROR]
[ERROR] To see the full stack trace of the errors, re-run Maven with the -e switch.
[ERROR] Re-run Maven using the -X switch to enable full debug logging.
[ERROR]
[ERROR] For more information about the errors and possible solutions, please read the following articles:
[ERROR] [Help 1] http://cwiki.apache.org/confluence/display/MAVEN/MojoFailureException
[ERROR]
[ERROR] After correcting the problems, you can resume the build with the command
[ERROR] mvn <goals> -rf :phoenix-core
Build step 'Invoke top-level Maven targets' marked build as failure
Archiving artifacts
Sending artifact delta relative to Phoenix | 4.0 | Hadoop1 #215
Archived 493 artifacts
Archive block size is 32768
Received 1 blocks and 192725817 bytes
Compression is 0.0%
Took 1 min 6 sec
Recording test results