You are viewing a plain text version of this content. The canonical link for it is here.
Posted to mapreduce-dev@hadoop.apache.org by Apache Jenkins Server <je...@builds.apache.org> on 2011/12/14 09:55:13 UTC
Hadoop-Mapreduce-trunk-Commit - Build # 1450 - Still Failing
See https://builds.apache.org/job/Hadoop-Mapreduce-trunk-Commit/1450/
###################################################################################
########################## LAST 60 LINES OF THE CONSOLE ###########################
[...truncated 14685 lines...]
[javac] symbol : class HadoopArchives
[javac] location: class org.apache.hadoop.mapreduce.security.TestTokenCache
[javac] HadoopArchives har = new HadoopArchives(jConf);
[javac] ^
[javac] /home/jenkins/jenkins-slave/workspace/Hadoop-Mapreduce-trunk-Commit/trunk/hadoop-mapreduce-project/src/test/mapred/org/apache/hadoop/tools/TestHarFileSystem.java:177: cannot find symbol
[javac] symbol : class HadoopArchives
[javac] location: class org.apache.hadoop.tools.TestHarFileSystem
[javac] HadoopArchives har = new HadoopArchives(conf);
[javac] ^
[javac] /home/jenkins/jenkins-slave/workspace/Hadoop-Mapreduce-trunk-Commit/trunk/hadoop-mapreduce-project/src/test/mapred/org/apache/hadoop/tools/TestHarFileSystem.java:177: cannot find symbol
[javac] symbol : class HadoopArchives
[javac] location: class org.apache.hadoop.tools.TestHarFileSystem
[javac] HadoopArchives har = new HadoopArchives(conf);
[javac] ^
[javac] /home/jenkins/jenkins-slave/workspace/Hadoop-Mapreduce-trunk-Commit/trunk/hadoop-mapreduce-project/src/test/mapred/org/apache/hadoop/tools/TestHarFileSystem.java:257: cannot find symbol
[javac] symbol : class HadoopArchives
[javac] location: class org.apache.hadoop.tools.TestHarFileSystem
[javac] HadoopArchives har = new HadoopArchives(conf);
[javac] ^
[javac] /home/jenkins/jenkins-slave/workspace/Hadoop-Mapreduce-trunk-Commit/trunk/hadoop-mapreduce-project/src/test/mapred/org/apache/hadoop/tools/TestHarFileSystem.java:257: cannot find symbol
[javac] symbol : class HadoopArchives
[javac] location: class org.apache.hadoop.tools.TestHarFileSystem
[javac] HadoopArchives har = new HadoopArchives(conf);
[javac] ^
[javac] /home/jenkins/jenkins-slave/workspace/Hadoop-Mapreduce-trunk-Commit/trunk/hadoop-mapreduce-project/src/test/mapred/org/apache/hadoop/tools/TestHarFileSystem.java:375: cannot find symbol
[javac] symbol : class HadoopArchives
[javac] location: class org.apache.hadoop.tools.TestHarFileSystem
[javac] HadoopArchives har = new HadoopArchives(conf);
[javac] ^
[javac] /home/jenkins/jenkins-slave/workspace/Hadoop-Mapreduce-trunk-Commit/trunk/hadoop-mapreduce-project/src/test/mapred/org/apache/hadoop/tools/TestHarFileSystem.java:375: cannot find symbol
[javac] symbol : class HadoopArchives
[javac] location: class org.apache.hadoop.tools.TestHarFileSystem
[javac] HadoopArchives har = new HadoopArchives(conf);
[javac] ^
[javac] /home/jenkins/jenkins-slave/workspace/Hadoop-Mapreduce-trunk-Commit/trunk/hadoop-mapreduce-project/src/test/mapred/org/apache/hadoop/tools/TestHarFileSystem.java:409: cannot find symbol
[javac] symbol : class HadoopArchives
[javac] location: class org.apache.hadoop.tools.TestHarFileSystem
[javac] HadoopArchives har = new HadoopArchives(conf);
[javac] ^
[javac] /home/jenkins/jenkins-slave/workspace/Hadoop-Mapreduce-trunk-Commit/trunk/hadoop-mapreduce-project/src/test/mapred/org/apache/hadoop/tools/TestHarFileSystem.java:409: cannot find symbol
[javac] symbol : class HadoopArchives
[javac] location: class org.apache.hadoop.tools.TestHarFileSystem
[javac] HadoopArchives har = new HadoopArchives(conf);
[javac] ^
[javac] Note: Some input files use or override a deprecated API.
[javac] Note: Recompile with -Xlint:deprecation for details.
[javac] 16 errors
BUILD FAILED
/home/jenkins/jenkins-slave/workspace/Hadoop-Mapreduce-trunk-Commit/trunk/hadoop-mapreduce-project/build.xml:526: The following error occurred while executing this line:
/home/jenkins/jenkins-slave/workspace/Hadoop-Mapreduce-trunk-Commit/trunk/hadoop-mapreduce-project/build.xml:603: Compile failed; see the compiler error output for details.
Total time: 1 minute 27 seconds
Build step 'Execute shell' marked build as failure
Recording test results
Updating HDFS-2676
Updating HDFS-2675
Email was triggered for: Failure
Sending email for trigger: Failure
###################################################################################
############################## FAILED TESTS (if any) ##############################
All tests passed
Hadoop-Mapreduce-trunk-Commit - Build # 1453 - Still Failing
Posted by Apache Jenkins Server <je...@builds.apache.org>.
See https://builds.apache.org/job/Hadoop-Mapreduce-trunk-Commit/1453/
###################################################################################
########################## LAST 60 LINES OF THE CONSOLE ###########################
[...truncated 14598 lines...]
[exec] make[1]: Leaving directory `/home/jenkins/jenkins-slave/workspace/Hadoop-Mapreduce-trunk-Commit/trunk/hadoop-mapreduce-project/build/c++-build/Linux-i386-32/examples/pipes'
compile-c++-examples:
compile-examples:
ivy-resolve-test:
[ivy:resolve] downloading /home/jenkins/.m2/repository/org/apache/hadoop/hadoop-hdfs/0.24.0-SNAPSHOT/hadoop-hdfs-0.24.0-SNAPSHOT-tests.jar ...
[ivy:resolve] ................... (1134kB)
[ivy:resolve] [SUCCESSFUL ] org.apache.hadoop#hadoop-hdfs;0.24.0-SNAPSHOT!hadoop-hdfs.jar(tests) (4ms)
[ivy:resolve] downloading /home/jenkins/.m2/repository/junit/junit/4.8.1/junit-4.8.1.jar ...
[ivy:resolve] ..... (231kB)
[ivy:resolve] .. (0kB)
[ivy:resolve] [SUCCESSFUL ] junit#junit;4.8.1!junit.jar (4ms)
[ivy:resolve] downloading http://repo1.maven.org/maven2/org/mockito/mockito-all/1.8.2/mockito-all-1.8.2.jar ...
[ivy:resolve] ................................................................................................................................................................................................................................................................................................................................................................................................................................................................................................................................................................................................................................................................................................................................................................................................................................................................................................................................................................................................................................................................................................................................................................................................................................................................................................................................................................................................................................................................................................................................................................................................................................................................................................................................................................................................................................................................................................................................................................................................................................................................................................................................................................................................................................................................................................................................................................................................................................................................................................................... (1315kB)
[ivy:resolve] .. (0kB)
[ivy:resolve] [SUCCESSFUL ] org.mockito#mockito-all;1.8.2!mockito-all.jar (1615ms)
[ivy:resolve] downloading http://repo1.maven.org/maven2/org/mortbay/jetty/jetty-servlet-tester/6.1.14/jetty-servlet-tester-6.1.14.jar ...
[ivy:resolve] ................ (8kB)
[ivy:resolve] .. (0kB)
[ivy:resolve] [SUCCESSFUL ] org.mortbay.jetty#jetty-servlet-tester;6.1.14!jetty-servlet-tester.jar (985ms)
[ivy:resolve] downloading /home/jenkins/.m2/repository/log4j/log4j/1.2.15/log4j-1.2.15.jar ...
[ivy:resolve] ....... (382kB)
[ivy:resolve] .. (0kB)
[ivy:resolve] [SUCCESSFUL ] log4j#log4j;1.2.15!log4j.jar (6ms)
[ivy:resolve] downloading /home/jenkins/.m2/repository/org/slf4j/slf4j-api/1.5.11/slf4j-api-1.5.11.jar ...
[ivy:resolve] .. (23kB)
[ivy:resolve] .. (0kB)
[ivy:resolve] [SUCCESSFUL ] org.slf4j#slf4j-api;1.5.11!slf4j-api.jar (2ms)
[ivy:resolve] downloading /home/jenkins/.m2/repository/org/slf4j/slf4j-log4j12/1.5.11/slf4j-log4j12-1.5.11.jar ...
[ivy:resolve] .. (9kB)
[ivy:resolve] .. (0kB)
[ivy:resolve] [SUCCESSFUL ] org.slf4j#slf4j-log4j12;1.5.11!slf4j-log4j12.jar (1ms)
ivy-retrieve-test:
compile-mapred-test:
[mkdir] Created dir: /home/jenkins/jenkins-slave/workspace/Hadoop-Mapreduce-trunk-Commit/trunk/hadoop-mapreduce-project/build/test/mapred/classes
[mkdir] Created dir: /home/jenkins/jenkins-slave/workspace/Hadoop-Mapreduce-trunk-Commit/trunk/hadoop-mapreduce-project/build/test/mapred/testjar
[mkdir] Created dir: /home/jenkins/jenkins-slave/workspace/Hadoop-Mapreduce-trunk-Commit/trunk/hadoop-mapreduce-project/build/test/mapred/testshell
[javac] Compiling 304 source files to /home/jenkins/jenkins-slave/workspace/Hadoop-Mapreduce-trunk-Commit/trunk/hadoop-mapreduce-project/build/test/mapred/classes
[javac] /home/jenkins/jenkins-slave/workspace/Hadoop-Mapreduce-trunk-Commit/trunk/hadoop-mapreduce-project/src/test/mapred/org/apache/hadoop/mapred/TestJobQueueClient.java:80: printJobQueueInfo(org.apache.hadoop.mapred.JobQueueInfo,java.io.Writer,java.lang.String) in org.apache.hadoop.mapred.JobQueueClient cannot be applied to (org.apache.hadoop.mapred.JobQueueInfo,java.io.StringWriter)
[javac] client.printJobQueueInfo(root, writer);
[javac] ^
[javac] Note: Some input files use or override a deprecated API.
[javac] Note: Recompile with -Xlint:deprecation for details.
[javac] 1 error
BUILD FAILED
/home/jenkins/jenkins-slave/workspace/Hadoop-Mapreduce-trunk-Commit/trunk/hadoop-mapreduce-project/build.xml:526: The following error occurred while executing this line:
/home/jenkins/jenkins-slave/workspace/Hadoop-Mapreduce-trunk-Commit/trunk/hadoop-mapreduce-project/build.xml:603: Compile failed; see the compiler error output for details.
Total time: 1 minute 28 seconds
Build step 'Execute shell' marked build as failure
Recording test results
Updating MAPREDUCE-3557
Email was triggered for: Failure
Sending email for trigger: Failure
###################################################################################
############################## FAILED TESTS (if any) ##############################
All tests passed
Hadoop-Mapreduce-trunk-Commit - Build # 1452 - Still Failing
Posted by Apache Jenkins Server <je...@builds.apache.org>.
See https://builds.apache.org/job/Hadoop-Mapreduce-trunk-Commit/1452/
###################################################################################
########################## LAST 60 LINES OF THE CONSOLE ###########################
[...truncated 14669 lines...]
[javac] /home/jenkins/jenkins-slave/workspace/Hadoop-Mapreduce-trunk-Commit/trunk/hadoop-mapreduce-project/src/test/mapred/org/apache/hadoop/mapreduce/security/TestTokenCache.java:438: cannot find symbol
[javac] symbol : class HadoopArchives
[javac] location: class org.apache.hadoop.mapreduce.security.TestTokenCache
[javac] HadoopArchives har = new HadoopArchives(jConf);
[javac] ^
[javac] /home/jenkins/jenkins-slave/workspace/Hadoop-Mapreduce-trunk-Commit/trunk/hadoop-mapreduce-project/src/test/mapred/org/apache/hadoop/tools/TestHarFileSystem.java:177: cannot find symbol
[javac] symbol : class HadoopArchives
[javac] location: class org.apache.hadoop.tools.TestHarFileSystem
[javac] HadoopArchives har = new HadoopArchives(conf);
[javac] ^
[javac] /home/jenkins/jenkins-slave/workspace/Hadoop-Mapreduce-trunk-Commit/trunk/hadoop-mapreduce-project/src/test/mapred/org/apache/hadoop/tools/TestHarFileSystem.java:177: cannot find symbol
[javac] symbol : class HadoopArchives
[javac] location: class org.apache.hadoop.tools.TestHarFileSystem
[javac] HadoopArchives har = new HadoopArchives(conf);
[javac] ^
[javac] /home/jenkins/jenkins-slave/workspace/Hadoop-Mapreduce-trunk-Commit/trunk/hadoop-mapreduce-project/src/test/mapred/org/apache/hadoop/tools/TestHarFileSystem.java:257: cannot find symbol
[javac] symbol : class HadoopArchives
[javac] location: class org.apache.hadoop.tools.TestHarFileSystem
[javac] HadoopArchives har = new HadoopArchives(conf);
[javac] ^
[javac] /home/jenkins/jenkins-slave/workspace/Hadoop-Mapreduce-trunk-Commit/trunk/hadoop-mapreduce-project/src/test/mapred/org/apache/hadoop/tools/TestHarFileSystem.java:257: cannot find symbol
[javac] symbol : class HadoopArchives
[javac] location: class org.apache.hadoop.tools.TestHarFileSystem
[javac] HadoopArchives har = new HadoopArchives(conf);
[javac] ^
[javac] /home/jenkins/jenkins-slave/workspace/Hadoop-Mapreduce-trunk-Commit/trunk/hadoop-mapreduce-project/src/test/mapred/org/apache/hadoop/tools/TestHarFileSystem.java:375: cannot find symbol
[javac] symbol : class HadoopArchives
[javac] location: class org.apache.hadoop.tools.TestHarFileSystem
[javac] HadoopArchives har = new HadoopArchives(conf);
[javac] ^
[javac] /home/jenkins/jenkins-slave/workspace/Hadoop-Mapreduce-trunk-Commit/trunk/hadoop-mapreduce-project/src/test/mapred/org/apache/hadoop/tools/TestHarFileSystem.java:375: cannot find symbol
[javac] symbol : class HadoopArchives
[javac] location: class org.apache.hadoop.tools.TestHarFileSystem
[javac] HadoopArchives har = new HadoopArchives(conf);
[javac] ^
[javac] /home/jenkins/jenkins-slave/workspace/Hadoop-Mapreduce-trunk-Commit/trunk/hadoop-mapreduce-project/src/test/mapred/org/apache/hadoop/tools/TestHarFileSystem.java:409: cannot find symbol
[javac] symbol : class HadoopArchives
[javac] location: class org.apache.hadoop.tools.TestHarFileSystem
[javac] HadoopArchives har = new HadoopArchives(conf);
[javac] ^
[javac] /home/jenkins/jenkins-slave/workspace/Hadoop-Mapreduce-trunk-Commit/trunk/hadoop-mapreduce-project/src/test/mapred/org/apache/hadoop/tools/TestHarFileSystem.java:409: cannot find symbol
[javac] symbol : class HadoopArchives
[javac] location: class org.apache.hadoop.tools.TestHarFileSystem
[javac] HadoopArchives har = new HadoopArchives(conf);
[javac] ^
[javac] Note: Some input files use or override a deprecated API.
[javac] Note: Recompile with -Xlint:deprecation for details.
[javac] 16 errors
BUILD FAILED
/home/jenkins/jenkins-slave/workspace/Hadoop-Mapreduce-trunk-Commit/trunk/hadoop-mapreduce-project/build.xml:526: The following error occurred while executing this line:
/home/jenkins/jenkins-slave/workspace/Hadoop-Mapreduce-trunk-Commit/trunk/hadoop-mapreduce-project/build.xml:603: Compile failed; see the compiler error output for details.
Total time: 1 minute 27 seconds
Build step 'Execute shell' marked build as failure
Recording test results
Updating HDFS-2669
Email was triggered for: Failure
Sending email for trigger: Failure
###################################################################################
############################## FAILED TESTS (if any) ##############################
All tests passed
Hadoop-Mapreduce-trunk-Commit - Build # 1451 - Still Failing
Posted by Apache Jenkins Server <je...@builds.apache.org>.
See https://builds.apache.org/job/Hadoop-Mapreduce-trunk-Commit/1451/
###################################################################################
########################## LAST 60 LINES OF THE CONSOLE ###########################
[...truncated 14672 lines...]
[javac] /home/jenkins/jenkins-slave/workspace/Hadoop-Mapreduce-trunk-Commit/trunk/hadoop-mapreduce-project/src/test/mapred/org/apache/hadoop/mapreduce/security/TestTokenCache.java:438: cannot find symbol
[javac] symbol : class HadoopArchives
[javac] location: class org.apache.hadoop.mapreduce.security.TestTokenCache
[javac] HadoopArchives har = new HadoopArchives(jConf);
[javac] ^
[javac] /home/jenkins/jenkins-slave/workspace/Hadoop-Mapreduce-trunk-Commit/trunk/hadoop-mapreduce-project/src/test/mapred/org/apache/hadoop/tools/TestHarFileSystem.java:177: cannot find symbol
[javac] symbol : class HadoopArchives
[javac] location: class org.apache.hadoop.tools.TestHarFileSystem
[javac] HadoopArchives har = new HadoopArchives(conf);
[javac] ^
[javac] /home/jenkins/jenkins-slave/workspace/Hadoop-Mapreduce-trunk-Commit/trunk/hadoop-mapreduce-project/src/test/mapred/org/apache/hadoop/tools/TestHarFileSystem.java:177: cannot find symbol
[javac] symbol : class HadoopArchives
[javac] location: class org.apache.hadoop.tools.TestHarFileSystem
[javac] HadoopArchives har = new HadoopArchives(conf);
[javac] ^
[javac] /home/jenkins/jenkins-slave/workspace/Hadoop-Mapreduce-trunk-Commit/trunk/hadoop-mapreduce-project/src/test/mapred/org/apache/hadoop/tools/TestHarFileSystem.java:257: cannot find symbol
[javac] symbol : class HadoopArchives
[javac] location: class org.apache.hadoop.tools.TestHarFileSystem
[javac] HadoopArchives har = new HadoopArchives(conf);
[javac] ^
[javac] /home/jenkins/jenkins-slave/workspace/Hadoop-Mapreduce-trunk-Commit/trunk/hadoop-mapreduce-project/src/test/mapred/org/apache/hadoop/tools/TestHarFileSystem.java:257: cannot find symbol
[javac] symbol : class HadoopArchives
[javac] location: class org.apache.hadoop.tools.TestHarFileSystem
[javac] HadoopArchives har = new HadoopArchives(conf);
[javac] ^
[javac] /home/jenkins/jenkins-slave/workspace/Hadoop-Mapreduce-trunk-Commit/trunk/hadoop-mapreduce-project/src/test/mapred/org/apache/hadoop/tools/TestHarFileSystem.java:375: cannot find symbol
[javac] symbol : class HadoopArchives
[javac] location: class org.apache.hadoop.tools.TestHarFileSystem
[javac] HadoopArchives har = new HadoopArchives(conf);
[javac] ^
[javac] /home/jenkins/jenkins-slave/workspace/Hadoop-Mapreduce-trunk-Commit/trunk/hadoop-mapreduce-project/src/test/mapred/org/apache/hadoop/tools/TestHarFileSystem.java:375: cannot find symbol
[javac] symbol : class HadoopArchives
[javac] location: class org.apache.hadoop.tools.TestHarFileSystem
[javac] HadoopArchives har = new HadoopArchives(conf);
[javac] ^
[javac] /home/jenkins/jenkins-slave/workspace/Hadoop-Mapreduce-trunk-Commit/trunk/hadoop-mapreduce-project/src/test/mapred/org/apache/hadoop/tools/TestHarFileSystem.java:409: cannot find symbol
[javac] symbol : class HadoopArchives
[javac] location: class org.apache.hadoop.tools.TestHarFileSystem
[javac] HadoopArchives har = new HadoopArchives(conf);
[javac] ^
[javac] /home/jenkins/jenkins-slave/workspace/Hadoop-Mapreduce-trunk-Commit/trunk/hadoop-mapreduce-project/src/test/mapred/org/apache/hadoop/tools/TestHarFileSystem.java:409: cannot find symbol
[javac] symbol : class HadoopArchives
[javac] location: class org.apache.hadoop.tools.TestHarFileSystem
[javac] HadoopArchives har = new HadoopArchives(conf);
[javac] ^
[javac] Note: Some input files use or override a deprecated API.
[javac] Note: Recompile with -Xlint:deprecation for details.
[javac] 16 errors
BUILD FAILED
/home/jenkins/jenkins-slave/workspace/Hadoop-Mapreduce-trunk-Commit/trunk/hadoop-mapreduce-project/build.xml:526: The following error occurred while executing this line:
/home/jenkins/jenkins-slave/workspace/Hadoop-Mapreduce-trunk-Commit/trunk/hadoop-mapreduce-project/build.xml:603: Compile failed; see the compiler error output for details.
Total time: 1 minute 27 seconds
Build step 'Execute shell' marked build as failure
Recording test results
Updating HADOOP-7920
Email was triggered for: Failure
Sending email for trigger: Failure
###################################################################################
############################## FAILED TESTS (if any) ##############################
All tests passed