You are viewing a plain text version of this content. The canonical link for it is here.
Posted to dev@atlas.apache.org by Apache Jenkins Server <je...@builds.apache.org> on 2018/03/22 02:08:42 UTC

Build failed in Jenkins: PreCommit-ATLAS-Build-Test #211-master-ATLAS-2510.1.patch

See <https://builds.apache.org/job/PreCommit-ATLAS-Build-Test/211/display/redirect>

------------------------------------------
[...truncated 222.02 KB...]
[INFO] Exclude: **/*rebel*.xml.bak
[INFO] Exclude: **/test/resources/**
[INFO] 148 resources included (use -debug for more details)
[INFO] Rat check: Summary over all files. Unapproved: 0, unknown: 0, generated: 0, approved: 148 licenses.
[INFO] 
[INFO] --- maven-resources-plugin:2.7:copy-resources (copy-resources) @ atlas-repository ---
[INFO] Using 'UTF-8' encoding to copy filtered resources.
[INFO] Copying 9 resources
[INFO] 
[INFO] --- maven-remote-resources-plugin:1.5:process (default) @ atlas-repository ---
[INFO] 
[INFO] --- maven-resources-plugin:2.7:resources (default-resources) @ atlas-repository ---
[INFO] Using 'UTF-8' encoding to copy filtered resources.
[INFO] skip non existing resourceDirectory <https://builds.apache.org/job/PreCommit-ATLAS-Build-Test/ws/repository/src/main/resources>
[INFO] Copying 2 resources to META-INF
[INFO] Copying 3 resources
[INFO] 
[INFO] --- maven-compiler-plugin:3.7.0:compile (default-compile) @ atlas-repository ---
[INFO] Changes detected - recompiling the module!
[INFO] Compiling 118 source files to <https://builds.apache.org/job/PreCommit-ATLAS-Build-Test/ws/repository/target/classes>
[INFO] <https://builds.apache.org/job/PreCommit-ATLAS-Build-Test/ws/repository/src/main/java/org/apache/atlas/repository/converters/AtlasInstanceConverter.java>: Some input files use or override a deprecated API.
[INFO] <https://builds.apache.org/job/PreCommit-ATLAS-Build-Test/ws/repository/src/main/java/org/apache/atlas/repository/converters/AtlasInstanceConverter.java>: Recompile with -Xlint:deprecation for details.
[INFO] <https://builds.apache.org/job/PreCommit-ATLAS-Build-Test/ws/repository/src/main/java/org/apache/atlas/util/SearchPredicateUtil.java>: Some input files use unchecked or unsafe operations.
[INFO] <https://builds.apache.org/job/PreCommit-ATLAS-Build-Test/ws/repository/src/main/java/org/apache/atlas/util/SearchPredicateUtil.java>: Recompile with -Xlint:unchecked for details.
[INFO] 
[INFO] --- maven-resources-plugin:2.7:testResources (default-testResources) @ atlas-repository ---
[INFO] Using 'UTF-8' encoding to copy filtered resources.
[INFO] Copying 22 resources
[INFO] Copying 3 resources
[INFO] 
[INFO] --- maven-compiler-plugin:3.7.0:testCompile (default-testCompile) @ atlas-repository ---
[INFO] Changes detected - recompiling the module!
[INFO] Compiling 33 source files to <https://builds.apache.org/job/PreCommit-ATLAS-Build-Test/ws/repository/target/test-classes>
[INFO] <https://builds.apache.org/job/PreCommit-ATLAS-Build-Test/ws/repository/src/test/java/org/apache/atlas/query/BasicTestSetup.java>: <https://builds.apache.org/job/PreCommit-ATLAS-Build-Test/ws/repository/src/test/java/org/apache/atlas/query/BasicTestSetup.java> uses or overrides a deprecated API.
[INFO] <https://builds.apache.org/job/PreCommit-ATLAS-Build-Test/ws/repository/src/test/java/org/apache/atlas/query/BasicTestSetup.java>: Recompile with -Xlint:deprecation for details.
[INFO] <https://builds.apache.org/job/PreCommit-ATLAS-Build-Test/ws/repository/src/test/java/org/apache/atlas/repository/impexp/UniqueListTest.java>: Some input files use unchecked or unsafe operations.
[INFO] <https://builds.apache.org/job/PreCommit-ATLAS-Build-Test/ws/repository/src/test/java/org/apache/atlas/repository/impexp/UniqueListTest.java>: Recompile with -Xlint:unchecked for details.
[INFO] 
[INFO] --- maven-surefire-plugin:2.18.1:test (default-test) @ atlas-repository ---
[INFO] Surefire report directory: <https://builds.apache.org/job/PreCommit-ATLAS-Build-Test/ws/repository/target/surefire-reports>
[INFO] Using configured provider org.apache.maven.surefire.testng.TestNGProvider

-------------------------------------------------------
 T E S T S
-------------------------------------------------------
Running org.apache.atlas.repository.userprofile.UserProfileServiceTest
Running org.apache.atlas.repository.audit.InMemoryAuditRepositoryTest
Running org.apache.atlas.repository.store.graph.AtlasTypeDefGraphStoreTest
Running org.apache.atlas.repository.store.graph.v1.AtlasRelationshipStoreHardDeleteV1Test
Running org.apache.atlas.repository.store.graph.v1.AtlasRelationshipStoreSoftDeleteV1Test
Running org.apache.atlas.repository.store.graph.v1.AtlasRelationshipStoreV1Test
Running org.apache.atlas.repository.store.graph.v1.AtlasEntityDefStoreV1Test
Running org.apache.atlas.repository.store.graph.v1.InverseReferenceUpdateV1Test
Running org.apache.atlas.repository.store.graph.v1.InverseReferenceUpdateHardDeleteV1Test
Running org.apache.atlas.repository.store.graph.v1.AtlasEntityStoreV1BulkImportPercentTest
Running org.apache.atlas.repository.store.graph.v1.AtlasEntityStoreV1Test
Running org.apache.atlas.repository.impexp.UniqueListTest
Running org.apache.atlas.query.DSLParsingTest
Running org.apache.atlas.repository.impexp.ImportTransformerTest
Running org.apache.atlas.repository.store.graph.v1.InverseReferenceUpdateSoftDeleteV1Test
Running org.apache.atlas.repository.store.graph.v1.AtlasRelationshipDefStoreV1Test
Running org.apache.atlas.repository.impexp.ZipSinkTest
Running org.apache.atlas.repository.impexp.ZipSourceTest
Running org.apache.atlas.query.GremlinQueryComposerTest
Running org.apache.atlas.repository.impexp.ExportServiceTest
Running org.apache.atlas.query.DSLQueriesTest
Running org.apache.atlas.repository.impexp.ImportTransformerJSONTest
Running org.apache.atlas.repository.impexp.ImportTransformsTest
Tests run: 0, Failures: 0, Errors: 0, Skipped: 0, Time elapsed: 1.956 sec - in org.apache.atlas.repository.store.graph.v1.InverseReferenceUpdateV1Test
Running org.apache.atlas.services.MetricsServiceTest
Running org.apache.atlas.repository.impexp.ImportServiceTest
Running org.apache.atlas.repository.impexp.TypeAttributeDifferenceTest
Tests run: 3, Failures: 0, Errors: 0, Skipped: 0, Time elapsed: 2.349 sec - in org.apache.atlas.repository.audit.InMemoryAuditRepositoryTest
Tests run: 0, Failures: 0, Errors: 0, Skipped: 0, Time elapsed: 2.329 sec - in org.apache.atlas.repository.store.graph.v1.AtlasRelationshipStoreV1Test
Running org.apache.atlas.TestModules
Running org.apache.atlas.utils.ObjectUpdateSynchronizerTest
Running org.apache.atlas.utils.TestResourceFileUtils
Tests run: 4, Failures: 0, Errors: 0, Skipped: 0, Time elapsed: 2.315 sec - in org.apache.atlas.repository.impexp.UniqueListTest
Running org.apache.atlas.repository.impexp.AtlasImportRequestTest
Tests run: 8, Failures: 0, Errors: 0, Skipped: 0, Time elapsed: 3.28 sec - in org.apache.atlas.repository.impexp.ImportTransformerTest
Tests run: 0, Failures: 0, Errors: 0, Skipped: 0, Time elapsed: 1.681 sec - in org.apache.atlas.utils.TestResourceFileUtils
Tests run: 0, Failures: 0, Errors: 0, Skipped: 0, Time elapsed: 2.237 sec - in org.apache.atlas.TestModules
Tests run: 6, Failures: 0, Errors: 0, Skipped: 0, Time elapsed: 3.8 sec - in org.apache.atlas.repository.impexp.TypeAttributeDifferenceTest
Tests run: 9, Failures: 0, Errors: 0, Skipped: 0, Time elapsed: 6.007 sec - in org.apache.atlas.repository.store.graph.v1.AtlasEntityStoreV1BulkImportPercentTest
Tests run: 8, Failures: 0, Errors: 0, Skipped: 0, Time elapsed: 6.414 sec - in org.apache.atlas.query.DSLParsingTest
Tests run: 9, Failures: 0, Errors: 0, Skipped: 0, Time elapsed: 4.388 sec - in org.apache.atlas.utils.ObjectUpdateSynchronizerTest
Tests run: 6, Failures: 0, Errors: 0, Skipped: 0, Time elapsed: 3.998 sec - in org.apache.atlas.repository.impexp.AtlasImportRequestTest
Tests run: 3, Failures: 0, Errors: 0, Skipped: 0, Time elapsed: 5.287 sec - in org.apache.atlas.repository.impexp.ImportTransformsTest
Tests run: 1, Failures: 0, Errors: 0, Skipped: 0, Time elapsed: 5.482 sec - in org.apache.atlas.repository.impexp.ImportTransformerJSONTest
Tests run: 8, Failures: 0, Errors: 0, Skipped: 0, Time elapsed: 6.667 sec - in org.apache.atlas.repository.impexp.ZipSinkTest
Tests run: 6, Failures: 0, Errors: 0, Skipped: 0, Time elapsed: 7.196 sec - in org.apache.atlas.repository.impexp.ZipSourceTest
Tests run: 39, Failures: 3, Errors: 0, Skipped: 0, Time elapsed: 10.805 sec <<< FAILURE! - in org.apache.atlas.query.GremlinQueryComposerTest
classification(org.apache.atlas.query.GremlinQueryComposerTest)  Time elapsed: 0.044 sec  <<< FAILURE!
java.lang.AssertionError: PII expected [g.V().outE('classifiedAs').has('__name', within('PII')).outV().dedup().limit(25).toList()] but found [g.V().outE('classifiedAs').has('__name', within('PII')).has('__state', 'ACTIVE').outV().dedup().limit(25).toList()]
	at org.testng.Assert.fail(Assert.java:94)
	at org.testng.Assert.failNotEquals(Assert.java:496)
	at org.testng.Assert.assertEquals(Assert.java:125)
	at org.testng.Assert.assertEquals(Assert.java:178)
	at org.apache.atlas.query.GremlinQueryComposerTest.verify(GremlinQueryComposerTest.java:354)
	at org.apache.atlas.query.GremlinQueryComposerTest.verify(GremlinQueryComposerTest.java:363)
	at org.apache.atlas.query.GremlinQueryComposerTest.classification(GremlinQueryComposerTest.java:40)

dimension(org.apache.atlas.query.GremlinQueryComposerTest)  Time elapsed: 0.06 sec  <<< FAILURE!
java.lang.AssertionError: Table isa Dimension expected [g.V().has('__typeName', 'Table').outE('classifiedAs').has('__name', within('Dimension')).outV().dedup().limit(25).toList()] but found [g.V().has('__typeName', 'Table').outE('classifiedAs').has('__name', within('Dimension')).has('__state', 'ACTIVE').outV().dedup().limit(25).toList()]
	at org.testng.Assert.fail(Assert.java:94)
	at org.testng.Assert.failNotEquals(Assert.java:496)
	at org.testng.Assert.assertEquals(Assert.java:125)
	at org.testng.Assert.assertEquals(Assert.java:178)
	at org.apache.atlas.query.GremlinQueryComposerTest.verify(GremlinQueryComposerTest.java:354)
	at org.apache.atlas.query.GremlinQueryComposerTest.verify(GremlinQueryComposerTest.java:363)
	at org.apache.atlas.query.GremlinQueryComposerTest.dimension(GremlinQueryComposerTest.java:46)

keywordsInWhereClause(org.apache.atlas.query.GremlinQueryComposerTest)  Time elapsed: 0.024 sec  <<< FAILURE!
java.lang.AssertionError: Table as t where t has name and t isa Dimension expected [g.V().has('__typeName', 'Table').as('t').and(__.has('Table.name'),__.outE('classifiedAs').has('__name', within('Dimension')).outV()).dedup().limit(25).toList()] but found [g.V().has('__typeName', 'Table').as('t').and(__.has('Table.name'),__.outE('classifiedAs').has('__name', within('Dimension')).has('__state', 'ACTIVE').outV()).dedup().limit(25).toList()]
	at org.testng.Assert.fail(Assert.java:94)
	at org.testng.Assert.failNotEquals(Assert.java:496)
	at org.testng.Assert.assertEquals(Assert.java:125)
	at org.testng.Assert.assertEquals(Assert.java:178)
	at org.apache.atlas.query.GremlinQueryComposerTest.verify(GremlinQueryComposerTest.java:354)
	at org.apache.atlas.query.GremlinQueryComposerTest.verify(GremlinQueryComposerTest.java:363)
	at org.apache.atlas.query.GremlinQueryComposerTest.keywordsInWhereClause(GremlinQueryComposerTest.java:297)

Tests run: 1, Failures: 0, Errors: 0, Skipped: 0, Time elapsed: 42.031 sec - in org.apache.atlas.repository.store.graph.v1.AtlasEntityDefStoreV1Test
Tests run: 10, Failures: 0, Errors: 0, Skipped: 0, Time elapsed: 41.861 sec - in org.apache.atlas.repository.store.graph.v1.AtlasRelationshipDefStoreV1Test
Tests run: 1, Failures: 0, Errors: 0, Skipped: 0, Time elapsed: 45.488 sec - in org.apache.atlas.services.MetricsServiceTest
Tests run: 4, Failures: 0, Errors: 0, Skipped: 0, Time elapsed: 49.27 sec - in org.apache.atlas.repository.store.graph.v1.AtlasRelationshipStoreHardDeleteV1Test
Tests run: 5, Failures: 0, Errors: 0, Skipped: 0, Time elapsed: 53.357 sec - in org.apache.atlas.repository.store.graph.v1.InverseReferenceUpdateSoftDeleteV1Test
Tests run: 4, Failures: 0, Errors: 0, Skipped: 0, Time elapsed: 57.49 sec - in org.apache.atlas.repository.store.graph.v1.AtlasRelationshipStoreSoftDeleteV1Test
Tests run: 5, Failures: 0, Errors: 0, Skipped: 0, Time elapsed: 58.18 sec - in org.apache.atlas.repository.store.graph.v1.InverseReferenceUpdateHardDeleteV1Test
Tests run: 12, Failures: 0, Errors: 0, Skipped: 0, Time elapsed: 61.237 sec - in org.apache.atlas.repository.userprofile.UserProfileServiceTest
Tests run: 10, Failures: 0, Errors: 0, Skipped: 0, Time elapsed: 60.67 sec - in org.apache.atlas.repository.impexp.ExportServiceTest
Tests run: 18, Failures: 0, Errors: 0, Skipped: 0, Time elapsed: 67.03 sec - in org.apache.atlas.repository.store.graph.AtlasTypeDefGraphStoreTest
Tests run: 14, Failures: 0, Errors: 0, Skipped: 0, Time elapsed: 67.343 sec - in org.apache.atlas.repository.store.graph.v1.AtlasEntityStoreV1Test
Tests run: 10, Failures: 0, Errors: 0, Skipped: 0, Time elapsed: 76.528 sec - in org.apache.atlas.repository.impexp.ImportServiceTest
Tests run: 246, Failures: 0, Errors: 0, Skipped: 0, Time elapsed: 138.466 sec - in org.apache.atlas.query.DSLQueriesTest

Results :

Failed tests: 
  GremlinQueryComposerTest.classification:40->verify:363->verify:354 PII expected [g.V().outE('classifiedAs').has('__name', within('PII')).outV().dedup().limit(25).toList()] but found [g.V().outE('classifiedAs').has('__name', within('PII')).has('__state', 'ACTIVE').outV().dedup().limit(25).toList()]
  GremlinQueryComposerTest.dimension:46->verify:363->verify:354 Table isa Dimension expected [g.V().has('__typeName', 'Table').outE('classifiedAs').has('__name', within('Dimension')).outV().dedup().limit(25).toList()] but found [g.V().has('__typeName', 'Table').outE('classifiedAs').has('__name', within('Dimension')).has('__state', 'ACTIVE').outV().dedup().limit(25).toList()]
  GremlinQueryComposerTest.keywordsInWhereClause:297->verify:363->verify:354 Table as t where t has name and t isa Dimension expected [g.V().has('__typeName', 'Table').as('t').and(__.has('Table.name'),__.outE('classifiedAs').has('__name', within('Dimension')).outV()).dedup().limit(25).toList()] but found [g.V().has('__typeName', 'Table').as('t').and(__.has('Table.name'),__.outE('classifiedAs').has('__name', within('Dimension')).has('__state', 'ACTIVE').outV()).dedup().limit(25).toList()]

Tests run: 450, Failures: 3, Errors: 0, Skipped: 0

[INFO] ------------------------------------------------------------------------
[INFO] Reactor Summary:
[INFO] 
[INFO] Apache Atlas Server Build Tools .................... SUCCESS [  1.080 s]
[INFO] apache-atlas ....................................... SUCCESS [  5.256 s]
[INFO] Apache Atlas Test Utility Tools .................... SUCCESS [  6.802 s]
[INFO] Open Connector Framework (OCF) ..................... SUCCESS [  1.931 s]
[INFO] Apache Atlas Integration ........................... SUCCESS [ 42.816 s]
[INFO] Apache Atlas Common ................................ SUCCESS [  2.689 s]
[INFO] Apache Atlas Client ................................ SUCCESS [  0.187 s]
[INFO] atlas-client-common ................................ SUCCESS [  0.804 s]
[INFO] atlas-client-v1 .................................... SUCCESS [  2.964 s]
[INFO] Apache Atlas Server API ............................ SUCCESS [  1.021 s]
[INFO] Apache Atlas Notification .......................... SUCCESS [ 16.354 s]
[INFO] atlas-client-v2 .................................... SUCCESS [  0.668 s]
[INFO] Apache Atlas Graph Database Projects ............... SUCCESS [  0.136 s]
[INFO] Apache Atlas Graph Database API .................... SUCCESS [  0.721 s]
[INFO] Graph Database Common Code ......................... SUCCESS [  0.765 s]
[INFO] Apache Atlas JanusGraph DB Impl .................... SUCCESS [02:28 min]
[INFO] Apache Atlas Graph Database Implementation Dependencies SUCCESS [  2.155 s]
[INFO] Shaded version of Apache hbase client .............. SUCCESS [  8.737 s]
[INFO] Apache Atlas Titan 0.5.4 Graph DB Impl ............. SUCCESS [ 31.649 s]
[INFO] Shaded version of Apache hbase server .............. SUCCESS [ 22.526 s]
[INFO] Apache Atlas Authorization ......................... SUCCESS [  2.447 s]
[INFO] Apache Atlas Repository ............................ FAILURE [02:30 min]
[INFO] Apache Atlas UI .................................... SKIPPED
[INFO] Apache Atlas Web Application ....................... SKIPPED
[INFO] Apache Atlas Documentation ......................... SKIPPED
[INFO] Apache Atlas FileSystem Model ...................... SKIPPED
[INFO] Apache Atlas Plugin Classloader .................... SKIPPED
[INFO] Apache Atlas Hive Bridge Shim ...................... SKIPPED
[INFO] Apache Atlas Hive Bridge ........................... SKIPPED
[INFO] Apache Atlas Falcon Bridge Shim .................... SKIPPED
[INFO] Apache Atlas Falcon Bridge ......................... SKIPPED
[INFO] Apache Atlas Sqoop Bridge Shim ..................... SKIPPED
[INFO] Apache Atlas Sqoop Bridge .......................... SKIPPED
[INFO] Apache Atlas Storm Bridge Shim ..................... SKIPPED
[INFO] Apache Atlas Storm Bridge .......................... SKIPPED
[INFO] Apache Atlas Hbase Bridge Shim ..................... SKIPPED
[INFO] Apache Atlas Hbase Bridge .......................... SKIPPED
[INFO] Apache Atlas Distribution .......................... SKIPPED
[INFO] ------------------------------------------------------------------------
[INFO] BUILD FAILURE
[INFO] ------------------------------------------------------------------------
[INFO] Total time: 07:32 min
[INFO] Finished at: 2018-03-22T02:08:37Z
[INFO] Final Memory: 139M/1952M
[INFO] ------------------------------------------------------------------------
[ERROR] Failed to execute goal org.apache.maven.plugins:maven-surefire-plugin:2.18.1:test (default-test) on project atlas-repository: There are test failures.
[ERROR] 
[ERROR] Please refer to <https://builds.apache.org/job/PreCommit-ATLAS-Build-Test/ws/repository/target/surefire-reports> for the individual test results.
[ERROR] -> [Help 1]
[ERROR] 
[ERROR] To see the full stack trace of the errors, re-run Maven with the -e switch.
[ERROR] Re-run Maven using the -X switch to enable full debug logging.
[ERROR] 
[ERROR] For more information about the errors and possible solutions, please read the following articles:
[ERROR] [Help 1] http://cwiki.apache.org/confluence/display/MAVEN/MojoFailureException
[ERROR] 
[ERROR] After correcting the problems, you can resume the build with the command
[ERROR]   mvn <goals> -rf :atlas-repository




{color:green}+1 overall{color}.  

    {color:green}+1 @author{color}.  The patch does not contain any @author tags.

Test results: https://builds.apache.org/job/PreCommit-ATLAS-Build-Test/211//testReport/
Console output: https://builds.apache.org/job/PreCommit-ATLAS-Build-Test/211//console

This message is automatically generated.


======================================================================
======================================================================
    Adding comment to Jira.
======================================================================
======================================================================




======================================================================
======================================================================
    Finished build.
======================================================================
======================================================================


+ EXIT_CODE=0
+ '[' -d <https://builds.apache.org/job/PreCommit-ATLAS-Build-Test/ws/../atlas_patchprocess_22191> ']'
+ '[' -d <https://builds.apache.org/job/PreCommit-ATLAS-Build-Test/ws/atlas_patchprocess_22191> ']'
+ mv <https://builds.apache.org/job/PreCommit-ATLAS-Build-Test/ws/atlas_patchprocess_22191> <https://builds.apache.org/job/PreCommit-ATLAS-Build-Test/ws/patchprocess>
+ rm -f <https://builds.apache.org/job/PreCommit-ATLAS-Build-Test/ws/../atlas_patchprocess_22191>
+ exit 0
[description-setter] Description set: ATLAS-2510.1.patch
Set build name.
New build name is '#211-master-ATLAS-2510.1.patch'
Archiving artifacts
ERROR: No artifacts found that match the file pattern "distro/target/*.tar.gz, webapp/target/*.war, **/target/**/*application.log". Configuration error?
ERROR: ?distro/target/*.tar.gz? doesn?t match anything: ?distro? exists but not ?distro/target/*.tar.gz?
Build step 'Archive the artifacts' changed build result to FAILURE

Jenkins build is back to normal : PreCommit-ATLAS-Build-Test #213-master-ATLAS-2510.2.patch

Posted by Apache Jenkins Server <je...@builds.apache.org>.
See <https://builds.apache.org/job/PreCommit-ATLAS-Build-Test/213/display/redirect>


Build failed in Jenkins: PreCommit-ATLAS-Build-Test #212-master-ATLAS-2510.2.patch

Posted by Apache Jenkins Server <je...@builds.apache.org>.
See <https://builds.apache.org/job/PreCommit-ATLAS-Build-Test/212/display/redirect>

------------------------------------------
[...truncated 221.13 KB...]
[INFO] Exclude: **/*rebel*.xml.bak
[INFO] Exclude: **/test/resources/**
[INFO] 148 resources included (use -debug for more details)
[INFO] Rat check: Summary over all files. Unapproved: 0, unknown: 0, generated: 0, approved: 148 licenses.
[INFO] 
[INFO] --- maven-resources-plugin:2.7:copy-resources (copy-resources) @ atlas-repository ---
[INFO] Using 'UTF-8' encoding to copy filtered resources.
[INFO] Copying 9 resources
[INFO] 
[INFO] --- maven-remote-resources-plugin:1.5:process (default) @ atlas-repository ---
[INFO] 
[INFO] --- maven-resources-plugin:2.7:resources (default-resources) @ atlas-repository ---
[INFO] Using 'UTF-8' encoding to copy filtered resources.
[INFO] skip non existing resourceDirectory <https://builds.apache.org/job/PreCommit-ATLAS-Build-Test/ws/repository/src/main/resources>
[INFO] Copying 2 resources to META-INF
[INFO] Copying 3 resources
[INFO] 
[INFO] --- maven-compiler-plugin:3.7.0:compile (default-compile) @ atlas-repository ---
[INFO] Changes detected - recompiling the module!
[INFO] Compiling 118 source files to <https://builds.apache.org/job/PreCommit-ATLAS-Build-Test/ws/repository/target/classes>
[INFO] <https://builds.apache.org/job/PreCommit-ATLAS-Build-Test/ws/repository/src/main/java/org/apache/atlas/repository/converters/AtlasInstanceConverter.java>: Some input files use or override a deprecated API.
[INFO] <https://builds.apache.org/job/PreCommit-ATLAS-Build-Test/ws/repository/src/main/java/org/apache/atlas/repository/converters/AtlasInstanceConverter.java>: Recompile with -Xlint:deprecation for details.
[INFO] <https://builds.apache.org/job/PreCommit-ATLAS-Build-Test/ws/repository/src/main/java/org/apache/atlas/util/SearchPredicateUtil.java>: Some input files use unchecked or unsafe operations.
[INFO] <https://builds.apache.org/job/PreCommit-ATLAS-Build-Test/ws/repository/src/main/java/org/apache/atlas/util/SearchPredicateUtil.java>: Recompile with -Xlint:unchecked for details.
[INFO] 
[INFO] --- maven-resources-plugin:2.7:testResources (default-testResources) @ atlas-repository ---
[INFO] Using 'UTF-8' encoding to copy filtered resources.
[INFO] Copying 22 resources
[INFO] Copying 3 resources
[INFO] 
[INFO] --- maven-compiler-plugin:3.7.0:testCompile (default-testCompile) @ atlas-repository ---
[INFO] Changes detected - recompiling the module!
[INFO] Compiling 33 source files to <https://builds.apache.org/job/PreCommit-ATLAS-Build-Test/ws/repository/target/test-classes>
[INFO] <https://builds.apache.org/job/PreCommit-ATLAS-Build-Test/ws/repository/src/test/java/org/apache/atlas/query/BasicTestSetup.java>: <https://builds.apache.org/job/PreCommit-ATLAS-Build-Test/ws/repository/src/test/java/org/apache/atlas/query/BasicTestSetup.java> uses or overrides a deprecated API.
[INFO] <https://builds.apache.org/job/PreCommit-ATLAS-Build-Test/ws/repository/src/test/java/org/apache/atlas/query/BasicTestSetup.java>: Recompile with -Xlint:deprecation for details.
[INFO] <https://builds.apache.org/job/PreCommit-ATLAS-Build-Test/ws/repository/src/test/java/org/apache/atlas/repository/impexp/UniqueListTest.java>: Some input files use unchecked or unsafe operations.
[INFO] <https://builds.apache.org/job/PreCommit-ATLAS-Build-Test/ws/repository/src/test/java/org/apache/atlas/repository/impexp/UniqueListTest.java>: Recompile with -Xlint:unchecked for details.
[INFO] 
[INFO] --- maven-surefire-plugin:2.18.1:test (default-test) @ atlas-repository ---
[INFO] Surefire report directory: <https://builds.apache.org/job/PreCommit-ATLAS-Build-Test/ws/repository/target/surefire-reports>
[INFO] Using configured provider org.apache.maven.surefire.testng.TestNGProvider

-------------------------------------------------------
 T E S T S
-------------------------------------------------------
Running org.apache.atlas.repository.impexp.ExportServiceTest
Running org.apache.atlas.repository.store.graph.v1.AtlasRelationshipStoreV1Test
Running org.apache.atlas.repository.impexp.ImportTransformerJSONTest
Running org.apache.atlas.repository.impexp.TypeAttributeDifferenceTest
Running org.apache.atlas.repository.audit.InMemoryAuditRepositoryTest
Running org.apache.atlas.repository.store.graph.AtlasTypeDefGraphStoreTest
Running org.apache.atlas.services.MetricsServiceTest
Running org.apache.atlas.TestModules
Running org.apache.atlas.repository.store.graph.v1.InverseReferenceUpdateV1Test
Running org.apache.atlas.repository.impexp.ImportTransformsTest
Running org.apache.atlas.repository.impexp.ImportServiceTest
Running org.apache.atlas.utils.ObjectUpdateSynchronizerTest
Running org.apache.atlas.repository.store.graph.v1.AtlasEntityStoreV1BulkImportPercentTest
Running org.apache.atlas.repository.impexp.ZipSinkTest
Running org.apache.atlas.repository.store.graph.v1.AtlasEntityDefStoreV1Test
Running org.apache.atlas.repository.store.graph.v1.AtlasRelationshipStoreHardDeleteV1Test
Running org.apache.atlas.repository.impexp.ZipSourceTest
Running org.apache.atlas.utils.TestResourceFileUtils
Running org.apache.atlas.repository.impexp.AtlasImportRequestTest
Running org.apache.atlas.repository.impexp.UniqueListTest
Running org.apache.atlas.query.DSLQueriesTest
Running org.apache.atlas.repository.userprofile.UserProfileServiceTest
Running org.apache.atlas.repository.store.graph.v1.AtlasRelationshipDefStoreV1Test
Running org.apache.atlas.query.GremlinQueryComposerTest
Running org.apache.atlas.repository.store.graph.v1.InverseReferenceUpdateHardDeleteV1Test
Running org.apache.atlas.repository.store.graph.v1.InverseReferenceUpdateSoftDeleteV1Test
Running org.apache.atlas.query.DSLParsingTest
Running org.apache.atlas.repository.impexp.ImportTransformerTest
Running org.apache.atlas.repository.store.graph.v1.AtlasRelationshipStoreSoftDeleteV1Test
Running org.apache.atlas.repository.store.graph.v1.AtlasEntityStoreV1Test
Tests run: 0, Failures: 0, Errors: 0, Skipped: 0, Time elapsed: 1.98 sec - in org.apache.atlas.repository.store.graph.v1.AtlasRelationshipStoreV1Test
Tests run: 0, Failures: 0, Errors: 0, Skipped: 0, Time elapsed: 2.095 sec - in org.apache.atlas.repository.store.graph.v1.InverseReferenceUpdateV1Test
Tests run: 0, Failures: 0, Errors: 0, Skipped: 0, Time elapsed: 2.174 sec - in org.apache.atlas.TestModules
Tests run: 0, Failures: 0, Errors: 0, Skipped: 0, Time elapsed: 2.043 sec - in org.apache.atlas.utils.TestResourceFileUtils
Tests run: 3, Failures: 0, Errors: 0, Skipped: 0, Time elapsed: 2.342 sec - in org.apache.atlas.repository.audit.InMemoryAuditRepositoryTest
Tests run: 4, Failures: 0, Errors: 0, Skipped: 0, Time elapsed: 2.099 sec - in org.apache.atlas.repository.impexp.UniqueListTest
Tests run: 8, Failures: 0, Errors: 0, Skipped: 0, Time elapsed: 2.425 sec - in org.apache.atlas.repository.impexp.ImportTransformerTest
Tests run: 6, Failures: 0, Errors: 0, Skipped: 0, Time elapsed: 3.229 sec - in org.apache.atlas.repository.impexp.TypeAttributeDifferenceTest
Tests run: 9, Failures: 0, Errors: 0, Skipped: 0, Time elapsed: 3.217 sec - in org.apache.atlas.repository.store.graph.v1.AtlasEntityStoreV1BulkImportPercentTest
Tests run: 1, Failures: 0, Errors: 0, Skipped: 0, Time elapsed: 3.637 sec - in org.apache.atlas.repository.impexp.ImportTransformerJSONTest
Tests run: 3, Failures: 0, Errors: 0, Skipped: 0, Time elapsed: 3.955 sec - in org.apache.atlas.repository.impexp.ImportTransformsTest
Tests run: 8, Failures: 0, Errors: 0, Skipped: 0, Time elapsed: 3.864 sec - in org.apache.atlas.repository.impexp.ZipSinkTest
Tests run: 9, Failures: 0, Errors: 0, Skipped: 0, Time elapsed: 4.098 sec - in org.apache.atlas.utils.ObjectUpdateSynchronizerTest
Tests run: 6, Failures: 0, Errors: 0, Skipped: 0, Time elapsed: 3.905 sec - in org.apache.atlas.repository.impexp.AtlasImportRequestTest
Tests run: 6, Failures: 0, Errors: 0, Skipped: 0, Time elapsed: 4.146 sec - in org.apache.atlas.repository.impexp.ZipSourceTest
Tests run: 8, Failures: 0, Errors: 0, Skipped: 0, Time elapsed: 4.222 sec - in org.apache.atlas.query.DSLParsingTest
Tests run: 39, Failures: 3, Errors: 0, Skipped: 0, Time elapsed: 7.116 sec <<< FAILURE! - in org.apache.atlas.query.GremlinQueryComposerTest
classification(org.apache.atlas.query.GremlinQueryComposerTest)  Time elapsed: 0.002 sec  <<< FAILURE!
java.lang.AssertionError: PII expected [g.V().outE('classifiedAs').has('__name', within('PII')).outV().dedup().limit(25).toList()] but found [g.V().outE('classifiedAs').has('__name', within('PII')).has('__state', 'ACTIVE').outV().dedup().limit(25).toList()]
	at org.testng.Assert.fail(Assert.java:94)
	at org.testng.Assert.failNotEquals(Assert.java:496)
	at org.testng.Assert.assertEquals(Assert.java:125)
	at org.testng.Assert.assertEquals(Assert.java:178)
	at org.apache.atlas.query.GremlinQueryComposerTest.verify(GremlinQueryComposerTest.java:354)
	at org.apache.atlas.query.GremlinQueryComposerTest.verify(GremlinQueryComposerTest.java:363)
	at org.apache.atlas.query.GremlinQueryComposerTest.classification(GremlinQueryComposerTest.java:40)

dimension(org.apache.atlas.query.GremlinQueryComposerTest)  Time elapsed: 0.013 sec  <<< FAILURE!
java.lang.AssertionError: Table isa Dimension expected [g.V().has('__typeName', 'Table').outE('classifiedAs').has('__name', within('Dimension')).outV().dedup().limit(25).toList()] but found [g.V().has('__typeName', 'Table').outE('classifiedAs').has('__name', within('Dimension')).has('__state', 'ACTIVE').outV().dedup().limit(25).toList()]
	at org.testng.Assert.fail(Assert.java:94)
	at org.testng.Assert.failNotEquals(Assert.java:496)
	at org.testng.Assert.assertEquals(Assert.java:125)
	at org.testng.Assert.assertEquals(Assert.java:178)
	at org.apache.atlas.query.GremlinQueryComposerTest.verify(GremlinQueryComposerTest.java:354)
	at org.apache.atlas.query.GremlinQueryComposerTest.verify(GremlinQueryComposerTest.java:363)
	at org.apache.atlas.query.GremlinQueryComposerTest.dimension(GremlinQueryComposerTest.java:46)

keywordsInWhereClause(org.apache.atlas.query.GremlinQueryComposerTest)  Time elapsed: 0.013 sec  <<< FAILURE!
java.lang.AssertionError: Table as t where t has name and t isa Dimension expected [g.V().has('__typeName', 'Table').as('t').and(__.has('Table.name'),__.outE('classifiedAs').has('__name', within('Dimension')).outV()).dedup().limit(25).toList()] but found [g.V().has('__typeName', 'Table').as('t').and(__.has('Table.name'),__.outE('classifiedAs').has('__name', within('Dimension')).has('__state', 'ACTIVE').outV()).dedup().limit(25).toList()]
	at org.testng.Assert.fail(Assert.java:94)
	at org.testng.Assert.failNotEquals(Assert.java:496)
	at org.testng.Assert.assertEquals(Assert.java:125)
	at org.testng.Assert.assertEquals(Assert.java:178)
	at org.apache.atlas.query.GremlinQueryComposerTest.verify(GremlinQueryComposerTest.java:354)
	at org.apache.atlas.query.GremlinQueryComposerTest.verify(GremlinQueryComposerTest.java:363)
	at org.apache.atlas.query.GremlinQueryComposerTest.keywordsInWhereClause(GremlinQueryComposerTest.java:297)

Tests run: 10, Failures: 0, Errors: 0, Skipped: 0, Time elapsed: 61.637 sec - in org.apache.atlas.repository.store.graph.v1.AtlasRelationshipDefStoreV1Test
Tests run: 1, Failures: 0, Errors: 0, Skipped: 0, Time elapsed: 62.445 sec - in org.apache.atlas.repository.store.graph.v1.AtlasEntityDefStoreV1Test
Tests run: 1, Failures: 0, Errors: 0, Skipped: 0, Time elapsed: 64.901 sec - in org.apache.atlas.services.MetricsServiceTest
Tests run: 4, Failures: 0, Errors: 0, Skipped: 0, Time elapsed: 70.459 sec - in org.apache.atlas.repository.store.graph.v1.AtlasRelationshipStoreSoftDeleteV1Test
Tests run: 5, Failures: 0, Errors: 0, Skipped: 0, Time elapsed: 76.584 sec - in org.apache.atlas.repository.store.graph.v1.InverseReferenceUpdateSoftDeleteV1Test
Tests run: 10, Failures: 0, Errors: 0, Skipped: 0, Time elapsed: 78.608 sec - in org.apache.atlas.repository.impexp.ExportServiceTest
Tests run: 4, Failures: 0, Errors: 0, Skipped: 0, Time elapsed: 81.796 sec - in org.apache.atlas.repository.store.graph.v1.AtlasRelationshipStoreHardDeleteV1Test
Tests run: 5, Failures: 0, Errors: 0, Skipped: 0, Time elapsed: 82.418 sec - in org.apache.atlas.repository.store.graph.v1.InverseReferenceUpdateHardDeleteV1Test
Tests run: 14, Failures: 0, Errors: 0, Skipped: 0, Time elapsed: 88.758 sec - in org.apache.atlas.repository.store.graph.v1.AtlasEntityStoreV1Test
Tests run: 12, Failures: 0, Errors: 0, Skipped: 0, Time elapsed: 90.567 sec - in org.apache.atlas.repository.userprofile.UserProfileServiceTest
Tests run: 18, Failures: 0, Errors: 0, Skipped: 0, Time elapsed: 97.192 sec - in org.apache.atlas.repository.store.graph.AtlasTypeDefGraphStoreTest
Tests run: 10, Failures: 0, Errors: 0, Skipped: 0, Time elapsed: 103.422 sec - in org.apache.atlas.repository.impexp.ImportServiceTest
Tests run: 246, Failures: 0, Errors: 0, Skipped: 0, Time elapsed: 150.109 sec - in org.apache.atlas.query.DSLQueriesTest

Results :

Failed tests: 
  GremlinQueryComposerTest.classification:40->verify:363->verify:354 PII expected [g.V().outE('classifiedAs').has('__name', within('PII')).outV().dedup().limit(25).toList()] but found [g.V().outE('classifiedAs').has('__name', within('PII')).has('__state', 'ACTIVE').outV().dedup().limit(25).toList()]
  GremlinQueryComposerTest.dimension:46->verify:363->verify:354 Table isa Dimension expected [g.V().has('__typeName', 'Table').outE('classifiedAs').has('__name', within('Dimension')).outV().dedup().limit(25).toList()] but found [g.V().has('__typeName', 'Table').outE('classifiedAs').has('__name', within('Dimension')).has('__state', 'ACTIVE').outV().dedup().limit(25).toList()]
  GremlinQueryComposerTest.keywordsInWhereClause:297->verify:363->verify:354 Table as t where t has name and t isa Dimension expected [g.V().has('__typeName', 'Table').as('t').and(__.has('Table.name'),__.outE('classifiedAs').has('__name', within('Dimension')).outV()).dedup().limit(25).toList()] but found [g.V().has('__typeName', 'Table').as('t').and(__.has('Table.name'),__.outE('classifiedAs').has('__name', within('Dimension')).has('__state', 'ACTIVE').outV()).dedup().limit(25).toList()]

Tests run: 450, Failures: 3, Errors: 0, Skipped: 0

[INFO] ------------------------------------------------------------------------
[INFO] Reactor Summary:
[INFO] 
[INFO] Apache Atlas Server Build Tools .................... SUCCESS [  0.788 s]
[INFO] apache-atlas ....................................... SUCCESS [  3.510 s]
[INFO] Apache Atlas Test Utility Tools .................... SUCCESS [  5.084 s]
[INFO] Open Connector Framework (OCF) ..................... SUCCESS [  1.446 s]
[INFO] Apache Atlas Integration ........................... SUCCESS [ 37.292 s]
[INFO] Apache Atlas Common ................................ SUCCESS [  3.732 s]
[INFO] Apache Atlas Client ................................ SUCCESS [  0.166 s]
[INFO] atlas-client-common ................................ SUCCESS [  0.873 s]
[INFO] atlas-client-v1 .................................... SUCCESS [  3.043 s]
[INFO] Apache Atlas Server API ............................ SUCCESS [  0.781 s]
[INFO] Apache Atlas Notification .......................... SUCCESS [ 20.996 s]
[INFO] atlas-client-v2 .................................... SUCCESS [  0.689 s]
[INFO] Apache Atlas Graph Database Projects ............... SUCCESS [  0.106 s]
[INFO] Apache Atlas Graph Database API .................... SUCCESS [  0.745 s]
[INFO] Graph Database Common Code ......................... SUCCESS [  0.897 s]
[INFO] Apache Atlas JanusGraph DB Impl .................... SUCCESS [02:03 min]
[INFO] Apache Atlas Graph Database Implementation Dependencies SUCCESS [  1.802 s]
[INFO] Shaded version of Apache hbase client .............. SUCCESS [  8.959 s]
[INFO] Apache Atlas Titan 0.5.4 Graph DB Impl ............. SUCCESS [ 28.839 s]
[INFO] Shaded version of Apache hbase server .............. SUCCESS [ 20.494 s]
[INFO] Apache Atlas Authorization ......................... SUCCESS [  2.578 s]
[INFO] Apache Atlas Repository ............................ FAILURE [02:39 min]
[INFO] Apache Atlas UI .................................... SKIPPED
[INFO] Apache Atlas Web Application ....................... SKIPPED
[INFO] Apache Atlas Documentation ......................... SKIPPED
[INFO] Apache Atlas FileSystem Model ...................... SKIPPED
[INFO] Apache Atlas Plugin Classloader .................... SKIPPED
[INFO] Apache Atlas Hive Bridge Shim ...................... SKIPPED
[INFO] Apache Atlas Hive Bridge ........................... SKIPPED
[INFO] Apache Atlas Falcon Bridge Shim .................... SKIPPED
[INFO] Apache Atlas Falcon Bridge ......................... SKIPPED
[INFO] Apache Atlas Sqoop Bridge Shim ..................... SKIPPED
[INFO] Apache Atlas Sqoop Bridge .......................... SKIPPED
[INFO] Apache Atlas Storm Bridge Shim ..................... SKIPPED
[INFO] Apache Atlas Storm Bridge .......................... SKIPPED
[INFO] Apache Atlas Hbase Bridge Shim ..................... SKIPPED
[INFO] Apache Atlas Hbase Bridge .......................... SKIPPED
[INFO] Apache Atlas Distribution .......................... SKIPPED
[INFO] ------------------------------------------------------------------------
[INFO] BUILD FAILURE
[INFO] ------------------------------------------------------------------------
[INFO] Total time: 07:06 min
[INFO] Finished at: 2018-03-22T18:36:41Z
[INFO] Final Memory: 136M/2330M
[INFO] ------------------------------------------------------------------------
[ERROR] Failed to execute goal org.apache.maven.plugins:maven-surefire-plugin:2.18.1:test (default-test) on project atlas-repository: There are test failures.
[ERROR] 
[ERROR] Please refer to <https://builds.apache.org/job/PreCommit-ATLAS-Build-Test/ws/repository/target/surefire-reports> for the individual test results.
[ERROR] -> [Help 1]
[ERROR] 
[ERROR] To see the full stack trace of the errors, re-run Maven with the -e switch.
[ERROR] Re-run Maven using the -X switch to enable full debug logging.
[ERROR] 
[ERROR] For more information about the errors and possible solutions, please read the following articles:
[ERROR] [Help 1] http://cwiki.apache.org/confluence/display/MAVEN/MojoFailureException
[ERROR] 
[ERROR] After correcting the problems, you can resume the build with the command
[ERROR]   mvn <goals> -rf :atlas-repository




{color:green}+1 overall{color}.  

    {color:green}+1 @author{color}.  The patch does not contain any @author tags.

Test results: https://builds.apache.org/job/PreCommit-ATLAS-Build-Test/212//testReport/
Console output: https://builds.apache.org/job/PreCommit-ATLAS-Build-Test/212//console

This message is automatically generated.


======================================================================
======================================================================
    Adding comment to Jira.
======================================================================
======================================================================




======================================================================
======================================================================
    Finished build.
======================================================================
======================================================================


+ EXIT_CODE=0
+ '[' -d <https://builds.apache.org/job/PreCommit-ATLAS-Build-Test/ws/../atlas_patchprocess_1417> ']'
+ '[' -d <https://builds.apache.org/job/PreCommit-ATLAS-Build-Test/ws/atlas_patchprocess_1417> ']'
+ mv <https://builds.apache.org/job/PreCommit-ATLAS-Build-Test/ws/atlas_patchprocess_1417> <https://builds.apache.org/job/PreCommit-ATLAS-Build-Test/ws/patchprocess>
+ rm -f <https://builds.apache.org/job/PreCommit-ATLAS-Build-Test/ws/../atlas_patchprocess_1417>
+ exit 0
[description-setter] Description set: ATLAS-2510.2.patch
Set build name.
New build name is '#212-master-ATLAS-2510.2.patch'
Archiving artifacts
ERROR: No artifacts found that match the file pattern "distro/target/*.tar.gz, webapp/target/*.war, **/target/**/*application.log". Configuration error?
ERROR: ?distro/target/*.tar.gz? doesn?t match anything: ?distro? exists but not ?distro/target/*.tar.gz?
Build step 'Archive the artifacts' changed build result to FAILURE