You are viewing a plain text version of this content. The canonical link for it is here.
Posted to builds@solr.apache.org by Policeman Jenkins Server <je...@thetaphi.de> on 2023/11/12 05:54:52 UTC
[JENKINS-EA] Lucene-Solr-8.11-Windows (64bit/hotspot/jdk-22-ea+23) - Build # 238 - Still Unstable!
Build: https://jenkins.thetaphi.de/job/Lucene-Solr-8.11-Windows/238/
Java: 64bit/hotspot/jdk-22-ea+23 -XX:+UseCompressedOops -XX:+UseParallelGC
18 tests failed.
FAILED: org.apache.solr.cloud.PackageManagerCLITest.testPackageManager
Error Message:
Non-zero status returned for: [-solrUrl, http://127.0.0.1:51152/solr, install, question-answer:1.0.0] expected:<0> but was:<1>
Stack Trace:
java.lang.AssertionError: Non-zero status returned for: [-solrUrl, http://127.0.0.1:51152/solr, install, question-answer:1.0.0] expected:<0> but was:<1>
at __randomizedtesting.SeedInfo.seed([F75DE56C210DA983:F4F7AE0223E37628]:0)
at org.junit.Assert.fail(Assert.java:89)
at org.junit.Assert.failNotEquals(Assert.java:835)
at org.junit.Assert.assertEquals(Assert.java:647)
at org.apache.solr.cloud.PackageManagerCLITest.run(PackageManagerCLITest.java:156)
at org.apache.solr.cloud.PackageManagerCLITest.testPackageManager(PackageManagerCLITest.java:83)
at java.base/jdk.internal.reflect.DirectMethodHandleAccessor.invoke(DirectMethodHandleAccessor.java:103)
at java.base/java.lang.reflect.Method.invoke(Method.java:580)
at com.carrotsearch.randomizedtesting.RandomizedRunner.invoke(RandomizedRunner.java:1758)
at com.carrotsearch.randomizedtesting.RandomizedRunner$8.evaluate(RandomizedRunner.java:946)
at com.carrotsearch.randomizedtesting.RandomizedRunner$9.evaluate(RandomizedRunner.java:982)
at com.carrotsearch.randomizedtesting.RandomizedRunner$10.evaluate(RandomizedRunner.java:996)
at com.carrotsearch.randomizedtesting.rules.SystemPropertiesRestoreRule$1.evaluate(SystemPropertiesRestoreRule.java:80)
at org.junit.rules.RunRules.evaluate(RunRules.java:20)
at org.apache.lucene.util.TestRuleSetupTeardownChained$1.evaluate(TestRuleSetupTeardownChained.java:49)
at org.apache.lucene.util.AbstractBeforeAfterRule$1.evaluate(AbstractBeforeAfterRule.java:45)
at org.apache.lucene.util.TestRuleThreadAndTestName$1.evaluate(TestRuleThreadAndTestName.java:48)
at org.apache.lucene.util.TestRuleIgnoreAfterMaxFailures$1.evaluate(TestRuleIgnoreAfterMaxFailures.java:64)
at org.apache.lucene.util.TestRuleMarkFailure$1.evaluate(TestRuleMarkFailure.java:47)
at org.junit.rules.RunRules.evaluate(RunRules.java:20)
at com.carrotsearch.randomizedtesting.rules.StatementAdapter.evaluate(StatementAdapter.java:36)
at com.carrotsearch.randomizedtesting.ThreadLeakControl$StatementRunner.run(ThreadLeakControl.java:390)
at com.carrotsearch.randomizedtesting.ThreadLeakControl.forkTimeoutingTask(ThreadLeakControl.java:843)
at com.carrotsearch.randomizedtesting.ThreadLeakControl$3.evaluate(ThreadLeakControl.java:490)
at com.carrotsearch.randomizedtesting.RandomizedRunner.runSingleTest(RandomizedRunner.java:955)
at com.carrotsearch.randomizedtesting.RandomizedRunner$5.evaluate(RandomizedRunner.java:840)
at com.carrotsearch.randomizedtesting.RandomizedRunner$6.evaluate(RandomizedRunner.java:891)
at com.carrotsearch.randomizedtesting.RandomizedRunner$7.evaluate(RandomizedRunner.java:902)
at com.carrotsearch.randomizedtesting.rules.StatementAdapter.evaluate(StatementAdapter.java:36)
at com.carrotsearch.randomizedtesting.rules.SystemPropertiesRestoreRule$1.evaluate(SystemPropertiesRestoreRule.java:80)
at org.junit.rules.RunRules.evaluate(RunRules.java:20)
at org.apache.lucene.util.AbstractBeforeAfterRule$1.evaluate(AbstractBeforeAfterRule.java:45)
at com.carrotsearch.randomizedtesting.rules.StatementAdapter.evaluate(StatementAdapter.java:36)
at org.apache.lucene.util.TestRuleStoreClassName$1.evaluate(TestRuleStoreClassName.java:41)
at com.carrotsearch.randomizedtesting.rules.NoShadowingOrOverridesOnMethodsRule$1.evaluate(NoShadowingOrOverridesOnMethodsRule.java:40)
at com.carrotsearch.randomizedtesting.rules.NoShadowingOrOverridesOnMethodsRule$1.evaluate(NoShadowingOrOverridesOnMethodsRule.java:40)
at com.carrotsearch.randomizedtesting.rules.StatementAdapter.evaluate(StatementAdapter.java:36)
at com.carrotsearch.randomizedtesting.rules.StatementAdapter.evaluate(StatementAdapter.java:36)
at org.apache.lucene.util.TestRuleAssertionsRequired$1.evaluate(TestRuleAssertionsRequired.java:53)
at org.apache.lucene.util.TestRuleMarkFailure$1.evaluate(TestRuleMarkFailure.java:47)
at org.apache.lucene.util.TestRuleIgnoreAfterMaxFailures$1.evaluate(TestRuleIgnoreAfterMaxFailures.java:64)
at org.apache.lucene.util.TestRuleIgnoreTestSuites$1.evaluate(TestRuleIgnoreTestSuites.java:54)
at org.junit.rules.RunRules.evaluate(RunRules.java:20)
at com.carrotsearch.randomizedtesting.rules.StatementAdapter.evaluate(StatementAdapter.java:36)
at com.carrotsearch.randomizedtesting.ThreadLeakControl$StatementRunner.run(ThreadLeakControl.java:390)
at com.carrotsearch.randomizedtesting.ThreadLeakControl.lambda$forkTimeoutingTask$0(ThreadLeakControl.java:850)
at java.base/java.lang.Thread.run(Thread.java:1570)
FAILED: org.apache.solr.cloud.PackageManagerCLITest.testPackageManager
Error Message:
Non-zero status returned for: [-solrUrl, http://127.0.0.1:51182/solr, install, question-answer:1.0.0] expected:<0> but was:<1>
Stack Trace:
java.lang.AssertionError: Non-zero status returned for: [-solrUrl, http://127.0.0.1:51182/solr, install, question-answer:1.0.0] expected:<0> but was:<1>
at __randomizedtesting.SeedInfo.seed([F75DE56C210DA983:F4F7AE0223E37628]:0)
at org.junit.Assert.fail(Assert.java:89)
at org.junit.Assert.failNotEquals(Assert.java:835)
at org.junit.Assert.assertEquals(Assert.java:647)
at org.apache.solr.cloud.PackageManagerCLITest.run(PackageManagerCLITest.java:156)
at org.apache.solr.cloud.PackageManagerCLITest.testPackageManager(PackageManagerCLITest.java:83)
at java.base/jdk.internal.reflect.DirectMethodHandleAccessor.invoke(DirectMethodHandleAccessor.java:103)
at java.base/java.lang.reflect.Method.invoke(Method.java:580)
at com.carrotsearch.randomizedtesting.RandomizedRunner.invoke(RandomizedRunner.java:1758)
at com.carrotsearch.randomizedtesting.RandomizedRunner$8.evaluate(RandomizedRunner.java:946)
at com.carrotsearch.randomizedtesting.RandomizedRunner$9.evaluate(RandomizedRunner.java:982)
at com.carrotsearch.randomizedtesting.RandomizedRunner$10.evaluate(RandomizedRunner.java:996)
at com.carrotsearch.randomizedtesting.rules.SystemPropertiesRestoreRule$1.evaluate(SystemPropertiesRestoreRule.java:80)
at org.junit.rules.RunRules.evaluate(RunRules.java:20)
at org.apache.lucene.util.TestRuleSetupTeardownChained$1.evaluate(TestRuleSetupTeardownChained.java:49)
at org.apache.lucene.util.AbstractBeforeAfterRule$1.evaluate(AbstractBeforeAfterRule.java:45)
at org.apache.lucene.util.TestRuleThreadAndTestName$1.evaluate(TestRuleThreadAndTestName.java:48)
at org.apache.lucene.util.TestRuleIgnoreAfterMaxFailures$1.evaluate(TestRuleIgnoreAfterMaxFailures.java:64)
at org.apache.lucene.util.TestRuleMarkFailure$1.evaluate(TestRuleMarkFailure.java:47)
at org.junit.rules.RunRules.evaluate(RunRules.java:20)
at com.carrotsearch.randomizedtesting.rules.StatementAdapter.evaluate(StatementAdapter.java:36)
at com.carrotsearch.randomizedtesting.ThreadLeakControl$StatementRunner.run(ThreadLeakControl.java:390)
at com.carrotsearch.randomizedtesting.ThreadLeakControl.forkTimeoutingTask(ThreadLeakControl.java:843)
at com.carrotsearch.randomizedtesting.ThreadLeakControl$3.evaluate(ThreadLeakControl.java:490)
at com.carrotsearch.randomizedtesting.RandomizedRunner.runSingleTest(RandomizedRunner.java:955)
at com.carrotsearch.randomizedtesting.RandomizedRunner$5.evaluate(RandomizedRunner.java:840)
at com.carrotsearch.randomizedtesting.RandomizedRunner$6.evaluate(RandomizedRunner.java:891)
at com.carrotsearch.randomizedtesting.RandomizedRunner$7.evaluate(RandomizedRunner.java:902)
at com.carrotsearch.randomizedtesting.rules.StatementAdapter.evaluate(StatementAdapter.java:36)
at com.carrotsearch.randomizedtesting.rules.SystemPropertiesRestoreRule$1.evaluate(SystemPropertiesRestoreRule.java:80)
at org.junit.rules.RunRules.evaluate(RunRules.java:20)
at org.apache.lucene.util.AbstractBeforeAfterRule$1.evaluate(AbstractBeforeAfterRule.java:45)
at com.carrotsearch.randomizedtesting.rules.StatementAdapter.evaluate(StatementAdapter.java:36)
at org.apache.lucene.util.TestRuleStoreClassName$1.evaluate(TestRuleStoreClassName.java:41)
at com.carrotsearch.randomizedtesting.rules.NoShadowingOrOverridesOnMethodsRule$1.evaluate(NoShadowingOrOverridesOnMethodsRule.java:40)
at com.carrotsearch.randomizedtesting.rules.NoShadowingOrOverridesOnMethodsRule$1.evaluate(NoShadowingOrOverridesOnMethodsRule.java:40)
at com.carrotsearch.randomizedtesting.rules.StatementAdapter.evaluate(StatementAdapter.java:36)
at com.carrotsearch.randomizedtesting.rules.StatementAdapter.evaluate(StatementAdapter.java:36)
at org.apache.lucene.util.TestRuleAssertionsRequired$1.evaluate(TestRuleAssertionsRequired.java:53)
at org.apache.lucene.util.TestRuleMarkFailure$1.evaluate(TestRuleMarkFailure.java:47)
at org.apache.lucene.util.TestRuleIgnoreAfterMaxFailures$1.evaluate(TestRuleIgnoreAfterMaxFailures.java:64)
at org.apache.lucene.util.TestRuleIgnoreTestSuites$1.evaluate(TestRuleIgnoreTestSuites.java:54)
at org.junit.rules.RunRules.evaluate(RunRules.java:20)
at com.carrotsearch.randomizedtesting.rules.StatementAdapter.evaluate(StatementAdapter.java:36)
at com.carrotsearch.randomizedtesting.ThreadLeakControl$StatementRunner.run(ThreadLeakControl.java:390)
at com.carrotsearch.randomizedtesting.ThreadLeakControl.lambda$forkTimeoutingTask$0(ThreadLeakControl.java:850)
at java.base/java.lang.Thread.run(Thread.java:1570)
FAILED: org.apache.solr.cloud.PackageManagerCLITest.testPackageManager
Error Message:
Non-zero status returned for: [-solrUrl, http://127.0.0.1:51180/solr, install, question-answer:1.0.0] expected:<0> but was:<1>
Stack Trace:
java.lang.AssertionError: Non-zero status returned for: [-solrUrl, http://127.0.0.1:51180/solr, install, question-answer:1.0.0] expected:<0> but was:<1>
at __randomizedtesting.SeedInfo.seed([F75DE56C210DA983:F4F7AE0223E37628]:0)
at org.junit.Assert.fail(Assert.java:89)
at org.junit.Assert.failNotEquals(Assert.java:835)
at org.junit.Assert.assertEquals(Assert.java:647)
at org.apache.solr.cloud.PackageManagerCLITest.run(PackageManagerCLITest.java:156)
at org.apache.solr.cloud.PackageManagerCLITest.testPackageManager(PackageManagerCLITest.java:83)
at java.base/jdk.internal.reflect.DirectMethodHandleAccessor.invoke(DirectMethodHandleAccessor.java:103)
at java.base/java.lang.reflect.Method.invoke(Method.java:580)
at com.carrotsearch.randomizedtesting.RandomizedRunner.invoke(RandomizedRunner.java:1758)
at com.carrotsearch.randomizedtesting.RandomizedRunner$8.evaluate(RandomizedRunner.java:946)
at com.carrotsearch.randomizedtesting.RandomizedRunner$9.evaluate(RandomizedRunner.java:982)
at com.carrotsearch.randomizedtesting.RandomizedRunner$10.evaluate(RandomizedRunner.java:996)
at com.carrotsearch.randomizedtesting.rules.SystemPropertiesRestoreRule$1.evaluate(SystemPropertiesRestoreRule.java:80)
at org.junit.rules.RunRules.evaluate(RunRules.java:20)
at org.apache.lucene.util.TestRuleSetupTeardownChained$1.evaluate(TestRuleSetupTeardownChained.java:49)
at org.apache.lucene.util.AbstractBeforeAfterRule$1.evaluate(AbstractBeforeAfterRule.java:45)
at org.apache.lucene.util.TestRuleThreadAndTestName$1.evaluate(TestRuleThreadAndTestName.java:48)
at org.apache.lucene.util.TestRuleIgnoreAfterMaxFailures$1.evaluate(TestRuleIgnoreAfterMaxFailures.java:64)
at org.apache.lucene.util.TestRuleMarkFailure$1.evaluate(TestRuleMarkFailure.java:47)
at org.junit.rules.RunRules.evaluate(RunRules.java:20)
at com.carrotsearch.randomizedtesting.rules.StatementAdapter.evaluate(StatementAdapter.java:36)
at com.carrotsearch.randomizedtesting.ThreadLeakControl$StatementRunner.run(ThreadLeakControl.java:390)
at com.carrotsearch.randomizedtesting.ThreadLeakControl.forkTimeoutingTask(ThreadLeakControl.java:843)
at com.carrotsearch.randomizedtesting.ThreadLeakControl$3.evaluate(ThreadLeakControl.java:490)
at com.carrotsearch.randomizedtesting.RandomizedRunner.runSingleTest(RandomizedRunner.java:955)
at com.carrotsearch.randomizedtesting.RandomizedRunner$5.evaluate(RandomizedRunner.java:840)
at com.carrotsearch.randomizedtesting.RandomizedRunner$6.evaluate(RandomizedRunner.java:891)
at com.carrotsearch.randomizedtesting.RandomizedRunner$7.evaluate(RandomizedRunner.java:902)
at com.carrotsearch.randomizedtesting.rules.StatementAdapter.evaluate(StatementAdapter.java:36)
at com.carrotsearch.randomizedtesting.rules.SystemPropertiesRestoreRule$1.evaluate(SystemPropertiesRestoreRule.java:80)
at org.junit.rules.RunRules.evaluate(RunRules.java:20)
at org.apache.lucene.util.AbstractBeforeAfterRule$1.evaluate(AbstractBeforeAfterRule.java:45)
at com.carrotsearch.randomizedtesting.rules.StatementAdapter.evaluate(StatementAdapter.java:36)
at org.apache.lucene.util.TestRuleStoreClassName$1.evaluate(TestRuleStoreClassName.java:41)
at com.carrotsearch.randomizedtesting.rules.NoShadowingOrOverridesOnMethodsRule$1.evaluate(NoShadowingOrOverridesOnMethodsRule.java:40)
at com.carrotsearch.randomizedtesting.rules.NoShadowingOrOverridesOnMethodsRule$1.evaluate(NoShadowingOrOverridesOnMethodsRule.java:40)
at com.carrotsearch.randomizedtesting.rules.StatementAdapter.evaluate(StatementAdapter.java:36)
at com.carrotsearch.randomizedtesting.rules.StatementAdapter.evaluate(StatementAdapter.java:36)
at org.apache.lucene.util.TestRuleAssertionsRequired$1.evaluate(TestRuleAssertionsRequired.java:53)
at org.apache.lucene.util.TestRuleMarkFailure$1.evaluate(TestRuleMarkFailure.java:47)
at org.apache.lucene.util.TestRuleIgnoreAfterMaxFailures$1.evaluate(TestRuleIgnoreAfterMaxFailures.java:64)
at org.apache.lucene.util.TestRuleIgnoreTestSuites$1.evaluate(TestRuleIgnoreTestSuites.java:54)
at org.junit.rules.RunRules.evaluate(RunRules.java:20)
at com.carrotsearch.randomizedtesting.rules.StatementAdapter.evaluate(StatementAdapter.java:36)
at com.carrotsearch.randomizedtesting.ThreadLeakControl$StatementRunner.run(ThreadLeakControl.java:390)
at com.carrotsearch.randomizedtesting.ThreadLeakControl.lambda$forkTimeoutingTask$0(ThreadLeakControl.java:850)
at java.base/java.lang.Thread.run(Thread.java:1570)
FAILED: org.apache.solr.cloud.PackageManagerCLITest.testPackageManager
Error Message:
Non-zero status returned for: [-solrUrl, http://127.0.0.1:51183/solr, install, question-answer:1.0.0] expected:<0> but was:<1>
Stack Trace:
java.lang.AssertionError: Non-zero status returned for: [-solrUrl, http://127.0.0.1:51183/solr, install, question-answer:1.0.0] expected:<0> but was:<1>
at __randomizedtesting.SeedInfo.seed([F75DE56C210DA983:F4F7AE0223E37628]:0)
at org.junit.Assert.fail(Assert.java:89)
at org.junit.Assert.failNotEquals(Assert.java:835)
at org.junit.Assert.assertEquals(Assert.java:647)
at org.apache.solr.cloud.PackageManagerCLITest.run(PackageManagerCLITest.java:156)
at org.apache.solr.cloud.PackageManagerCLITest.testPackageManager(PackageManagerCLITest.java:83)
at java.base/jdk.internal.reflect.DirectMethodHandleAccessor.invoke(DirectMethodHandleAccessor.java:103)
at java.base/java.lang.reflect.Method.invoke(Method.java:580)
at com.carrotsearch.randomizedtesting.RandomizedRunner.invoke(RandomizedRunner.java:1758)
at com.carrotsearch.randomizedtesting.RandomizedRunner$8.evaluate(RandomizedRunner.java:946)
at com.carrotsearch.randomizedtesting.RandomizedRunner$9.evaluate(RandomizedRunner.java:982)
at com.carrotsearch.randomizedtesting.RandomizedRunner$10.evaluate(RandomizedRunner.java:996)
at com.carrotsearch.randomizedtesting.rules.SystemPropertiesRestoreRule$1.evaluate(SystemPropertiesRestoreRule.java:80)
at org.junit.rules.RunRules.evaluate(RunRules.java:20)
at org.apache.lucene.util.TestRuleSetupTeardownChained$1.evaluate(TestRuleSetupTeardownChained.java:49)
at org.apache.lucene.util.AbstractBeforeAfterRule$1.evaluate(AbstractBeforeAfterRule.java:45)
at org.apache.lucene.util.TestRuleThreadAndTestName$1.evaluate(TestRuleThreadAndTestName.java:48)
at org.apache.lucene.util.TestRuleIgnoreAfterMaxFailures$1.evaluate(TestRuleIgnoreAfterMaxFailures.java:64)
at org.apache.lucene.util.TestRuleMarkFailure$1.evaluate(TestRuleMarkFailure.java:47)
at org.junit.rules.RunRules.evaluate(RunRules.java:20)
at com.carrotsearch.randomizedtesting.rules.StatementAdapter.evaluate(StatementAdapter.java:36)
at com.carrotsearch.randomizedtesting.ThreadLeakControl$StatementRunner.run(ThreadLeakControl.java:390)
at com.carrotsearch.randomizedtesting.ThreadLeakControl.forkTimeoutingTask(ThreadLeakControl.java:843)
at com.carrotsearch.randomizedtesting.ThreadLeakControl$3.evaluate(ThreadLeakControl.java:490)
at com.carrotsearch.randomizedtesting.RandomizedRunner.runSingleTest(RandomizedRunner.java:955)
at com.carrotsearch.randomizedtesting.RandomizedRunner$5.evaluate(RandomizedRunner.java:840)
at com.carrotsearch.randomizedtesting.RandomizedRunner$6.evaluate(RandomizedRunner.java:891)
at com.carrotsearch.randomizedtesting.RandomizedRunner$7.evaluate(RandomizedRunner.java:902)
at com.carrotsearch.randomizedtesting.rules.StatementAdapter.evaluate(StatementAdapter.java:36)
at com.carrotsearch.randomizedtesting.rules.SystemPropertiesRestoreRule$1.evaluate(SystemPropertiesRestoreRule.java:80)
at org.junit.rules.RunRules.evaluate(RunRules.java:20)
at org.apache.lucene.util.AbstractBeforeAfterRule$1.evaluate(AbstractBeforeAfterRule.java:45)
at com.carrotsearch.randomizedtesting.rules.StatementAdapter.evaluate(StatementAdapter.java:36)
at org.apache.lucene.util.TestRuleStoreClassName$1.evaluate(TestRuleStoreClassName.java:41)
at com.carrotsearch.randomizedtesting.rules.NoShadowingOrOverridesOnMethodsRule$1.evaluate(NoShadowingOrOverridesOnMethodsRule.java:40)
at com.carrotsearch.randomizedtesting.rules.NoShadowingOrOverridesOnMethodsRule$1.evaluate(NoShadowingOrOverridesOnMethodsRule.java:40)
at com.carrotsearch.randomizedtesting.rules.StatementAdapter.evaluate(StatementAdapter.java:36)
at com.carrotsearch.randomizedtesting.rules.StatementAdapter.evaluate(StatementAdapter.java:36)
at org.apache.lucene.util.TestRuleAssertionsRequired$1.evaluate(TestRuleAssertionsRequired.java:53)
at org.apache.lucene.util.TestRuleMarkFailure$1.evaluate(TestRuleMarkFailure.java:47)
at org.apache.lucene.util.TestRuleIgnoreAfterMaxFailures$1.evaluate(TestRuleIgnoreAfterMaxFailures.java:64)
at org.apache.lucene.util.TestRuleIgnoreTestSuites$1.evaluate(TestRuleIgnoreTestSuites.java:54)
at org.junit.rules.RunRules.evaluate(RunRules.java:20)
at com.carrotsearch.randomizedtesting.rules.StatementAdapter.evaluate(StatementAdapter.java:36)
at com.carrotsearch.randomizedtesting.ThreadLeakControl$StatementRunner.run(ThreadLeakControl.java:390)
at com.carrotsearch.randomizedtesting.ThreadLeakControl.lambda$forkTimeoutingTask$0(ThreadLeakControl.java:850)
at java.base/java.lang.Thread.run(Thread.java:1570)
FAILED: org.apache.solr.cloud.PackageManagerCLITest.testPackageManager
Error Message:
Non-zero status returned for: [-solrUrl, http://127.0.0.1:51151/solr, install, question-answer:1.0.0] expected:<0> but was:<1>
Stack Trace:
java.lang.AssertionError: Non-zero status returned for: [-solrUrl, http://127.0.0.1:51151/solr, install, question-answer:1.0.0] expected:<0> but was:<1>
at __randomizedtesting.SeedInfo.seed([F75DE56C210DA983:F4F7AE0223E37628]:0)
at org.junit.Assert.fail(Assert.java:89)
at org.junit.Assert.failNotEquals(Assert.java:835)
at org.junit.Assert.assertEquals(Assert.java:647)
at org.apache.solr.cloud.PackageManagerCLITest.run(PackageManagerCLITest.java:156)
at org.apache.solr.cloud.PackageManagerCLITest.testPackageManager(PackageManagerCLITest.java:83)
at java.base/jdk.internal.reflect.DirectMethodHandleAccessor.invoke(DirectMethodHandleAccessor.java:103)
at java.base/java.lang.reflect.Method.invoke(Method.java:580)
at com.carrotsearch.randomizedtesting.RandomizedRunner.invoke(RandomizedRunner.java:1758)
at com.carrotsearch.randomizedtesting.RandomizedRunner$8.evaluate(RandomizedRunner.java:946)
at com.carrotsearch.randomizedtesting.RandomizedRunner$9.evaluate(RandomizedRunner.java:982)
at com.carrotsearch.randomizedtesting.RandomizedRunner$10.evaluate(RandomizedRunner.java:996)
at com.carrotsearch.randomizedtesting.rules.SystemPropertiesRestoreRule$1.evaluate(SystemPropertiesRestoreRule.java:80)
at org.junit.rules.RunRules.evaluate(RunRules.java:20)
at org.apache.lucene.util.TestRuleSetupTeardownChained$1.evaluate(TestRuleSetupTeardownChained.java:49)
at org.apache.lucene.util.AbstractBeforeAfterRule$1.evaluate(AbstractBeforeAfterRule.java:45)
at org.apache.lucene.util.TestRuleThreadAndTestName$1.evaluate(TestRuleThreadAndTestName.java:48)
at org.apache.lucene.util.TestRuleIgnoreAfterMaxFailures$1.evaluate(TestRuleIgnoreAfterMaxFailures.java:64)
at org.apache.lucene.util.TestRuleMarkFailure$1.evaluate(TestRuleMarkFailure.java:47)
at org.junit.rules.RunRules.evaluate(RunRules.java:20)
at com.carrotsearch.randomizedtesting.rules.StatementAdapter.evaluate(StatementAdapter.java:36)
at com.carrotsearch.randomizedtesting.ThreadLeakControl$StatementRunner.run(ThreadLeakControl.java:390)
at com.carrotsearch.randomizedtesting.ThreadLeakControl.forkTimeoutingTask(ThreadLeakControl.java:843)
at com.carrotsearch.randomizedtesting.ThreadLeakControl$3.evaluate(ThreadLeakControl.java:490)
at com.carrotsearch.randomizedtesting.RandomizedRunner.runSingleTest(RandomizedRunner.java:955)
at com.carrotsearch.randomizedtesting.RandomizedRunner$5.evaluate(RandomizedRunner.java:840)
at com.carrotsearch.randomizedtesting.RandomizedRunner$6.evaluate(RandomizedRunner.java:891)
at com.carrotsearch.randomizedtesting.RandomizedRunner$7.evaluate(RandomizedRunner.java:902)
at com.carrotsearch.randomizedtesting.rules.StatementAdapter.evaluate(StatementAdapter.java:36)
at com.carrotsearch.randomizedtesting.rules.SystemPropertiesRestoreRule$1.evaluate(SystemPropertiesRestoreRule.java:80)
at org.junit.rules.RunRules.evaluate(RunRules.java:20)
at org.apache.lucene.util.AbstractBeforeAfterRule$1.evaluate(AbstractBeforeAfterRule.java:45)
at com.carrotsearch.randomizedtesting.rules.StatementAdapter.evaluate(StatementAdapter.java:36)
at org.apache.lucene.util.TestRuleStoreClassName$1.evaluate(TestRuleStoreClassName.java:41)
at com.carrotsearch.randomizedtesting.rules.NoShadowingOrOverridesOnMethodsRule$1.evaluate(NoShadowingOrOverridesOnMethodsRule.java:40)
at com.carrotsearch.randomizedtesting.rules.NoShadowingOrOverridesOnMethodsRule$1.evaluate(NoShadowingOrOverridesOnMethodsRule.java:40)
at com.carrotsearch.randomizedtesting.rules.StatementAdapter.evaluate(StatementAdapter.java:36)
at com.carrotsearch.randomizedtesting.rules.StatementAdapter.evaluate(StatementAdapter.java:36)
at org.apache.lucene.util.TestRuleAssertionsRequired$1.evaluate(TestRuleAssertionsRequired.java:53)
at org.apache.lucene.util.TestRuleMarkFailure$1.evaluate(TestRuleMarkFailure.java:47)
at org.apache.lucene.util.TestRuleIgnoreAfterMaxFailures$1.evaluate(TestRuleIgnoreAfterMaxFailures.java:64)
at org.apache.lucene.util.TestRuleIgnoreTestSuites$1.evaluate(TestRuleIgnoreTestSuites.java:54)
at org.junit.rules.RunRules.evaluate(RunRules.java:20)
at com.carrotsearch.randomizedtesting.rules.StatementAdapter.evaluate(StatementAdapter.java:36)
at com.carrotsearch.randomizedtesting.ThreadLeakControl$StatementRunner.run(ThreadLeakControl.java:390)
at com.carrotsearch.randomizedtesting.ThreadLeakControl.lambda$forkTimeoutingTask$0(ThreadLeakControl.java:850)
at java.base/java.lang.Thread.run(Thread.java:1570)
FAILED: org.apache.solr.cloud.PackageManagerCLITest.testPackageManager
Error Message:
Non-zero status returned for: [-solrUrl, http://127.0.0.1:61655/solr, install, question-answer:1.0.0] expected:<0> but was:<1>
Stack Trace:
java.lang.AssertionError: Non-zero status returned for: [-solrUrl, http://127.0.0.1:61655/solr, install, question-answer:1.0.0] expected:<0> but was:<1>
at __randomizedtesting.SeedInfo.seed([F75DE56C210DA983:F4F7AE0223E37628]:0)
at org.junit.Assert.fail(Assert.java:89)
at org.junit.Assert.failNotEquals(Assert.java:835)
at org.junit.Assert.assertEquals(Assert.java:647)
at org.apache.solr.cloud.PackageManagerCLITest.run(PackageManagerCLITest.java:156)
at org.apache.solr.cloud.PackageManagerCLITest.testPackageManager(PackageManagerCLITest.java:83)
at java.base/jdk.internal.reflect.DirectMethodHandleAccessor.invoke(DirectMethodHandleAccessor.java:103)
at java.base/java.lang.reflect.Method.invoke(Method.java:580)
at com.carrotsearch.randomizedtesting.RandomizedRunner.invoke(RandomizedRunner.java:1758)
at com.carrotsearch.randomizedtesting.RandomizedRunner$8.evaluate(RandomizedRunner.java:946)
at com.carrotsearch.randomizedtesting.RandomizedRunner$9.evaluate(RandomizedRunner.java:982)
at com.carrotsearch.randomizedtesting.RandomizedRunner$10.evaluate(RandomizedRunner.java:996)
at com.carrotsearch.randomizedtesting.rules.SystemPropertiesRestoreRule$1.evaluate(SystemPropertiesRestoreRule.java:80)
at org.junit.rules.RunRules.evaluate(RunRules.java:20)
at org.apache.lucene.util.TestRuleSetupTeardownChained$1.evaluate(TestRuleSetupTeardownChained.java:49)
at org.apache.lucene.util.AbstractBeforeAfterRule$1.evaluate(AbstractBeforeAfterRule.java:45)
at org.apache.lucene.util.TestRuleThreadAndTestName$1.evaluate(TestRuleThreadAndTestName.java:48)
at org.apache.lucene.util.TestRuleIgnoreAfterMaxFailures$1.evaluate(TestRuleIgnoreAfterMaxFailures.java:64)
at org.apache.lucene.util.TestRuleMarkFailure$1.evaluate(TestRuleMarkFailure.java:47)
at org.junit.rules.RunRules.evaluate(RunRules.java:20)
at com.carrotsearch.randomizedtesting.rules.StatementAdapter.evaluate(StatementAdapter.java:36)
at com.carrotsearch.randomizedtesting.ThreadLeakControl$StatementRunner.run(ThreadLeakControl.java:390)
at com.carrotsearch.randomizedtesting.ThreadLeakControl.forkTimeoutingTask(ThreadLeakControl.java:843)
at com.carrotsearch.randomizedtesting.ThreadLeakControl$3.evaluate(ThreadLeakControl.java:490)
at com.carrotsearch.randomizedtesting.RandomizedRunner.runSingleTest(RandomizedRunner.java:955)
at com.carrotsearch.randomizedtesting.RandomizedRunner$5.evaluate(RandomizedRunner.java:840)
at com.carrotsearch.randomizedtesting.RandomizedRunner$6.evaluate(RandomizedRunner.java:891)
at com.carrotsearch.randomizedtesting.RandomizedRunner$7.evaluate(RandomizedRunner.java:902)
at com.carrotsearch.randomizedtesting.rules.StatementAdapter.evaluate(StatementAdapter.java:36)
at com.carrotsearch.randomizedtesting.rules.SystemPropertiesRestoreRule$1.evaluate(SystemPropertiesRestoreRule.java:80)
at org.junit.rules.RunRules.evaluate(RunRules.java:20)
at org.apache.lucene.util.AbstractBeforeAfterRule$1.evaluate(AbstractBeforeAfterRule.java:45)
at com.carrotsearch.randomizedtesting.rules.StatementAdapter.evaluate(StatementAdapter.java:36)
at org.apache.lucene.util.TestRuleStoreClassName$1.evaluate(TestRuleStoreClassName.java:41)
at com.carrotsearch.randomizedtesting.rules.NoShadowingOrOverridesOnMethodsRule$1.evaluate(NoShadowingOrOverridesOnMethodsRule.java:40)
at com.carrotsearch.randomizedtesting.rules.NoShadowingOrOverridesOnMethodsRule$1.evaluate(NoShadowingOrOverridesOnMethodsRule.java:40)
at com.carrotsearch.randomizedtesting.rules.StatementAdapter.evaluate(StatementAdapter.java:36)
at com.carrotsearch.randomizedtesting.rules.StatementAdapter.evaluate(StatementAdapter.java:36)
at org.apache.lucene.util.TestRuleAssertionsRequired$1.evaluate(TestRuleAssertionsRequired.java:53)
at org.apache.lucene.util.TestRuleMarkFailure$1.evaluate(TestRuleMarkFailure.java:47)
at org.apache.lucene.util.TestRuleIgnoreAfterMaxFailures$1.evaluate(TestRuleIgnoreAfterMaxFailures.java:64)
at org.apache.lucene.util.TestRuleIgnoreTestSuites$1.evaluate(TestRuleIgnoreTestSuites.java:54)
at org.junit.rules.RunRules.evaluate(RunRules.java:20)
at com.carrotsearch.randomizedtesting.rules.StatementAdapter.evaluate(StatementAdapter.java:36)
at com.carrotsearch.randomizedtesting.ThreadLeakControl$StatementRunner.run(ThreadLeakControl.java:390)
at com.carrotsearch.randomizedtesting.ThreadLeakControl.lambda$forkTimeoutingTask$0(ThreadLeakControl.java:850)
at java.base/java.lang.Thread.run(Thread.java:1570)
FAILED: org.apache.solr.filestore.TestDistribPackageStore.testPackageStoreManagement
Error Message:
Expected: a string containing "Signature does not match" but: was "Error from server at https://127.0.0.1:51300/solr: Error parsing public keys in Package store: {responseHeader={status=500,QTime=15},error={metadata={error-class=org.apache.solr.common.SolrException,root-error-class=org.apache.solr.common.SolrException},msg=Error parsing public keys in Package store,trace=org.apache.solr.common.SolrException: Error parsing public keys in Package store at org.apache.solr.filestore.PackageStoreAPI$FSWrite.validate(PackageStoreAPI.java:250) at org.apache.solr.filestore.PackageStoreAPI$FSWrite.readSignatures(PackageStoreAPI.java:235) at org.apache.solr.filestore.PackageStoreAPI$FSWrite.upload(PackageStoreAPI.java:203) at org.apache.solr.api.AnnotatedApi$Cmd.invoke(AnnotatedApi.java:299) at org.apache.solr.api.AnnotatedApi.call(AnnotatedApi.java:175) at org.apache.solr.api.V2HttpCall.handleAdmin(V2HttpCall.java:341) at org.apache.solr.servlet.HttpSolrCall.handleAdminRequest(HttpSolrCall.java:807) at org.apache.solr.servlet.HttpSolrCall.call(HttpSolrCall.java:545) at org.apache.solr.servlet.SolrDispatchFilter.doFilter(SolrDispatchFilter.java:437) at org.apache.solr.servlet.SolrDispatchFilter.doFilter(SolrDispatchFilter.java:367) at org.eclipse.jetty.servlet.FilterHolder.doFilter(FilterHolder.java:193) at org.eclipse.jetty.servlet.ServletHandler$Chain.doFilter(ServletHandler.java:1626) at org.apache.solr.client.solrj.embedded.JettySolrRunner$DebugFilter.doFilter(JettySolrRunner.java:166) at org.eclipse.jetty.servlet.FilterHolder.doFilter(FilterHolder.java:193) at org.eclipse.jetty.servlet.ServletHandler$Chain.doFilter(ServletHandler.java:1626) at org.eclipse.jetty.servlet.ServletHandler.doHandle(ServletHandler.java:552) at org.eclipse.jetty.server.handler.ScopedHandler.nextHandle(ScopedHandler.java:233) at org.eclipse.jetty.server.session.SessionHandler.doHandle(SessionHandler.java:1624) at org.eclipse.jetty.server.handler.ScopedHandler.nextHandle(ScopedHandler.java:233) at org.eclipse.jetty.server.handler.ContextHandler.doHandle(ContextHandler.java:1440) at org.eclipse.jetty.server.handler.ScopedHandler.nextScope(ScopedHandler.java:188) at org.eclipse.jetty.servlet.ServletHandler.doScope(ServletHandler.java:505) at org.eclipse.jetty.server.session.SessionHandler.doScope(SessionHandler.java:1594) at org.eclipse.jetty.server.handler.ScopedHandler.nextScope(ScopedHandler.java:186) at org.eclipse.jetty.server.handler.ContextHandler.doScope(ContextHandler.java:1355) at org.eclipse.jetty.server.handler.ScopedHandler.handle(ScopedHandler.java:141) at org.eclipse.jetty.server.handler.HandlerWrapper.handle(HandlerWrapper.java:127) at org.eclipse.jetty.rewrite.handler.RewriteHandler.handle(RewriteHandler.java:322) at org.eclipse.jetty.server.handler.gzip.GzipHandler.handle(GzipHandler.java:722) at org.eclipse.jetty.server.handler.HandlerWrapper.handle(HandlerWrapper.java:127) at org.eclipse.jetty.server.Server.handle(Server.java:516) at org.eclipse.jetty.server.HttpChannel.lambda$handle$1(HttpChannel.java:487) at org.eclipse.jetty.server.HttpChannel.dispatch(HttpChannel.java:732) at org.eclipse.jetty.server.HttpChannel.handle(HttpChannel.java:479) at org.eclipse.jetty.server.HttpConnection.onFillable(HttpConnection.java:277) at org.eclipse.jetty.io.AbstractConnection$ReadCallback.succeeded(AbstractConnection.java:311) at org.eclipse.jetty.io.FillInterest.fillable(FillInterest.java:105) at org.eclipse.jetty.io.ssl.SslConnection$1.run(SslConnection.java:149) at org.eclipse.jetty.util.thread.QueuedThreadPool.runJob(QueuedThreadPool.java:883) at org.eclipse.jetty.util.thread.QueuedThreadPool$Runner.run(QueuedThreadPool.java:1034) at java.base/java.lang.Thread.run(Thread.java:1570) ,code=500}}"
Stack Trace:
java.lang.AssertionError:
Expected: a string containing "Signature does not match"
but: was "Error from server at https://127.0.0.1:51300/solr: Error parsing public keys in Package store: {responseHeader={status=500,QTime=15},error={metadata={error-class=org.apache.solr.common.SolrException,root-error-class=org.apache.solr.common.SolrException},msg=Error parsing public keys in Package store,trace=org.apache.solr.common.SolrException: Error parsing public keys in Package store
at org.apache.solr.filestore.PackageStoreAPI$FSWrite.validate(PackageStoreAPI.java:250)
at org.apache.solr.filestore.PackageStoreAPI$FSWrite.readSignatures(PackageStoreAPI.java:235)
at org.apache.solr.filestore.PackageStoreAPI$FSWrite.upload(PackageStoreAPI.java:203)
at org.apache.solr.api.AnnotatedApi$Cmd.invoke(AnnotatedApi.java:299)
at org.apache.solr.api.AnnotatedApi.call(AnnotatedApi.java:175)
at org.apache.solr.api.V2HttpCall.handleAdmin(V2HttpCall.java:341)
at org.apache.solr.servlet.HttpSolrCall.handleAdminRequest(HttpSolrCall.java:807)
at org.apache.solr.servlet.HttpSolrCall.call(HttpSolrCall.java:545)
at org.apache.solr.servlet.SolrDispatchFilter.doFilter(SolrDispatchFilter.java:437)
at org.apache.solr.servlet.SolrDispatchFilter.doFilter(SolrDispatchFilter.java:367)
at org.eclipse.jetty.servlet.FilterHolder.doFilter(FilterHolder.java:193)
at org.eclipse.jetty.servlet.ServletHandler$Chain.doFilter(ServletHandler.java:1626)
at org.apache.solr.client.solrj.embedded.JettySolrRunner$DebugFilter.doFilter(JettySolrRunner.java:166)
at org.eclipse.jetty.servlet.FilterHolder.doFilter(FilterHolder.java:193)
at org.eclipse.jetty.servlet.ServletHandler$Chain.doFilter(ServletHandler.java:1626)
at org.eclipse.jetty.servlet.ServletHandler.doHandle(ServletHandler.java:552)
at org.eclipse.jetty.server.handler.ScopedHandler.nextHandle(ScopedHandler.java:233)
at org.eclipse.jetty.server.session.SessionHandler.doHandle(SessionHandler.java:1624)
at org.eclipse.jetty.server.handler.ScopedHandler.nextHandle(ScopedHandler.java:233)
at org.eclipse.jetty.server.handler.ContextHandler.doHandle(ContextHandler.java:1440)
at org.eclipse.jetty.server.handler.ScopedHandler.nextScope(ScopedHandler.java:188)
at org.eclipse.jetty.servlet.ServletHandler.doScope(ServletHandler.java:505)
at org.eclipse.jetty.server.session.SessionHandler.doScope(SessionHandler.java:1594)
at org.eclipse.jetty.server.handler.ScopedHandler.nextScope(ScopedHandler.java:186)
at org.eclipse.jetty.server.handler.ContextHandler.doScope(ContextHandler.java:1355)
at org.eclipse.jetty.server.handler.ScopedHandler.handle(ScopedHandler.java:141)
at org.eclipse.jetty.server.handler.HandlerWrapper.handle(HandlerWrapper.java:127)
at org.eclipse.jetty.rewrite.handler.RewriteHandler.handle(RewriteHandler.java:322)
at org.eclipse.jetty.server.handler.gzip.GzipHandler.handle(GzipHandler.java:722)
at org.eclipse.jetty.server.handler.HandlerWrapper.handle(HandlerWrapper.java:127)
at org.eclipse.jetty.server.Server.handle(Server.java:516)
at org.eclipse.jetty.server.HttpChannel.lambda$handle$1(HttpChannel.java:487)
at org.eclipse.jetty.server.HttpChannel.dispatch(HttpChannel.java:732)
at org.eclipse.jetty.server.HttpChannel.handle(HttpChannel.java:479)
at org.eclipse.jetty.server.HttpConnection.onFillable(HttpConnection.java:277)
at org.eclipse.jetty.io.AbstractConnection$ReadCallback.succeeded(AbstractConnection.java:311)
at org.eclipse.jetty.io.FillInterest.fillable(FillInterest.java:105)
at org.eclipse.jetty.io.ssl.SslConnection$1.run(SslConnection.java:149)
at org.eclipse.jetty.util.thread.QueuedThreadPool.runJob(QueuedThreadPool.java:883)
at org.eclipse.jetty.util.thread.QueuedThreadPool$Runner.run(QueuedThreadPool.java:1034)
at java.base/java.lang.Thread.run(Thread.java:1570)
,code=500}}"
at __randomizedtesting.SeedInfo.seed([F75DE56C210DA983:F2E76646ECF8C9DC]:0)
at org.hamcrest.MatcherAssert.assertThat(MatcherAssert.java:20)
at org.junit.Assert.assertThat(Assert.java:964)
at org.junit.Assert.assertThat(Assert.java:930)
at org.apache.solr.filestore.TestDistribPackageStore.testPackageStoreManagement(TestDistribPackageStore.java:94)
at java.base/jdk.internal.reflect.DirectMethodHandleAccessor.invoke(DirectMethodHandleAccessor.java:103)
at java.base/java.lang.reflect.Method.invoke(Method.java:580)
at com.carrotsearch.randomizedtesting.RandomizedRunner.invoke(RandomizedRunner.java:1758)
at com.carrotsearch.randomizedtesting.RandomizedRunner$8.evaluate(RandomizedRunner.java:946)
at com.carrotsearch.randomizedtesting.RandomizedRunner$9.evaluate(RandomizedRunner.java:982)
at com.carrotsearch.randomizedtesting.RandomizedRunner$10.evaluate(RandomizedRunner.java:996)
at com.carrotsearch.randomizedtesting.rules.SystemPropertiesRestoreRule$1.evaluate(SystemPropertiesRestoreRule.java:80)
at org.junit.rules.RunRules.evaluate(RunRules.java:20)
at org.apache.lucene.util.TestRuleSetupTeardownChained$1.evaluate(TestRuleSetupTeardownChained.java:49)
at org.apache.lucene.util.AbstractBeforeAfterRule$1.evaluate(AbstractBeforeAfterRule.java:45)
at org.apache.lucene.util.TestRuleThreadAndTestName$1.evaluate(TestRuleThreadAndTestName.java:48)
at org.apache.lucene.util.TestRuleIgnoreAfterMaxFailures$1.evaluate(TestRuleIgnoreAfterMaxFailures.java:64)
at org.apache.lucene.util.TestRuleMarkFailure$1.evaluate(TestRuleMarkFailure.java:47)
at org.junit.rules.RunRules.evaluate(RunRules.java:20)
at com.carrotsearch.randomizedtesting.rules.StatementAdapter.evaluate(StatementAdapter.java:36)
at com.carrotsearch.randomizedtesting.ThreadLeakControl$StatementRunner.run(ThreadLeakControl.java:390)
at com.carrotsearch.randomizedtesting.ThreadLeakControl.forkTimeoutingTask(ThreadLeakControl.java:843)
at com.carrotsearch.randomizedtesting.ThreadLeakControl$3.evaluate(ThreadLeakControl.java:490)
at com.carrotsearch.randomizedtesting.RandomizedRunner.runSingleTest(RandomizedRunner.java:955)
at com.carrotsearch.randomizedtesting.RandomizedRunner$5.evaluate(RandomizedRunner.java:840)
at com.carrotsearch.randomizedtesting.RandomizedRunner$6.evaluate(RandomizedRunner.java:891)
at com.carrotsearch.randomizedtesting.RandomizedRunner$7.evaluate(RandomizedRunner.java:902)
at com.carrotsearch.randomizedtesting.rules.StatementAdapter.evaluate(StatementAdapter.java:36)
at com.carrotsearch.randomizedtesting.rules.SystemPropertiesRestoreRule$1.evaluate(SystemPropertiesRestoreRule.java:80)
at org.junit.rules.RunRules.evaluate(RunRules.java:20)
at org.apache.lucene.util.AbstractBeforeAfterRule$1.evaluate(AbstractBeforeAfterRule.java:45)
at com.carrotsearch.randomizedtesting.rules.StatementAdapter.evaluate(StatementAdapter.java:36)
at org.apache.lucene.util.TestRuleStoreClassName$1.evaluate(TestRuleStoreClassName.java:41)
at com.carrotsearch.randomizedtesting.rules.NoShadowingOrOverridesOnMethodsRule$1.evaluate(NoShadowingOrOverridesOnMethodsRule.java:40)
at com.carrotsearch.randomizedtesting.rules.NoShadowingOrOverridesOnMethodsRule$1.evaluate(NoShadowingOrOverridesOnMethodsRule.java:40)
at com.carrotsearch.randomizedtesting.rules.StatementAdapter.evaluate(StatementAdapter.java:36)
at com.carrotsearch.randomizedtesting.rules.StatementAdapter.evaluate(StatementAdapter.java:36)
at org.apache.lucene.util.TestRuleAssertionsRequired$1.evaluate(TestRuleAssertionsRequired.java:53)
at org.apache.lucene.util.TestRuleMarkFailure$1.evaluate(TestRuleMarkFailure.java:47)
at org.apache.lucene.util.TestRuleIgnoreAfterMaxFailures$1.evaluate(TestRuleIgnoreAfterMaxFailures.java:64)
at org.apache.lucene.util.TestRuleIgnoreTestSuites$1.evaluate(TestRuleIgnoreTestSuites.java:54)
at org.junit.rules.RunRules.evaluate(RunRules.java:20)
at com.carrotsearch.randomizedtesting.rules.StatementAdapter.evaluate(StatementAdapter.java:36)
at com.carrotsearch.randomizedtesting.ThreadLeakControl$StatementRunner.run(ThreadLeakControl.java:390)
at com.carrotsearch.randomizedtesting.ThreadLeakControl.lambda$forkTimeoutingTask$0(ThreadLeakControl.java:850)
at java.base/java.lang.Thread.run(Thread.java:1570)
FAILED: org.apache.solr.filestore.TestDistribPackageStore.testPackageStoreManagement
Error Message:
Expected: a string containing "Signature does not match" but: was "Error from server at https://127.0.0.1:51380/solr: Error parsing public keys in Package store: {responseHeader={status=500,QTime=8},error={metadata={error-class=org.apache.solr.common.SolrException,root-error-class=org.apache.solr.common.SolrException},msg=Error parsing public keys in Package store,trace=org.apache.solr.common.SolrException: Error parsing public keys in Package store at org.apache.solr.filestore.PackageStoreAPI$FSWrite.validate(PackageStoreAPI.java:250) at org.apache.solr.filestore.PackageStoreAPI$FSWrite.readSignatures(PackageStoreAPI.java:235) at org.apache.solr.filestore.PackageStoreAPI$FSWrite.upload(PackageStoreAPI.java:203) at org.apache.solr.api.AnnotatedApi$Cmd.invoke(AnnotatedApi.java:299) at org.apache.solr.api.AnnotatedApi.call(AnnotatedApi.java:175) at org.apache.solr.api.V2HttpCall.handleAdmin(V2HttpCall.java:341) at org.apache.solr.servlet.HttpSolrCall.handleAdminRequest(HttpSolrCall.java:807) at org.apache.solr.servlet.HttpSolrCall.call(HttpSolrCall.java:545) at org.apache.solr.servlet.SolrDispatchFilter.doFilter(SolrDispatchFilter.java:437) at org.apache.solr.servlet.SolrDispatchFilter.doFilter(SolrDispatchFilter.java:367) at org.eclipse.jetty.servlet.FilterHolder.doFilter(FilterHolder.java:193) at org.eclipse.jetty.servlet.ServletHandler$Chain.doFilter(ServletHandler.java:1626) at org.apache.solr.client.solrj.embedded.JettySolrRunner$DebugFilter.doFilter(JettySolrRunner.java:166) at org.eclipse.jetty.servlet.FilterHolder.doFilter(FilterHolder.java:193) at org.eclipse.jetty.servlet.ServletHandler$Chain.doFilter(ServletHandler.java:1626) at org.eclipse.jetty.servlet.ServletHandler.doHandle(ServletHandler.java:552) at org.eclipse.jetty.server.handler.ScopedHandler.nextHandle(ScopedHandler.java:233) at org.eclipse.jetty.server.session.SessionHandler.doHandle(SessionHandler.java:1624) at org.eclipse.jetty.server.handler.ScopedHandler.nextHandle(ScopedHandler.java:233) at org.eclipse.jetty.server.handler.ContextHandler.doHandle(ContextHandler.java:1440) at org.eclipse.jetty.server.handler.ScopedHandler.nextScope(ScopedHandler.java:188) at org.eclipse.jetty.servlet.ServletHandler.doScope(ServletHandler.java:505) at org.eclipse.jetty.server.session.SessionHandler.doScope(SessionHandler.java:1594) at org.eclipse.jetty.server.handler.ScopedHandler.nextScope(ScopedHandler.java:186) at org.eclipse.jetty.server.handler.ContextHandler.doScope(ContextHandler.java:1355) at org.eclipse.jetty.server.handler.ScopedHandler.handle(ScopedHandler.java:141) at org.eclipse.jetty.server.handler.HandlerWrapper.handle(HandlerWrapper.java:127) at org.eclipse.jetty.rewrite.handler.RewriteHandler.handle(RewriteHandler.java:322) at org.eclipse.jetty.server.handler.gzip.GzipHandler.handle(GzipHandler.java:722) at org.eclipse.jetty.server.handler.HandlerWrapper.handle(HandlerWrapper.java:127) at org.eclipse.jetty.server.Server.handle(Server.java:516) at org.eclipse.jetty.server.HttpChannel.lambda$handle$1(HttpChannel.java:487) at org.eclipse.jetty.server.HttpChannel.dispatch(HttpChannel.java:732) at org.eclipse.jetty.server.HttpChannel.handle(HttpChannel.java:479) at org.eclipse.jetty.server.HttpConnection.onFillable(HttpConnection.java:277) at org.eclipse.jetty.io.AbstractConnection$ReadCallback.succeeded(AbstractConnection.java:311) at org.eclipse.jetty.io.FillInterest.fillable(FillInterest.java:105) at org.eclipse.jetty.io.ssl.SslConnection$1.run(SslConnection.java:149) at org.eclipse.jetty.util.thread.QueuedThreadPool.runJob(QueuedThreadPool.java:883) at org.eclipse.jetty.util.thread.QueuedThreadPool$Runner.run(QueuedThreadPool.java:1034) at java.base/java.lang.Thread.run(Thread.java:1570) ,code=500}}"
Stack Trace:
java.lang.AssertionError:
Expected: a string containing "Signature does not match"
but: was "Error from server at https://127.0.0.1:51380/solr: Error parsing public keys in Package store: {responseHeader={status=500,QTime=8},error={metadata={error-class=org.apache.solr.common.SolrException,root-error-class=org.apache.solr.common.SolrException},msg=Error parsing public keys in Package store,trace=org.apache.solr.common.SolrException: Error parsing public keys in Package store
at org.apache.solr.filestore.PackageStoreAPI$FSWrite.validate(PackageStoreAPI.java:250)
at org.apache.solr.filestore.PackageStoreAPI$FSWrite.readSignatures(PackageStoreAPI.java:235)
at org.apache.solr.filestore.PackageStoreAPI$FSWrite.upload(PackageStoreAPI.java:203)
at org.apache.solr.api.AnnotatedApi$Cmd.invoke(AnnotatedApi.java:299)
at org.apache.solr.api.AnnotatedApi.call(AnnotatedApi.java:175)
at org.apache.solr.api.V2HttpCall.handleAdmin(V2HttpCall.java:341)
at org.apache.solr.servlet.HttpSolrCall.handleAdminRequest(HttpSolrCall.java:807)
at org.apache.solr.servlet.HttpSolrCall.call(HttpSolrCall.java:545)
at org.apache.solr.servlet.SolrDispatchFilter.doFilter(SolrDispatchFilter.java:437)
at org.apache.solr.servlet.SolrDispatchFilter.doFilter(SolrDispatchFilter.java:367)
at org.eclipse.jetty.servlet.FilterHolder.doFilter(FilterHolder.java:193)
at org.eclipse.jetty.servlet.ServletHandler$Chain.doFilter(ServletHandler.java:1626)
at org.apache.solr.client.solrj.embedded.JettySolrRunner$DebugFilter.doFilter(JettySolrRunner.java:166)
at org.eclipse.jetty.servlet.FilterHolder.doFilter(FilterHolder.java:193)
at org.eclipse.jetty.servlet.ServletHandler$Chain.doFilter(ServletHandler.java:1626)
at org.eclipse.jetty.servlet.ServletHandler.doHandle(ServletHandler.java:552)
at org.eclipse.jetty.server.handler.ScopedHandler.nextHandle(ScopedHandler.java:233)
at org.eclipse.jetty.server.session.SessionHandler.doHandle(SessionHandler.java:1624)
at org.eclipse.jetty.server.handler.ScopedHandler.nextHandle(ScopedHandler.java:233)
at org.eclipse.jetty.server.handler.ContextHandler.doHandle(ContextHandler.java:1440)
at org.eclipse.jetty.server.handler.ScopedHandler.nextScope(ScopedHandler.java:188)
at org.eclipse.jetty.servlet.ServletHandler.doScope(ServletHandler.java:505)
at org.eclipse.jetty.server.session.SessionHandler.doScope(SessionHandler.java:1594)
at org.eclipse.jetty.server.handler.ScopedHandler.nextScope(ScopedHandler.java:186)
at org.eclipse.jetty.server.handler.ContextHandler.doScope(ContextHandler.java:1355)
at org.eclipse.jetty.server.handler.ScopedHandler.handle(ScopedHandler.java:141)
at org.eclipse.jetty.server.handler.HandlerWrapper.handle(HandlerWrapper.java:127)
at org.eclipse.jetty.rewrite.handler.RewriteHandler.handle(RewriteHandler.java:322)
at org.eclipse.jetty.server.handler.gzip.GzipHandler.handle(GzipHandler.java:722)
at org.eclipse.jetty.server.handler.HandlerWrapper.handle(HandlerWrapper.java:127)
at org.eclipse.jetty.server.Server.handle(Server.java:516)
at org.eclipse.jetty.server.HttpChannel.lambda$handle$1(HttpChannel.java:487)
at org.eclipse.jetty.server.HttpChannel.dispatch(HttpChannel.java:732)
at org.eclipse.jetty.server.HttpChannel.handle(HttpChannel.java:479)
at org.eclipse.jetty.server.HttpConnection.onFillable(HttpConnection.java:277)
at org.eclipse.jetty.io.AbstractConnection$ReadCallback.succeeded(AbstractConnection.java:311)
at org.eclipse.jetty.io.FillInterest.fillable(FillInterest.java:105)
at org.eclipse.jetty.io.ssl.SslConnection$1.run(SslConnection.java:149)
at org.eclipse.jetty.util.thread.QueuedThreadPool.runJob(QueuedThreadPool.java:883)
at org.eclipse.jetty.util.thread.QueuedThreadPool$Runner.run(QueuedThreadPool.java:1034)
at java.base/java.lang.Thread.run(Thread.java:1570)
,code=500}}"
at __randomizedtesting.SeedInfo.seed([F75DE56C210DA983:F2E76646ECF8C9DC]:0)
at org.hamcrest.MatcherAssert.assertThat(MatcherAssert.java:20)
at org.junit.Assert.assertThat(Assert.java:964)
at org.junit.Assert.assertThat(Assert.java:930)
at org.apache.solr.filestore.TestDistribPackageStore.testPackageStoreManagement(TestDistribPackageStore.java:94)
at java.base/jdk.internal.reflect.DirectMethodHandleAccessor.invoke(DirectMethodHandleAccessor.java:103)
at java.base/java.lang.reflect.Method.invoke(Method.java:580)
at com.carrotsearch.randomizedtesting.RandomizedRunner.invoke(RandomizedRunner.java:1758)
at com.carrotsearch.randomizedtesting.RandomizedRunner$8.evaluate(RandomizedRunner.java:946)
at com.carrotsearch.randomizedtesting.RandomizedRunner$9.evaluate(RandomizedRunner.java:982)
at com.carrotsearch.randomizedtesting.RandomizedRunner$10.evaluate(RandomizedRunner.java:996)
at com.carrotsearch.randomizedtesting.rules.SystemPropertiesRestoreRule$1.evaluate(SystemPropertiesRestoreRule.java:80)
at org.junit.rules.RunRules.evaluate(RunRules.java:20)
at org.apache.lucene.util.TestRuleSetupTeardownChained$1.evaluate(TestRuleSetupTeardownChained.java:49)
at org.apache.lucene.util.AbstractBeforeAfterRule$1.evaluate(AbstractBeforeAfterRule.java:45)
at org.apache.lucene.util.TestRuleThreadAndTestName$1.evaluate(TestRuleThreadAndTestName.java:48)
at org.apache.lucene.util.TestRuleIgnoreAfterMaxFailures$1.evaluate(TestRuleIgnoreAfterMaxFailures.java:64)
at org.apache.lucene.util.TestRuleMarkFailure$1.evaluate(TestRuleMarkFailure.java:47)
at org.junit.rules.RunRules.evaluate(RunRules.java:20)
at com.carrotsearch.randomizedtesting.rules.StatementAdapter.evaluate(StatementAdapter.java:36)
at com.carrotsearch.randomizedtesting.ThreadLeakControl$StatementRunner.run(ThreadLeakControl.java:390)
at com.carrotsearch.randomizedtesting.ThreadLeakControl.forkTimeoutingTask(ThreadLeakControl.java:843)
at com.carrotsearch.randomizedtesting.ThreadLeakControl$3.evaluate(ThreadLeakControl.java:490)
at com.carrotsearch.randomizedtesting.RandomizedRunner.runSingleTest(RandomizedRunner.java:955)
at com.carrotsearch.randomizedtesting.RandomizedRunner$5.evaluate(RandomizedRunner.java:840)
at com.carrotsearch.randomizedtesting.RandomizedRunner$6.evaluate(RandomizedRunner.java:891)
at com.carrotsearch.randomizedtesting.RandomizedRunner$7.evaluate(RandomizedRunner.java:902)
at com.carrotsearch.randomizedtesting.rules.StatementAdapter.evaluate(StatementAdapter.java:36)
at com.carrotsearch.randomizedtesting.rules.SystemPropertiesRestoreRule$1.evaluate(SystemPropertiesRestoreRule.java:80)
at org.junit.rules.RunRules.evaluate(RunRules.java:20)
at org.apache.lucene.util.AbstractBeforeAfterRule$1.evaluate(AbstractBeforeAfterRule.java:45)
at com.carrotsearch.randomizedtesting.rules.StatementAdapter.evaluate(StatementAdapter.java:36)
at org.apache.lucene.util.TestRuleStoreClassName$1.evaluate(TestRuleStoreClassName.java:41)
at com.carrotsearch.randomizedtesting.rules.NoShadowingOrOverridesOnMethodsRule$1.evaluate(NoShadowingOrOverridesOnMethodsRule.java:40)
at com.carrotsearch.randomizedtesting.rules.NoShadowingOrOverridesOnMethodsRule$1.evaluate(NoShadowingOrOverridesOnMethodsRule.java:40)
at com.carrotsearch.randomizedtesting.rules.StatementAdapter.evaluate(StatementAdapter.java:36)
at com.carrotsearch.randomizedtesting.rules.StatementAdapter.evaluate(StatementAdapter.java:36)
at org.apache.lucene.util.TestRuleAssertionsRequired$1.evaluate(TestRuleAssertionsRequired.java:53)
at org.apache.lucene.util.TestRuleMarkFailure$1.evaluate(TestRuleMarkFailure.java:47)
at org.apache.lucene.util.TestRuleIgnoreAfterMaxFailures$1.evaluate(TestRuleIgnoreAfterMaxFailures.java:64)
at org.apache.lucene.util.TestRuleIgnoreTestSuites$1.evaluate(TestRuleIgnoreTestSuites.java:54)
at org.junit.rules.RunRules.evaluate(RunRules.java:20)
at com.carrotsearch.randomizedtesting.rules.StatementAdapter.evaluate(StatementAdapter.java:36)
at com.carrotsearch.randomizedtesting.ThreadLeakControl$StatementRunner.run(ThreadLeakControl.java:390)
at com.carrotsearch.randomizedtesting.ThreadLeakControl.lambda$forkTimeoutingTask$0(ThreadLeakControl.java:850)
at java.base/java.lang.Thread.run(Thread.java:1570)
FAILED: org.apache.solr.filestore.TestDistribPackageStore.testPackageStoreManagement
Error Message:
Expected: a string containing "Signature does not match" but: was "Error from server at https://127.0.0.1:51383/solr: Error parsing public keys in Package store: {responseHeader={status=500,QTime=15},error={metadata={error-class=org.apache.solr.common.SolrException,root-error-class=org.apache.solr.common.SolrException},msg=Error parsing public keys in Package store,trace=org.apache.solr.common.SolrException: Error parsing public keys in Package store at org.apache.solr.filestore.PackageStoreAPI$FSWrite.validate(PackageStoreAPI.java:250) at org.apache.solr.filestore.PackageStoreAPI$FSWrite.readSignatures(PackageStoreAPI.java:235) at org.apache.solr.filestore.PackageStoreAPI$FSWrite.upload(PackageStoreAPI.java:203) at org.apache.solr.api.AnnotatedApi$Cmd.invoke(AnnotatedApi.java:299) at org.apache.solr.api.AnnotatedApi.call(AnnotatedApi.java:175) at org.apache.solr.api.V2HttpCall.handleAdmin(V2HttpCall.java:341) at org.apache.solr.servlet.HttpSolrCall.handleAdminRequest(HttpSolrCall.java:807) at org.apache.solr.servlet.HttpSolrCall.call(HttpSolrCall.java:545) at org.apache.solr.servlet.SolrDispatchFilter.doFilter(SolrDispatchFilter.java:437) at org.apache.solr.servlet.SolrDispatchFilter.doFilter(SolrDispatchFilter.java:367) at org.eclipse.jetty.servlet.FilterHolder.doFilter(FilterHolder.java:193) at org.eclipse.jetty.servlet.ServletHandler$Chain.doFilter(ServletHandler.java:1626) at org.apache.solr.client.solrj.embedded.JettySolrRunner$DebugFilter.doFilter(JettySolrRunner.java:166) at org.eclipse.jetty.servlet.FilterHolder.doFilter(FilterHolder.java:193) at org.eclipse.jetty.servlet.ServletHandler$Chain.doFilter(ServletHandler.java:1626) at org.eclipse.jetty.servlet.ServletHandler.doHandle(ServletHandler.java:552) at org.eclipse.jetty.server.handler.ScopedHandler.nextHandle(ScopedHandler.java:233) at org.eclipse.jetty.server.session.SessionHandler.doHandle(SessionHandler.java:1624) at org.eclipse.jetty.server.handler.ScopedHandler.nextHandle(ScopedHandler.java:233) at org.eclipse.jetty.server.handler.ContextHandler.doHandle(ContextHandler.java:1440) at org.eclipse.jetty.server.handler.ScopedHandler.nextScope(ScopedHandler.java:188) at org.eclipse.jetty.servlet.ServletHandler.doScope(ServletHandler.java:505) at org.eclipse.jetty.server.session.SessionHandler.doScope(SessionHandler.java:1594) at org.eclipse.jetty.server.handler.ScopedHandler.nextScope(ScopedHandler.java:186) at org.eclipse.jetty.server.handler.ContextHandler.doScope(ContextHandler.java:1355) at org.eclipse.jetty.server.handler.ScopedHandler.handle(ScopedHandler.java:141) at org.eclipse.jetty.server.handler.HandlerWrapper.handle(HandlerWrapper.java:127) at org.eclipse.jetty.rewrite.handler.RewriteHandler.handle(RewriteHandler.java:322) at org.eclipse.jetty.server.handler.gzip.GzipHandler.handle(GzipHandler.java:722) at org.eclipse.jetty.server.handler.HandlerWrapper.handle(HandlerWrapper.java:127) at org.eclipse.jetty.server.Server.handle(Server.java:516) at org.eclipse.jetty.server.HttpChannel.lambda$handle$1(HttpChannel.java:487) at org.eclipse.jetty.server.HttpChannel.dispatch(HttpChannel.java:732) at org.eclipse.jetty.server.HttpChannel.handle(HttpChannel.java:479) at org.eclipse.jetty.server.HttpConnection.onFillable(HttpConnection.java:277) at org.eclipse.jetty.io.AbstractConnection$ReadCallback.succeeded(AbstractConnection.java:311) at org.eclipse.jetty.io.FillInterest.fillable(FillInterest.java:105) at org.eclipse.jetty.io.ssl.SslConnection$1.run(SslConnection.java:149) at org.eclipse.jetty.util.thread.QueuedThreadPool.runJob(QueuedThreadPool.java:883) at org.eclipse.jetty.util.thread.QueuedThreadPool$Runner.run(QueuedThreadPool.java:1034) at java.base/java.lang.Thread.run(Thread.java:1570) ,code=500}}"
Stack Trace:
java.lang.AssertionError:
Expected: a string containing "Signature does not match"
but: was "Error from server at https://127.0.0.1:51383/solr: Error parsing public keys in Package store: {responseHeader={status=500,QTime=15},error={metadata={error-class=org.apache.solr.common.SolrException,root-error-class=org.apache.solr.common.SolrException},msg=Error parsing public keys in Package store,trace=org.apache.solr.common.SolrException: Error parsing public keys in Package store
at org.apache.solr.filestore.PackageStoreAPI$FSWrite.validate(PackageStoreAPI.java:250)
at org.apache.solr.filestore.PackageStoreAPI$FSWrite.readSignatures(PackageStoreAPI.java:235)
at org.apache.solr.filestore.PackageStoreAPI$FSWrite.upload(PackageStoreAPI.java:203)
at org.apache.solr.api.AnnotatedApi$Cmd.invoke(AnnotatedApi.java:299)
at org.apache.solr.api.AnnotatedApi.call(AnnotatedApi.java:175)
at org.apache.solr.api.V2HttpCall.handleAdmin(V2HttpCall.java:341)
at org.apache.solr.servlet.HttpSolrCall.handleAdminRequest(HttpSolrCall.java:807)
at org.apache.solr.servlet.HttpSolrCall.call(HttpSolrCall.java:545)
at org.apache.solr.servlet.SolrDispatchFilter.doFilter(SolrDispatchFilter.java:437)
at org.apache.solr.servlet.SolrDispatchFilter.doFilter(SolrDispatchFilter.java:367)
at org.eclipse.jetty.servlet.FilterHolder.doFilter(FilterHolder.java:193)
at org.eclipse.jetty.servlet.ServletHandler$Chain.doFilter(ServletHandler.java:1626)
at org.apache.solr.client.solrj.embedded.JettySolrRunner$DebugFilter.doFilter(JettySolrRunner.java:166)
at org.eclipse.jetty.servlet.FilterHolder.doFilter(FilterHolder.java:193)
at org.eclipse.jetty.servlet.ServletHandler$Chain.doFilter(ServletHandler.java:1626)
at org.eclipse.jetty.servlet.ServletHandler.doHandle(ServletHandler.java:552)
at org.eclipse.jetty.server.handler.ScopedHandler.nextHandle(ScopedHandler.java:233)
at org.eclipse.jetty.server.session.SessionHandler.doHandle(SessionHandler.java:1624)
at org.eclipse.jetty.server.handler.ScopedHandler.nextHandle(ScopedHandler.java:233)
at org.eclipse.jetty.server.handler.ContextHandler.doHandle(ContextHandler.java:1440)
at org.eclipse.jetty.server.handler.ScopedHandler.nextScope(ScopedHandler.java:188)
at org.eclipse.jetty.servlet.ServletHandler.doScope(ServletHandler.java:505)
at org.eclipse.jetty.server.session.SessionHandler.doScope(SessionHandler.java:1594)
at org.eclipse.jetty.server.handler.ScopedHandler.nextScope(ScopedHandler.java:186)
at org.eclipse.jetty.server.handler.ContextHandler.doScope(ContextHandler.java:1355)
at org.eclipse.jetty.server.handler.ScopedHandler.handle(ScopedHandler.java:141)
at org.eclipse.jetty.server.handler.HandlerWrapper.handle(HandlerWrapper.java:127)
at org.eclipse.jetty.rewrite.handler.RewriteHandler.handle(RewriteHandler.java:322)
at org.eclipse.jetty.server.handler.gzip.GzipHandler.handle(GzipHandler.java:722)
at org.eclipse.jetty.server.handler.HandlerWrapper.handle(HandlerWrapper.java:127)
at org.eclipse.jetty.server.Server.handle(Server.java:516)
at org.eclipse.jetty.server.HttpChannel.lambda$handle$1(HttpChannel.java:487)
at org.eclipse.jetty.server.HttpChannel.dispatch(HttpChannel.java:732)
at org.eclipse.jetty.server.HttpChannel.handle(HttpChannel.java:479)
at org.eclipse.jetty.server.HttpConnection.onFillable(HttpConnection.java:277)
at org.eclipse.jetty.io.AbstractConnection$ReadCallback.succeeded(AbstractConnection.java:311)
at org.eclipse.jetty.io.FillInterest.fillable(FillInterest.java:105)
at org.eclipse.jetty.io.ssl.SslConnection$1.run(SslConnection.java:149)
at org.eclipse.jetty.util.thread.QueuedThreadPool.runJob(QueuedThreadPool.java:883)
at org.eclipse.jetty.util.thread.QueuedThreadPool$Runner.run(QueuedThreadPool.java:1034)
at java.base/java.lang.Thread.run(Thread.java:1570)
,code=500}}"
at __randomizedtesting.SeedInfo.seed([F75DE56C210DA983:F2E76646ECF8C9DC]:0)
at org.hamcrest.MatcherAssert.assertThat(MatcherAssert.java:20)
at org.junit.Assert.assertThat(Assert.java:964)
at org.junit.Assert.assertThat(Assert.java:930)
at org.apache.solr.filestore.TestDistribPackageStore.testPackageStoreManagement(TestDistribPackageStore.java:94)
at java.base/jdk.internal.reflect.DirectMethodHandleAccessor.invoke(DirectMethodHandleAccessor.java:103)
at java.base/java.lang.reflect.Method.invoke(Method.java:580)
at com.carrotsearch.randomizedtesting.RandomizedRunner.invoke(RandomizedRunner.java:1758)
at com.carrotsearch.randomizedtesting.RandomizedRunner$8.evaluate(RandomizedRunner.java:946)
at com.carrotsearch.randomizedtesting.RandomizedRunner$9.evaluate(RandomizedRunner.java:982)
at com.carrotsearch.randomizedtesting.RandomizedRunner$10.evaluate(RandomizedRunner.java:996)
at com.carrotsearch.randomizedtesting.rules.SystemPropertiesRestoreRule$1.evaluate(SystemPropertiesRestoreRule.java:80)
at org.junit.rules.RunRules.evaluate(RunRules.java:20)
at org.apache.lucene.util.TestRuleSetupTeardownChained$1.evaluate(TestRuleSetupTeardownChained.java:49)
at org.apache.lucene.util.AbstractBeforeAfterRule$1.evaluate(AbstractBeforeAfterRule.java:45)
at org.apache.lucene.util.TestRuleThreadAndTestName$1.evaluate(TestRuleThreadAndTestName.java:48)
at org.apache.lucene.util.TestRuleIgnoreAfterMaxFailures$1.evaluate(TestRuleIgnoreAfterMaxFailures.java:64)
at org.apache.lucene.util.TestRuleMarkFailure$1.evaluate(TestRuleMarkFailure.java:47)
at org.junit.rules.RunRules.evaluate(RunRules.java:20)
at com.carrotsearch.randomizedtesting.rules.StatementAdapter.evaluate(StatementAdapter.java:36)
at com.carrotsearch.randomizedtesting.ThreadLeakControl$StatementRunner.run(ThreadLeakControl.java:390)
at com.carrotsearch.randomizedtesting.ThreadLeakControl.forkTimeoutingTask(ThreadLeakControl.java:843)
at com.carrotsearch.randomizedtesting.ThreadLeakControl$3.evaluate(ThreadLeakControl.java:490)
at com.carrotsearch.randomizedtesting.RandomizedRunner.runSingleTest(RandomizedRunner.java:955)
at com.carrotsearch.randomizedtesting.RandomizedRunner$5.evaluate(RandomizedRunner.java:840)
at com.carrotsearch.randomizedtesting.RandomizedRunner$6.evaluate(RandomizedRunner.java:891)
at com.carrotsearch.randomizedtesting.RandomizedRunner$7.evaluate(RandomizedRunner.java:902)
at com.carrotsearch.randomizedtesting.rules.StatementAdapter.evaluate(StatementAdapter.java:36)
at com.carrotsearch.randomizedtesting.rules.SystemPropertiesRestoreRule$1.evaluate(SystemPropertiesRestoreRule.java:80)
at org.junit.rules.RunRules.evaluate(RunRules.java:20)
at org.apache.lucene.util.AbstractBeforeAfterRule$1.evaluate(AbstractBeforeAfterRule.java:45)
at com.carrotsearch.randomizedtesting.rules.StatementAdapter.evaluate(StatementAdapter.java:36)
at org.apache.lucene.util.TestRuleStoreClassName$1.evaluate(TestRuleStoreClassName.java:41)
at com.carrotsearch.randomizedtesting.rules.NoShadowingOrOverridesOnMethodsRule$1.evaluate(NoShadowingOrOverridesOnMethodsRule.java:40)
at com.carrotsearch.randomizedtesting.rules.NoShadowingOrOverridesOnMethodsRule$1.evaluate(NoShadowingOrOverridesOnMethodsRule.java:40)
at com.carrotsearch.randomizedtesting.rules.StatementAdapter.evaluate(StatementAdapter.java:36)
at com.carrotsearch.randomizedtesting.rules.StatementAdapter.evaluate(StatementAdapter.java:36)
at org.apache.lucene.util.TestRuleAssertionsRequired$1.evaluate(TestRuleAssertionsRequired.java:53)
at org.apache.lucene.util.TestRuleMarkFailure$1.evaluate(TestRuleMarkFailure.java:47)
at org.apache.lucene.util.TestRuleIgnoreAfterMaxFailures$1.evaluate(TestRuleIgnoreAfterMaxFailures.java:64)
at org.apache.lucene.util.TestRuleIgnoreTestSuites$1.evaluate(TestRuleIgnoreTestSuites.java:54)
at org.junit.rules.RunRules.evaluate(RunRules.java:20)
at com.carrotsearch.randomizedtesting.rules.StatementAdapter.evaluate(StatementAdapter.java:36)
at com.carrotsearch.randomizedtesting.ThreadLeakControl$StatementRunner.run(ThreadLeakControl.java:390)
at com.carrotsearch.randomizedtesting.ThreadLeakControl.lambda$forkTimeoutingTask$0(ThreadLeakControl.java:850)
at java.base/java.lang.Thread.run(Thread.java:1570)
FAILED: org.apache.solr.filestore.TestDistribPackageStore.testPackageStoreManagement
Error Message:
Expected: a string containing "Signature does not match" but: was "Error from server at https://127.0.0.1:51371/solr: Error parsing public keys in Package store: {responseHeader={status=500,QTime=6},error={metadata={error-class=org.apache.solr.common.SolrException,root-error-class=org.apache.solr.common.SolrException},msg=Error parsing public keys in Package store,trace=org.apache.solr.common.SolrException: Error parsing public keys in Package store at org.apache.solr.filestore.PackageStoreAPI$FSWrite.validate(PackageStoreAPI.java:250) at org.apache.solr.filestore.PackageStoreAPI$FSWrite.readSignatures(PackageStoreAPI.java:235) at org.apache.solr.filestore.PackageStoreAPI$FSWrite.upload(PackageStoreAPI.java:203) at org.apache.solr.api.AnnotatedApi$Cmd.invoke(AnnotatedApi.java:299) at org.apache.solr.api.AnnotatedApi.call(AnnotatedApi.java:175) at org.apache.solr.api.V2HttpCall.handleAdmin(V2HttpCall.java:341) at org.apache.solr.servlet.HttpSolrCall.handleAdminRequest(HttpSolrCall.java:807) at org.apache.solr.servlet.HttpSolrCall.call(HttpSolrCall.java:545) at org.apache.solr.servlet.SolrDispatchFilter.doFilter(SolrDispatchFilter.java:437) at org.apache.solr.servlet.SolrDispatchFilter.doFilter(SolrDispatchFilter.java:367) at org.eclipse.jetty.servlet.FilterHolder.doFilter(FilterHolder.java:193) at org.eclipse.jetty.servlet.ServletHandler$Chain.doFilter(ServletHandler.java:1626) at org.apache.solr.client.solrj.embedded.JettySolrRunner$DebugFilter.doFilter(JettySolrRunner.java:166) at org.eclipse.jetty.servlet.FilterHolder.doFilter(FilterHolder.java:193) at org.eclipse.jetty.servlet.ServletHandler$Chain.doFilter(ServletHandler.java:1626) at org.eclipse.jetty.servlet.ServletHandler.doHandle(ServletHandler.java:552) at org.eclipse.jetty.server.handler.ScopedHandler.nextHandle(ScopedHandler.java:233) at org.eclipse.jetty.server.session.SessionHandler.doHandle(SessionHandler.java:1624) at org.eclipse.jetty.server.handler.ScopedHandler.nextHandle(ScopedHandler.java:233) at org.eclipse.jetty.server.handler.ContextHandler.doHandle(ContextHandler.java:1440) at org.eclipse.jetty.server.handler.ScopedHandler.nextScope(ScopedHandler.java:188) at org.eclipse.jetty.servlet.ServletHandler.doScope(ServletHandler.java:505) at org.eclipse.jetty.server.session.SessionHandler.doScope(SessionHandler.java:1594) at org.eclipse.jetty.server.handler.ScopedHandler.nextScope(ScopedHandler.java:186) at org.eclipse.jetty.server.handler.ContextHandler.doScope(ContextHandler.java:1355) at org.eclipse.jetty.server.handler.ScopedHandler.handle(ScopedHandler.java:141) at org.eclipse.jetty.server.handler.HandlerWrapper.handle(HandlerWrapper.java:127) at org.eclipse.jetty.rewrite.handler.RewriteHandler.handle(RewriteHandler.java:322) at org.eclipse.jetty.server.handler.gzip.GzipHandler.handle(GzipHandler.java:722) at org.eclipse.jetty.server.handler.HandlerWrapper.handle(HandlerWrapper.java:127) at org.eclipse.jetty.server.Server.handle(Server.java:516) at org.eclipse.jetty.server.HttpChannel.lambda$handle$1(HttpChannel.java:487) at org.eclipse.jetty.server.HttpChannel.dispatch(HttpChannel.java:732) at org.eclipse.jetty.server.HttpChannel.handle(HttpChannel.java:479) at org.eclipse.jetty.server.HttpConnection.onFillable(HttpConnection.java:277) at org.eclipse.jetty.io.AbstractConnection$ReadCallback.succeeded(AbstractConnection.java:311) at org.eclipse.jetty.io.FillInterest.fillable(FillInterest.java:105) at org.eclipse.jetty.io.ssl.SslConnection$1.run(SslConnection.java:149) at org.eclipse.jetty.util.thread.QueuedThreadPool.runJob(QueuedThreadPool.java:883) at org.eclipse.jetty.util.thread.QueuedThreadPool$Runner.run(QueuedThreadPool.java:1034) at java.base/java.lang.Thread.run(Thread.java:1570) ,code=500}}"
Stack Trace:
java.lang.AssertionError:
Expected: a string containing "Signature does not match"
but: was "Error from server at https://127.0.0.1:51371/solr: Error parsing public keys in Package store: {responseHeader={status=500,QTime=6},error={metadata={error-class=org.apache.solr.common.SolrException,root-error-class=org.apache.solr.common.SolrException},msg=Error parsing public keys in Package store,trace=org.apache.solr.common.SolrException: Error parsing public keys in Package store
at org.apache.solr.filestore.PackageStoreAPI$FSWrite.validate(PackageStoreAPI.java:250)
at org.apache.solr.filestore.PackageStoreAPI$FSWrite.readSignatures(PackageStoreAPI.java:235)
at org.apache.solr.filestore.PackageStoreAPI$FSWrite.upload(PackageStoreAPI.java:203)
at org.apache.solr.api.AnnotatedApi$Cmd.invoke(AnnotatedApi.java:299)
at org.apache.solr.api.AnnotatedApi.call(AnnotatedApi.java:175)
at org.apache.solr.api.V2HttpCall.handleAdmin(V2HttpCall.java:341)
at org.apache.solr.servlet.HttpSolrCall.handleAdminRequest(HttpSolrCall.java:807)
at org.apache.solr.servlet.HttpSolrCall.call(HttpSolrCall.java:545)
at org.apache.solr.servlet.SolrDispatchFilter.doFilter(SolrDispatchFilter.java:437)
at org.apache.solr.servlet.SolrDispatchFilter.doFilter(SolrDispatchFilter.java:367)
at org.eclipse.jetty.servlet.FilterHolder.doFilter(FilterHolder.java:193)
at org.eclipse.jetty.servlet.ServletHandler$Chain.doFilter(ServletHandler.java:1626)
at org.apache.solr.client.solrj.embedded.JettySolrRunner$DebugFilter.doFilter(JettySolrRunner.java:166)
at org.eclipse.jetty.servlet.FilterHolder.doFilter(FilterHolder.java:193)
at org.eclipse.jetty.servlet.ServletHandler$Chain.doFilter(ServletHandler.java:1626)
at org.eclipse.jetty.servlet.ServletHandler.doHandle(ServletHandler.java:552)
at org.eclipse.jetty.server.handler.ScopedHandler.nextHandle(ScopedHandler.java:233)
at org.eclipse.jetty.server.session.SessionHandler.doHandle(SessionHandler.java:1624)
at org.eclipse.jetty.server.handler.ScopedHandler.nextHandle(ScopedHandler.java:233)
at org.eclipse.jetty.server.handler.ContextHandler.doHandle(ContextHandler.java:1440)
at org.eclipse.jetty.server.handler.ScopedHandler.nextScope(ScopedHandler.java:188)
at org.eclipse.jetty.servlet.ServletHandler.doScope(ServletHandler.java:505)
at org.eclipse.jetty.server.session.SessionHandler.doScope(SessionHandler.java:1594)
at org.eclipse.jetty.server.handler.ScopedHandler.nextScope(ScopedHandler.java:186)
at org.eclipse.jetty.server.handler.ContextHandler.doScope(ContextHandler.java:1355)
at org.eclipse.jetty.server.handler.ScopedHandler.handle(ScopedHandler.java:141)
at org.eclipse.jetty.server.handler.HandlerWrapper.handle(HandlerWrapper.java:127)
at org.eclipse.jetty.rewrite.handler.RewriteHandler.handle(RewriteHandler.java:322)
at org.eclipse.jetty.server.handler.gzip.GzipHandler.handle(GzipHandler.java:722)
at org.eclipse.jetty.server.handler.HandlerWrapper.handle(HandlerWrapper.java:127)
at org.eclipse.jetty.server.Server.handle(Server.java:516)
at org.eclipse.jetty.server.HttpChannel.lambda$handle$1(HttpChannel.java:487)
at org.eclipse.jetty.server.HttpChannel.dispatch(HttpChannel.java:732)
at org.eclipse.jetty.server.HttpChannel.handle(HttpChannel.java:479)
at org.eclipse.jetty.server.HttpConnection.onFillable(HttpConnection.java:277)
at org.eclipse.jetty.io.AbstractConnection$ReadCallback.succeeded(AbstractConnection.java:311)
at org.eclipse.jetty.io.FillInterest.fillable(FillInterest.java:105)
at org.eclipse.jetty.io.ssl.SslConnection$1.run(SslConnection.java:149)
at org.eclipse.jetty.util.thread.QueuedThreadPool.runJob(QueuedThreadPool.java:883)
at org.eclipse.jetty.util.thread.QueuedThreadPool$Runner.run(QueuedThreadPool.java:1034)
at java.base/java.lang.Thread.run(Thread.java:1570)
,code=500}}"
at __randomizedtesting.SeedInfo.seed([F75DE56C210DA983:F2E76646ECF8C9DC]:0)
at org.hamcrest.MatcherAssert.assertThat(MatcherAssert.java:20)
at org.junit.Assert.assertThat(Assert.java:964)
at org.junit.Assert.assertThat(Assert.java:930)
at org.apache.solr.filestore.TestDistribPackageStore.testPackageStoreManagement(TestDistribPackageStore.java:94)
at java.base/jdk.internal.reflect.DirectMethodHandleAccessor.invoke(DirectMethodHandleAccessor.java:103)
at java.base/java.lang.reflect.Method.invoke(Method.java:580)
at com.carrotsearch.randomizedtesting.RandomizedRunner.invoke(RandomizedRunner.java:1758)
at com.carrotsearch.randomizedtesting.RandomizedRunner$8.evaluate(RandomizedRunner.java:946)
at com.carrotsearch.randomizedtesting.RandomizedRunner$9.evaluate(RandomizedRunner.java:982)
at com.carrotsearch.randomizedtesting.RandomizedRunner$10.evaluate(RandomizedRunner.java:996)
at com.carrotsearch.randomizedtesting.rules.SystemPropertiesRestoreRule$1.evaluate(SystemPropertiesRestoreRule.java:80)
at org.junit.rules.RunRules.evaluate(RunRules.java:20)
at org.apache.lucene.util.TestRuleSetupTeardownChained$1.evaluate(TestRuleSetupTeardownChained.java:49)
at org.apache.lucene.util.AbstractBeforeAfterRule$1.evaluate(AbstractBeforeAfterRule.java:45)
at org.apache.lucene.util.TestRuleThreadAndTestName$1.evaluate(TestRuleThreadAndTestName.java:48)
at org.apache.lucene.util.TestRuleIgnoreAfterMaxFailures$1.evaluate(TestRuleIgnoreAfterMaxFailures.java:64)
at org.apache.lucene.util.TestRuleMarkFailure$1.evaluate(TestRuleMarkFailure.java:47)
at org.junit.rules.RunRules.evaluate(RunRules.java:20)
at com.carrotsearch.randomizedtesting.rules.StatementAdapter.evaluate(StatementAdapter.java:36)
at com.carrotsearch.randomizedtesting.ThreadLeakControl$StatementRunner.run(ThreadLeakControl.java:390)
at com.carrotsearch.randomizedtesting.ThreadLeakControl.forkTimeoutingTask(ThreadLeakControl.java:843)
at com.carrotsearch.randomizedtesting.ThreadLeakControl$3.evaluate(ThreadLeakControl.java:490)
at com.carrotsearch.randomizedtesting.RandomizedRunner.runSingleTest(RandomizedRunner.java:955)
at com.carrotsearch.randomizedtesting.RandomizedRunner$5.evaluate(RandomizedRunner.java:840)
at com.carrotsearch.randomizedtesting.RandomizedRunner$6.evaluate(RandomizedRunner.java:891)
at com.carrotsearch.randomizedtesting.RandomizedRunner$7.evaluate(RandomizedRunner.java:902)
at com.carrotsearch.randomizedtesting.rules.StatementAdapter.evaluate(StatementAdapter.java:36)
at com.carrotsearch.randomizedtesting.rules.SystemPropertiesRestoreRule$1.evaluate(SystemPropertiesRestoreRule.java:80)
at org.junit.rules.RunRules.evaluate(RunRules.java:20)
at org.apache.lucene.util.AbstractBeforeAfterRule$1.evaluate(AbstractBeforeAfterRule.java:45)
at com.carrotsearch.randomizedtesting.rules.StatementAdapter.evaluate(StatementAdapter.java:36)
at org.apache.lucene.util.TestRuleStoreClassName$1.evaluate(TestRuleStoreClassName.java:41)
at com.carrotsearch.randomizedtesting.rules.NoShadowingOrOverridesOnMethodsRule$1.evaluate(NoShadowingOrOverridesOnMethodsRule.java:40)
at com.carrotsearch.randomizedtesting.rules.NoShadowingOrOverridesOnMethodsRule$1.evaluate(NoShadowingOrOverridesOnMethodsRule.java:40)
at com.carrotsearch.randomizedtesting.rules.StatementAdapter.evaluate(StatementAdapter.java:36)
at com.carrotsearch.randomizedtesting.rules.StatementAdapter.evaluate(StatementAdapter.java:36)
at org.apache.lucene.util.TestRuleAssertionsRequired$1.evaluate(TestRuleAssertionsRequired.java:53)
at org.apache.lucene.util.TestRuleMarkFailure$1.evaluate(TestRuleMarkFailure.java:47)
at org.apache.lucene.util.TestRuleIgnoreAfterMaxFailures$1.evaluate(TestRuleIgnoreAfterMaxFailures.java:64)
at org.apache.lucene.util.TestRuleIgnoreTestSuites$1.evaluate(TestRuleIgnoreTestSuites.java:54)
at org.junit.rules.RunRules.evaluate(RunRules.java:20)
at com.carrotsearch.randomizedtesting.rules.StatementAdapter.evaluate(StatementAdapter.java:36)
at com.carrotsearch.randomizedtesting.ThreadLeakControl$StatementRunner.run(ThreadLeakControl.java:390)
at com.carrotsearch.randomizedtesting.ThreadLeakControl.lambda$forkTimeoutingTask$0(ThreadLeakControl.java:850)
at java.base/java.lang.Thread.run(Thread.java:1570)
FAILED: org.apache.solr.filestore.TestDistribPackageStore.testPackageStoreManagement
Error Message:
Expected: a string containing "Signature does not match" but: was "Error from server at https://127.0.0.1:51318/solr: Error parsing public keys in Package store: {responseHeader={status=500,QTime=19},error={metadata={error-class=org.apache.solr.common.SolrException,root-error-class=org.apache.solr.common.SolrException},msg=Error parsing public keys in Package store,trace=org.apache.solr.common.SolrException: Error parsing public keys in Package store at org.apache.solr.filestore.PackageStoreAPI$FSWrite.validate(PackageStoreAPI.java:250) at org.apache.solr.filestore.PackageStoreAPI$FSWrite.readSignatures(PackageStoreAPI.java:235) at org.apache.solr.filestore.PackageStoreAPI$FSWrite.upload(PackageStoreAPI.java:203) at org.apache.solr.api.AnnotatedApi$Cmd.invoke(AnnotatedApi.java:299) at org.apache.solr.api.AnnotatedApi.call(AnnotatedApi.java:175) at org.apache.solr.api.V2HttpCall.handleAdmin(V2HttpCall.java:341) at org.apache.solr.servlet.HttpSolrCall.handleAdminRequest(HttpSolrCall.java:807) at org.apache.solr.servlet.HttpSolrCall.call(HttpSolrCall.java:545) at org.apache.solr.servlet.SolrDispatchFilter.doFilter(SolrDispatchFilter.java:437) at org.apache.solr.servlet.SolrDispatchFilter.doFilter(SolrDispatchFilter.java:367) at org.eclipse.jetty.servlet.FilterHolder.doFilter(FilterHolder.java:193) at org.eclipse.jetty.servlet.ServletHandler$Chain.doFilter(ServletHandler.java:1626) at org.apache.solr.client.solrj.embedded.JettySolrRunner$DebugFilter.doFilter(JettySolrRunner.java:166) at org.eclipse.jetty.servlet.FilterHolder.doFilter(FilterHolder.java:193) at org.eclipse.jetty.servlet.ServletHandler$Chain.doFilter(ServletHandler.java:1626) at org.eclipse.jetty.servlet.ServletHandler.doHandle(ServletHandler.java:552) at org.eclipse.jetty.server.handler.ScopedHandler.nextHandle(ScopedHandler.java:233) at org.eclipse.jetty.server.session.SessionHandler.doHandle(SessionHandler.java:1624) at org.eclipse.jetty.server.handler.ScopedHandler.nextHandle(ScopedHandler.java:233) at org.eclipse.jetty.server.handler.ContextHandler.doHandle(ContextHandler.java:1440) at org.eclipse.jetty.server.handler.ScopedHandler.nextScope(ScopedHandler.java:188) at org.eclipse.jetty.servlet.ServletHandler.doScope(ServletHandler.java:505) at org.eclipse.jetty.server.session.SessionHandler.doScope(SessionHandler.java:1594) at org.eclipse.jetty.server.handler.ScopedHandler.nextScope(ScopedHandler.java:186) at org.eclipse.jetty.server.handler.ContextHandler.doScope(ContextHandler.java:1355) at org.eclipse.jetty.server.handler.ScopedHandler.handle(ScopedHandler.java:141) at org.eclipse.jetty.server.handler.HandlerWrapper.handle(HandlerWrapper.java:127) at org.eclipse.jetty.rewrite.handler.RewriteHandler.handle(RewriteHandler.java:322) at org.eclipse.jetty.server.handler.gzip.GzipHandler.handle(GzipHandler.java:722) at org.eclipse.jetty.server.handler.HandlerWrapper.handle(HandlerWrapper.java:127) at org.eclipse.jetty.server.Server.handle(Server.java:516) at org.eclipse.jetty.server.HttpChannel.lambda$handle$1(HttpChannel.java:487) at org.eclipse.jetty.server.HttpChannel.dispatch(HttpChannel.java:732) at org.eclipse.jetty.server.HttpChannel.handle(HttpChannel.java:479) at org.eclipse.jetty.server.HttpConnection.onFillable(HttpConnection.java:277) at org.eclipse.jetty.io.AbstractConnection$ReadCallback.succeeded(AbstractConnection.java:311) at org.eclipse.jetty.io.FillInterest.fillable(FillInterest.java:105) at org.eclipse.jetty.io.ssl.SslConnection$1.run(SslConnection.java:149) at org.eclipse.jetty.util.thread.QueuedThreadPool.runJob(QueuedThreadPool.java:883) at org.eclipse.jetty.util.thread.QueuedThreadPool$Runner.run(QueuedThreadPool.java:1034) at java.base/java.lang.Thread.run(Thread.java:1570) ,code=500}}"
Stack Trace:
java.lang.AssertionError:
Expected: a string containing "Signature does not match"
but: was "Error from server at https://127.0.0.1:51318/solr: Error parsing public keys in Package store: {responseHeader={status=500,QTime=19},error={metadata={error-class=org.apache.solr.common.SolrException,root-error-class=org.apache.solr.common.SolrException},msg=Error parsing public keys in Package store,trace=org.apache.solr.common.SolrException: Error parsing public keys in Package store
at org.apache.solr.filestore.PackageStoreAPI$FSWrite.validate(PackageStoreAPI.java:250)
at org.apache.solr.filestore.PackageStoreAPI$FSWrite.readSignatures(PackageStoreAPI.java:235)
at org.apache.solr.filestore.PackageStoreAPI$FSWrite.upload(PackageStoreAPI.java:203)
at org.apache.solr.api.AnnotatedApi$Cmd.invoke(AnnotatedApi.java:299)
at org.apache.solr.api.AnnotatedApi.call(AnnotatedApi.java:175)
at org.apache.solr.api.V2HttpCall.handleAdmin(V2HttpCall.java:341)
at org.apache.solr.servlet.HttpSolrCall.handleAdminRequest(HttpSolrCall.java:807)
at org.apache.solr.servlet.HttpSolrCall.call(HttpSolrCall.java:545)
at org.apache.solr.servlet.SolrDispatchFilter.doFilter(SolrDispatchFilter.java:437)
at org.apache.solr.servlet.SolrDispatchFilter.doFilter(SolrDispatchFilter.java:367)
at org.eclipse.jetty.servlet.FilterHolder.doFilter(FilterHolder.java:193)
at org.eclipse.jetty.servlet.ServletHandler$Chain.doFilter(ServletHandler.java:1626)
at org.apache.solr.client.solrj.embedded.JettySolrRunner$DebugFilter.doFilter(JettySolrRunner.java:166)
at org.eclipse.jetty.servlet.FilterHolder.doFilter(FilterHolder.java:193)
at org.eclipse.jetty.servlet.ServletHandler$Chain.doFilter(ServletHandler.java:1626)
at org.eclipse.jetty.servlet.ServletHandler.doHandle(ServletHandler.java:552)
at org.eclipse.jetty.server.handler.ScopedHandler.nextHandle(ScopedHandler.java:233)
at org.eclipse.jetty.server.session.SessionHandler.doHandle(SessionHandler.java:1624)
at org.eclipse.jetty.server.handler.ScopedHandler.nextHandle(ScopedHandler.java:233)
at org.eclipse.jetty.server.handler.ContextHandler.doHandle(ContextHandler.java:1440)
at org.eclipse.jetty.server.handler.ScopedHandler.nextScope(ScopedHandler.java:188)
at org.eclipse.jetty.servlet.ServletHandler.doScope(ServletHandler.java:505)
at org.eclipse.jetty.server.session.SessionHandler.doScope(SessionHandler.java:1594)
at org.eclipse.jetty.server.handler.ScopedHandler.nextScope(ScopedHandler.java:186)
at org.eclipse.jetty.server.handler.ContextHandler.doScope(ContextHandler.java:1355)
at org.eclipse.jetty.server.handler.ScopedHandler.handle(ScopedHandler.java:141)
at org.eclipse.jetty.server.handler.HandlerWrapper.handle(HandlerWrapper.java:127)
at org.eclipse.jetty.rewrite.handler.RewriteHandler.handle(RewriteHandler.java:322)
at org.eclipse.jetty.server.handler.gzip.GzipHandler.handle(GzipHandler.java:722)
at org.eclipse.jetty.server.handler.HandlerWrapper.handle(HandlerWrapper.java:127)
at org.eclipse.jetty.server.Server.handle(Server.java:516)
at org.eclipse.jetty.server.HttpChannel.lambda$handle$1(HttpChannel.java:487)
at org.eclipse.jetty.server.HttpChannel.dispatch(HttpChannel.java:732)
at org.eclipse.jetty.server.HttpChannel.handle(HttpChannel.java:479)
at org.eclipse.jetty.server.HttpConnection.onFillable(HttpConnection.java:277)
at org.eclipse.jetty.io.AbstractConnection$ReadCallback.succeeded(AbstractConnection.java:311)
at org.eclipse.jetty.io.FillInterest.fillable(FillInterest.java:105)
at org.eclipse.jetty.io.ssl.SslConnection$1.run(SslConnection.java:149)
at org.eclipse.jetty.util.thread.QueuedThreadPool.runJob(QueuedThreadPool.java:883)
at org.eclipse.jetty.util.thread.QueuedThreadPool$Runner.run(QueuedThreadPool.java:1034)
at java.base/java.lang.Thread.run(Thread.java:1570)
,code=500}}"
at __randomizedtesting.SeedInfo.seed([F75DE56C210DA983:F2E76646ECF8C9DC]:0)
at org.hamcrest.MatcherAssert.assertThat(MatcherAssert.java:20)
at org.junit.Assert.assertThat(Assert.java:964)
at org.junit.Assert.assertThat(Assert.java:930)
at org.apache.solr.filestore.TestDistribPackageStore.testPackageStoreManagement(TestDistribPackageStore.java:94)
at java.base/jdk.internal.reflect.DirectMethodHandleAccessor.invoke(DirectMethodHandleAccessor.java:103)
at java.base/java.lang.reflect.Method.invoke(Method.java:580)
at com.carrotsearch.randomizedtesting.RandomizedRunner.invoke(RandomizedRunner.java:1758)
at com.carrotsearch.randomizedtesting.RandomizedRunner$8.evaluate(RandomizedRunner.java:946)
at com.carrotsearch.randomizedtesting.RandomizedRunner$9.evaluate(RandomizedRunner.java:982)
at com.carrotsearch.randomizedtesting.RandomizedRunner$10.evaluate(RandomizedRunner.java:996)
at com.carrotsearch.randomizedtesting.rules.SystemPropertiesRestoreRule$1.evaluate(SystemPropertiesRestoreRule.java:80)
at org.junit.rules.RunRules.evaluate(RunRules.java:20)
at org.apache.lucene.util.TestRuleSetupTeardownChained$1.evaluate(TestRuleSetupTeardownChained.java:49)
at org.apache.lucene.util.AbstractBeforeAfterRule$1.evaluate(AbstractBeforeAfterRule.java:45)
at org.apache.lucene.util.TestRuleThreadAndTestName$1.evaluate(TestRuleThreadAndTestName.java:48)
at org.apache.lucene.util.TestRuleIgnoreAfterMaxFailures$1.evaluate(TestRuleIgnoreAfterMaxFailures.java:64)
at org.apache.lucene.util.TestRuleMarkFailure$1.evaluate(TestRuleMarkFailure.java:47)
at org.junit.rules.RunRules.evaluate(RunRules.java:20)
at com.carrotsearch.randomizedtesting.rules.StatementAdapter.evaluate(StatementAdapter.java:36)
at com.carrotsearch.randomizedtesting.ThreadLeakControl$StatementRunner.run(ThreadLeakControl.java:390)
at com.carrotsearch.randomizedtesting.ThreadLeakControl.forkTimeoutingTask(ThreadLeakControl.java:843)
at com.carrotsearch.randomizedtesting.ThreadLeakControl$3.evaluate(ThreadLeakControl.java:490)
at com.carrotsearch.randomizedtesting.RandomizedRunner.runSingleTest(RandomizedRunner.java:955)
at com.carrotsearch.randomizedtesting.RandomizedRunner$5.evaluate(RandomizedRunner.java:840)
at com.carrotsearch.randomizedtesting.RandomizedRunner$6.evaluate(RandomizedRunner.java:891)
at com.carrotsearch.randomizedtesting.RandomizedRunner$7.evaluate(RandomizedRunner.java:902)
at com.carrotsearch.randomizedtesting.rules.StatementAdapter.evaluate(StatementAdapter.java:36)
at com.carrotsearch.randomizedtesting.rules.SystemPropertiesRestoreRule$1.evaluate(SystemPropertiesRestoreRule.java:80)
at org.junit.rules.RunRules.evaluate(RunRules.java:20)
at org.apache.lucene.util.AbstractBeforeAfterRule$1.evaluate(AbstractBeforeAfterRule.java:45)
at com.carrotsearch.randomizedtesting.rules.StatementAdapter.evaluate(StatementAdapter.java:36)
at org.apache.lucene.util.TestRuleStoreClassName$1.evaluate(TestRuleStoreClassName.java:41)
at com.carrotsearch.randomizedtesting.rules.NoShadowingOrOverridesOnMethodsRule$1.evaluate(NoShadowingOrOverridesOnMethodsRule.java:40)
at com.carrotsearch.randomizedtesting.rules.NoShadowingOrOverridesOnMethodsRule$1.evaluate(NoShadowingOrOverridesOnMethodsRule.java:40)
at com.carrotsearch.randomizedtesting.rules.StatementAdapter.evaluate(StatementAdapter.java:36)
at com.carrotsearch.randomizedtesting.rules.StatementAdapter.evaluate(StatementAdapter.java:36)
at org.apache.lucene.util.TestRuleAssertionsRequired$1.evaluate(TestRuleAssertionsRequired.java:53)
at org.apache.lucene.util.TestRuleMarkFailure$1.evaluate(TestRuleMarkFailure.java:47)
at org.apache.lucene.util.TestRuleIgnoreAfterMaxFailures$1.evaluate(TestRuleIgnoreAfterMaxFailures.java:64)
at org.apache.lucene.util.TestRuleIgnoreTestSuites$1.evaluate(TestRuleIgnoreTestSuites.java:54)
at org.junit.rules.RunRules.evaluate(RunRules.java:20)
at com.carrotsearch.randomizedtesting.rules.StatementAdapter.evaluate(StatementAdapter.java:36)
at com.carrotsearch.randomizedtesting.ThreadLeakControl$StatementRunner.run(ThreadLeakControl.java:390)
at com.carrotsearch.randomizedtesting.ThreadLeakControl.lambda$forkTimeoutingTask$0(ThreadLeakControl.java:850)
at java.base/java.lang.Thread.run(Thread.java:1570)
FAILED: org.apache.solr.filestore.TestDistribPackageStore.testPackageStoreManagement
Error Message:
Expected: a string containing "Signature does not match" but: was "Error from server at https://127.0.0.1:55682/solr: Error parsing public keys in Package store: {responseHeader={status=500,QTime=5},error={metadata={error-class=org.apache.solr.common.SolrException,root-error-class=org.apache.solr.common.SolrException},msg=Error parsing public keys in Package store,trace=org.apache.solr.common.SolrException: Error parsing public keys in Package store at org.apache.solr.filestore.PackageStoreAPI$FSWrite.validate(PackageStoreAPI.java:250) at org.apache.solr.filestore.PackageStoreAPI$FSWrite.readSignatures(PackageStoreAPI.java:235) at org.apache.solr.filestore.PackageStoreAPI$FSWrite.upload(PackageStoreAPI.java:203) at org.apache.solr.api.AnnotatedApi$Cmd.invoke(AnnotatedApi.java:299) at org.apache.solr.api.AnnotatedApi.call(AnnotatedApi.java:175) at org.apache.solr.api.V2HttpCall.handleAdmin(V2HttpCall.java:341) at org.apache.solr.servlet.HttpSolrCall.handleAdminRequest(HttpSolrCall.java:807) at org.apache.solr.servlet.HttpSolrCall.call(HttpSolrCall.java:545) at org.apache.solr.servlet.SolrDispatchFilter.doFilter(SolrDispatchFilter.java:437) at org.apache.solr.servlet.SolrDispatchFilter.doFilter(SolrDispatchFilter.java:367) at org.eclipse.jetty.servlet.FilterHolder.doFilter(FilterHolder.java:193) at org.eclipse.jetty.servlet.ServletHandler$Chain.doFilter(ServletHandler.java:1626) at org.apache.solr.client.solrj.embedded.JettySolrRunner$DebugFilter.doFilter(JettySolrRunner.java:166) at org.eclipse.jetty.servlet.FilterHolder.doFilter(FilterHolder.java:193) at org.eclipse.jetty.servlet.ServletHandler$Chain.doFilter(ServletHandler.java:1626) at org.eclipse.jetty.servlet.ServletHandler.doHandle(ServletHandler.java:552) at org.eclipse.jetty.server.handler.ScopedHandler.nextHandle(ScopedHandler.java:233) at org.eclipse.jetty.server.session.SessionHandler.doHandle(SessionHandler.java:1624) at org.eclipse.jetty.server.handler.ScopedHandler.nextHandle(ScopedHandler.java:233) at org.eclipse.jetty.server.handler.ContextHandler.doHandle(ContextHandler.java:1440) at org.eclipse.jetty.server.handler.ScopedHandler.nextScope(ScopedHandler.java:188) at org.eclipse.jetty.servlet.ServletHandler.doScope(ServletHandler.java:505) at org.eclipse.jetty.server.session.SessionHandler.doScope(SessionHandler.java:1594) at org.eclipse.jetty.server.handler.ScopedHandler.nextScope(ScopedHandler.java:186) at org.eclipse.jetty.server.handler.ContextHandler.doScope(ContextHandler.java:1355) at org.eclipse.jetty.server.handler.ScopedHandler.handle(ScopedHandler.java:141) at org.eclipse.jetty.server.handler.HandlerWrapper.handle(HandlerWrapper.java:127) at org.eclipse.jetty.rewrite.handler.RewriteHandler.handle(RewriteHandler.java:322) at org.eclipse.jetty.server.handler.gzip.GzipHandler.handle(GzipHandler.java:722) at org.eclipse.jetty.server.handler.HandlerWrapper.handle(HandlerWrapper.java:127) at org.eclipse.jetty.server.Server.handle(Server.java:516) at org.eclipse.jetty.server.HttpChannel.lambda$handle$1(HttpChannel.java:487) at org.eclipse.jetty.server.HttpChannel.dispatch(HttpChannel.java:732) at org.eclipse.jetty.server.HttpChannel.handle(HttpChannel.java:479) at org.eclipse.jetty.server.HttpConnection.onFillable(HttpConnection.java:277) at org.eclipse.jetty.io.AbstractConnection$ReadCallback.succeeded(AbstractConnection.java:311) at org.eclipse.jetty.io.FillInterest.fillable(FillInterest.java:105) at org.eclipse.jetty.io.ssl.SslConnection$1.run(SslConnection.java:149) at org.eclipse.jetty.util.thread.QueuedThreadPool.runJob(QueuedThreadPool.java:883) at org.eclipse.jetty.util.thread.QueuedThreadPool$Runner.run(QueuedThreadPool.java:1034) at java.base/java.lang.Thread.run(Thread.java:1570) ,code=500}}"
Stack Trace:
java.lang.AssertionError:
Expected: a string containing "Signature does not match"
but: was "Error from server at https://127.0.0.1:55682/solr: Error parsing public keys in Package store: {responseHeader={status=500,QTime=5},error={metadata={error-class=org.apache.solr.common.SolrException,root-error-class=org.apache.solr.common.SolrException},msg=Error parsing public keys in Package store,trace=org.apache.solr.common.SolrException: Error parsing public keys in Package store
at org.apache.solr.filestore.PackageStoreAPI$FSWrite.validate(PackageStoreAPI.java:250)
at org.apache.solr.filestore.PackageStoreAPI$FSWrite.readSignatures(PackageStoreAPI.java:235)
at org.apache.solr.filestore.PackageStoreAPI$FSWrite.upload(PackageStoreAPI.java:203)
at org.apache.solr.api.AnnotatedApi$Cmd.invoke(AnnotatedApi.java:299)
at org.apache.solr.api.AnnotatedApi.call(AnnotatedApi.java:175)
at org.apache.solr.api.V2HttpCall.handleAdmin(V2HttpCall.java:341)
at org.apache.solr.servlet.HttpSolrCall.handleAdminRequest(HttpSolrCall.java:807)
at org.apache.solr.servlet.HttpSolrCall.call(HttpSolrCall.java:545)
at org.apache.solr.servlet.SolrDispatchFilter.doFilter(SolrDispatchFilter.java:437)
at org.apache.solr.servlet.SolrDispatchFilter.doFilter(SolrDispatchFilter.java:367)
at org.eclipse.jetty.servlet.FilterHolder.doFilter(FilterHolder.java:193)
at org.eclipse.jetty.servlet.ServletHandler$Chain.doFilter(ServletHandler.java:1626)
at org.apache.solr.client.solrj.embedded.JettySolrRunner$DebugFilter.doFilter(JettySolrRunner.java:166)
at org.eclipse.jetty.servlet.FilterHolder.doFilter(FilterHolder.java:193)
at org.eclipse.jetty.servlet.ServletHandler$Chain.doFilter(ServletHandler.java:1626)
at org.eclipse.jetty.servlet.ServletHandler.doHandle(ServletHandler.java:552)
at org.eclipse.jetty.server.handler.ScopedHandler.nextHandle(ScopedHandler.java:233)
at org.eclipse.jetty.server.session.SessionHandler.doHandle(SessionHandler.java:1624)
at org.eclipse.jetty.server.handler.ScopedHandler.nextHandle(ScopedHandler.java:233)
at org.eclipse.jetty.server.handler.ContextHandler.doHandle(ContextHandler.java:1440)
at org.eclipse.jetty.server.handler.ScopedHandler.nextScope(ScopedHandler.java:188)
at org.eclipse.jetty.servlet.ServletHandler.doScope(ServletHandler.java:505)
at org.eclipse.jetty.server.session.SessionHandler.doScope(SessionHandler.java:1594)
at org.eclipse.jetty.server.handler.ScopedHandler.nextScope(ScopedHandler.java:186)
at org.eclipse.jetty.server.handler.ContextHandler.doScope(ContextHandler.java:1355)
at org.eclipse.jetty.server.handler.ScopedHandler.handle(ScopedHandler.java:141)
at org.eclipse.jetty.server.handler.HandlerWrapper.handle(HandlerWrapper.java:127)
at org.eclipse.jetty.rewrite.handler.RewriteHandler.handle(RewriteHandler.java:322)
at org.eclipse.jetty.server.handler.gzip.GzipHandler.handle(GzipHandler.java:722)
at org.eclipse.jetty.server.handler.HandlerWrapper.handle(HandlerWrapper.java:127)
at org.eclipse.jetty.server.Server.handle(Server.java:516)
at org.eclipse.jetty.server.HttpChannel.lambda$handle$1(HttpChannel.java:487)
at org.eclipse.jetty.server.HttpChannel.dispatch(HttpChannel.java:732)
at org.eclipse.jetty.server.HttpChannel.handle(HttpChannel.java:479)
at org.eclipse.jetty.server.HttpConnection.onFillable(HttpConnection.java:277)
at org.eclipse.jetty.io.AbstractConnection$ReadCallback.succeeded(AbstractConnection.java:311)
at org.eclipse.jetty.io.FillInterest.fillable(FillInterest.java:105)
at org.eclipse.jetty.io.ssl.SslConnection$1.run(SslConnection.java:149)
at org.eclipse.jetty.util.thread.QueuedThreadPool.runJob(QueuedThreadPool.java:883)
at org.eclipse.jetty.util.thread.QueuedThreadPool$Runner.run(QueuedThreadPool.java:1034)
at java.base/java.lang.Thread.run(Thread.java:1570)
,code=500}}"
at __randomizedtesting.SeedInfo.seed([F75DE56C210DA983:F2E76646ECF8C9DC]:0)
at org.hamcrest.MatcherAssert.assertThat(MatcherAssert.java:20)
at org.junit.Assert.assertThat(Assert.java:964)
at org.junit.Assert.assertThat(Assert.java:930)
at org.apache.solr.filestore.TestDistribPackageStore.testPackageStoreManagement(TestDistribPackageStore.java:94)
at java.base/jdk.internal.reflect.DirectMethodHandleAccessor.invoke(DirectMethodHandleAccessor.java:103)
at java.base/java.lang.reflect.Method.invoke(Method.java:580)
at com.carrotsearch.randomizedtesting.RandomizedRunner.invoke(RandomizedRunner.java:1758)
at com.carrotsearch.randomizedtesting.RandomizedRunner$8.evaluate(RandomizedRunner.java:946)
at com.carrotsearch.randomizedtesting.RandomizedRunner$9.evaluate(RandomizedRunner.java:982)
at com.carrotsearch.randomizedtesting.RandomizedRunner$10.evaluate(RandomizedRunner.java:996)
at com.carrotsearch.randomizedtesting.rules.SystemPropertiesRestoreRule$1.evaluate(SystemPropertiesRestoreRule.java:80)
at org.junit.rules.RunRules.evaluate(RunRules.java:20)
at org.apache.lucene.util.TestRuleSetupTeardownChained$1.evaluate(TestRuleSetupTeardownChained.java:49)
at org.apache.lucene.util.AbstractBeforeAfterRule$1.evaluate(AbstractBeforeAfterRule.java:45)
at org.apache.lucene.util.TestRuleThreadAndTestName$1.evaluate(TestRuleThreadAndTestName.java:48)
at org.apache.lucene.util.TestRuleIgnoreAfterMaxFailures$1.evaluate(TestRuleIgnoreAfterMaxFailures.java:64)
at org.apache.lucene.util.TestRuleMarkFailure$1.evaluate(TestRuleMarkFailure.java:47)
at org.junit.rules.RunRules.evaluate(RunRules.java:20)
at com.carrotsearch.randomizedtesting.rules.StatementAdapter.evaluate(StatementAdapter.java:36)
at com.carrotsearch.randomizedtesting.ThreadLeakControl$StatementRunner.run(ThreadLeakControl.java:390)
at com.carrotsearch.randomizedtesting.ThreadLeakControl.forkTimeoutingTask(ThreadLeakControl.java:843)
at com.carrotsearch.randomizedtesting.ThreadLeakControl$3.evaluate(ThreadLeakControl.java:490)
at com.carrotsearch.randomizedtesting.RandomizedRunner.runSingleTest(RandomizedRunner.java:955)
at com.carrotsearch.randomizedtesting.RandomizedRunner$5.evaluate(RandomizedRunner.java:840)
at com.carrotsearch.randomizedtesting.RandomizedRunner$6.evaluate(RandomizedRunner.java:891)
at com.carrotsearch.randomizedtesting.RandomizedRunner$7.evaluate(RandomizedRunner.java:902)
at com.carrotsearch.randomizedtesting.rules.StatementAdapter.evaluate(StatementAdapter.java:36)
at com.carrotsearch.randomizedtesting.rules.SystemPropertiesRestoreRule$1.evaluate(SystemPropertiesRestoreRule.java:80)
at org.junit.rules.RunRules.evaluate(RunRules.java:20)
at org.apache.lucene.util.AbstractBeforeAfterRule$1.evaluate(AbstractBeforeAfterRule.java:45)
at com.carrotsearch.randomizedtesting.rules.StatementAdapter.evaluate(StatementAdapter.java:36)
at org.apache.lucene.util.TestRuleStoreClassName$1.evaluate(TestRuleStoreClassName.java:41)
at com.carrotsearch.randomizedtesting.rules.NoShadowingOrOverridesOnMethodsRule$1.evaluate(NoShadowingOrOverridesOnMethodsRule.java:40)
at com.carrotsearch.randomizedtesting.rules.NoShadowingOrOverridesOnMethodsRule$1.evaluate(NoShadowingOrOverridesOnMethodsRule.java:40)
at com.carrotsearch.randomizedtesting.rules.StatementAdapter.evaluate(StatementAdapter.java:36)
at com.carrotsearch.randomizedtesting.rules.StatementAdapter.evaluate(StatementAdapter.java:36)
at org.apache.lucene.util.TestRuleAssertionsRequired$1.evaluate(TestRuleAssertionsRequired.java:53)
at org.apache.lucene.util.TestRuleMarkFailure$1.evaluate(TestRuleMarkFailure.java:47)
at org.apache.lucene.util.TestRuleIgnoreAfterMaxFailures$1.evaluate(TestRuleIgnoreAfterMaxFailures.java:64)
at org.apache.lucene.util.TestRuleIgnoreTestSuites$1.evaluate(TestRuleIgnoreTestSuites.java:54)
at org.junit.rules.RunRules.evaluate(RunRules.java:20)
at com.carrotsearch.randomizedtesting.rules.StatementAdapter.evaluate(StatementAdapter.java:36)
at com.carrotsearch.randomizedtesting.ThreadLeakControl$StatementRunner.run(ThreadLeakControl.java:390)
at com.carrotsearch.randomizedtesting.ThreadLeakControl.lambda$forkTimeoutingTask$0(ThreadLeakControl.java:850)
at java.base/java.lang.Thread.run(Thread.java:1570)
FAILED: org.apache.solr.handler.TestContainerPlugin.testApiFromPackage
Error Message:
Error from server at http://127.0.0.1:50988/solr: Error parsing public keys in Package store: {responseHeader={status=500,QTime=30},error={metadata={error-class=org.apache.solr.common.SolrException,root-error-class=org.apache.solr.common.SolrException},msg=Error parsing public keys in Package store,trace=org.apache.solr.common.SolrException: Error parsing public keys in Package store at org.apache.solr.filestore.PackageStoreAPI$FSWrite.validate(PackageStoreAPI.java:250) at org.apache.solr.filestore.PackageStoreAPI$FSWrite.readSignatures(PackageStoreAPI.java:235) at org.apache.solr.filestore.PackageStoreAPI$FSWrite.upload(PackageStoreAPI.java:203) at org.apache.solr.api.AnnotatedApi$Cmd.invoke(AnnotatedApi.java:299) at org.apache.solr.api.AnnotatedApi.call(AnnotatedApi.java:175) at org.apache.solr.api.V2HttpCall.handleAdmin(V2HttpCall.java:341) at org.apache.solr.servlet.HttpSolrCall.handleAdminRequest(HttpSolrCall.java:807) at org.apache.solr.servlet.HttpSolrCall.call(HttpSolrCall.java:545) at org.apache.solr.servlet.SolrDispatchFilter.doFilter(SolrDispatchFilter.java:437) at org.apache.solr.servlet.SolrDispatchFilter.doFilter(SolrDispatchFilter.java:367) at org.eclipse.jetty.servlet.FilterHolder.doFilter(FilterHolder.java:193) at org.eclipse.jetty.servlet.ServletHandler$Chain.doFilter(ServletHandler.java:1626) at org.apache.solr.client.solrj.embedded.JettySolrRunner$DebugFilter.doFilter(JettySolrRunner.java:166) at org.eclipse.jetty.servlet.FilterHolder.doFilter(FilterHolder.java:193) at org.eclipse.jetty.servlet.ServletHandler$Chain.doFilter(ServletHandler.java:1626) at org.eclipse.jetty.servlet.ServletHandler.doHandle(ServletHandler.java:552) at org.eclipse.jetty.server.handler.ScopedHandler.nextHandle(ScopedHandler.java:233) at org.eclipse.jetty.server.session.SessionHandler.doHandle(SessionHandler.java:1624) at org.eclipse.jetty.server.handler.ScopedHandler.nextHandle(ScopedHandler.java:233) at org.eclipse.jetty.server.handler.ContextHandler.doHandle(ContextHandler.java:1440) at org.eclipse.jetty.server.handler.ScopedHandler.nextScope(ScopedHandler.java:188) at org.eclipse.jetty.servlet.ServletHandler.doScope(ServletHandler.java:505) at org.eclipse.jetty.server.session.SessionHandler.doScope(SessionHandler.java:1594) at org.eclipse.jetty.server.handler.ScopedHandler.nextScope(ScopedHandler.java:186) at org.eclipse.jetty.server.handler.ContextHandler.doScope(ContextHandler.java:1355) at org.eclipse.jetty.server.handler.ScopedHandler.handle(ScopedHandler.java:141) at org.eclipse.jetty.server.handler.HandlerWrapper.handle(HandlerWrapper.java:127) at org.eclipse.jetty.rewrite.handler.RewriteHandler.handle(RewriteHandler.java:322) at org.eclipse.jetty.server.handler.gzip.GzipHandler.handle(GzipHandler.java:722) at org.eclipse.jetty.server.handler.HandlerWrapper.handle(HandlerWrapper.java:127) at org.eclipse.jetty.server.Server.handle(Server.java:516) at org.eclipse.jetty.server.HttpChannel.lambda$handle$1(HttpChannel.java:487) at org.eclipse.jetty.server.HttpChannel.dispatch(HttpChannel.java:732) at org.eclipse.jetty.server.HttpChannel.handle(HttpChannel.java:479) at org.eclipse.jetty.server.HttpConnection.onFillable(HttpConnection.java:277) at org.eclipse.jetty.io.AbstractConnection$ReadCallback.succeeded(AbstractConnection.java:311) at org.eclipse.jetty.io.FillInterest.fillable(FillInterest.java:105) at org.eclipse.jetty.io.ChannelEndPoint$1.run(ChannelEndPoint.java:104) at org.eclipse.jetty.util.thread.QueuedThreadPool.runJob(QueuedThreadPool.java:883) at org.eclipse.jetty.util.thread.QueuedThreadPool$Runner.run(QueuedThreadPool.java:1034) at java.base/java.lang.Thread.run(Thread.java:1570) ,code=500}}
Stack Trace:
org.apache.solr.client.solrj.impl.HttpSolrClient$RemoteExecutionException: Error from server at http://127.0.0.1:50988/solr: Error parsing public keys in Package store: {responseHeader={status=500,QTime=30},error={metadata={error-class=org.apache.solr.common.SolrException,root-error-class=org.apache.solr.common.SolrException},msg=Error parsing public keys in Package store,trace=org.apache.solr.common.SolrException: Error parsing public keys in Package store
at org.apache.solr.filestore.PackageStoreAPI$FSWrite.validate(PackageStoreAPI.java:250)
at org.apache.solr.filestore.PackageStoreAPI$FSWrite.readSignatures(PackageStoreAPI.java:235)
at org.apache.solr.filestore.PackageStoreAPI$FSWrite.upload(PackageStoreAPI.java:203)
at org.apache.solr.api.AnnotatedApi$Cmd.invoke(AnnotatedApi.java:299)
at org.apache.solr.api.AnnotatedApi.call(AnnotatedApi.java:175)
at org.apache.solr.api.V2HttpCall.handleAdmin(V2HttpCall.java:341)
at org.apache.solr.servlet.HttpSolrCall.handleAdminRequest(HttpSolrCall.java:807)
at org.apache.solr.servlet.HttpSolrCall.call(HttpSolrCall.java:545)
at org.apache.solr.servlet.SolrDispatchFilter.doFilter(SolrDispatchFilter.java:437)
at org.apache.solr.servlet.SolrDispatchFilter.doFilter(SolrDispatchFilter.java:367)
at org.eclipse.jetty.servlet.FilterHolder.doFilter(FilterHolder.java:193)
at org.eclipse.jetty.servlet.ServletHandler$Chain.doFilter(ServletHandler.java:1626)
at org.apache.solr.client.solrj.embedded.JettySolrRunner$DebugFilter.doFilter(JettySolrRunner.java:166)
at org.eclipse.jetty.servlet.FilterHolder.doFilter(FilterHolder.java:193)
at org.eclipse.jetty.servlet.ServletHandler$Chain.doFilter(ServletHandler.java:1626)
at org.eclipse.jetty.servlet.ServletHandler.doHandle(ServletHandler.java:552)
at org.eclipse.jetty.server.handler.ScopedHandler.nextHandle(ScopedHandler.java:233)
at org.eclipse.jetty.server.session.SessionHandler.doHandle(SessionHandler.java:1624)
at org.eclipse.jetty.server.handler.ScopedHandler.nextHandle(ScopedHandler.java:233)
at org.eclipse.jetty.server.handler.ContextHandler.doHandle(ContextHandler.java:1440)
at org.eclipse.jetty.server.handler.ScopedHandler.nextScope(ScopedHandler.java:188)
at org.eclipse.jetty.servlet.ServletHandler.doScope(ServletHandler.java:505)
at org.eclipse.jetty.server.session.SessionHandler.doScope(SessionHandler.java:1594)
at org.eclipse.jetty.server.handler.ScopedHandler.nextScope(ScopedHandler.java:186)
at org.eclipse.jetty.server.handler.ContextHandler.doScope(ContextHandler.java:1355)
at org.eclipse.jetty.server.handler.ScopedHandler.handle(ScopedHandler.java:141)
at org.eclipse.jetty.server.handler.HandlerWrapper.handle(HandlerWrapper.java:127)
at org.eclipse.jetty.rewrite.handler.RewriteHandler.handle(RewriteHandler.java:322)
at org.eclipse.jetty.server.handler.gzip.GzipHandler.handle(GzipHandler.java:722)
at org.eclipse.jetty.server.handler.HandlerWrapper.handle(HandlerWrapper.java:127)
at org.eclipse.jetty.server.Server.handle(Server.java:516)
at org.eclipse.jetty.server.HttpChannel.lambda$handle$1(HttpChannel.java:487)
at org.eclipse.jetty.server.HttpChannel.dispatch(HttpChannel.java:732)
at org.eclipse.jetty.server.HttpChannel.handle(HttpChannel.java:479)
at org.eclipse.jetty.server.HttpConnection.onFillable(HttpConnection.java:277)
at org.eclipse.jetty.io.AbstractConnection$ReadCallback.succeeded(AbstractConnection.java:311)
at org.eclipse.jetty.io.FillInterest.fillable(FillInterest.java:105)
at org.eclipse.jetty.io.ChannelEndPoint$1.run(ChannelEndPoint.java:104)
at org.eclipse.jetty.util.thread.QueuedThreadPool.runJob(QueuedThreadPool.java:883)
at org.eclipse.jetty.util.thread.QueuedThreadPool$Runner.run(QueuedThreadPool.java:1034)
at java.base/java.lang.Thread.run(Thread.java:1570)
,code=500}}
at __randomizedtesting.SeedInfo.seed([F75DE56C210DA983:1A031D1D13477E0A]:0)
at org.apache.solr.client.solrj.impl.BaseHttpSolrClient$RemoteExecutionException.create(BaseHttpSolrClient.java:67)
at org.apache.solr.client.solrj.impl.HttpSolrClient.executeMethod(HttpSolrClient.java:647)
at org.apache.solr.client.solrj.impl.HttpSolrClient.request(HttpSolrClient.java:266)
at org.apache.solr.client.solrj.impl.HttpSolrClient.request(HttpSolrClient.java:248)
at org.apache.solr.client.solrj.impl.LBSolrClient.doRequest(LBSolrClient.java:369)
at org.apache.solr.client.solrj.impl.LBSolrClient.request(LBSolrClient.java:297)
at org.apache.solr.client.solrj.impl.BaseCloudSolrClient.sendRequest(BaseCloudSolrClient.java:1188)
at org.apache.solr.client.solrj.impl.BaseCloudSolrClient.requestWithRetryOnStaleState(BaseCloudSolrClient.java:934)
at org.apache.solr.client.solrj.impl.BaseCloudSolrClient.request(BaseCloudSolrClient.java:866)
at org.apache.solr.client.solrj.SolrRequest.process(SolrRequest.java:225)
at org.apache.solr.client.solrj.SolrRequest.process(SolrRequest.java:242)
at org.apache.solr.filestore.TestDistribPackageStore.postFile(TestDistribPackageStore.java:288)
at org.apache.solr.pkg.TestPackages.postFileAndWait(TestPackages.java:812)
at org.apache.solr.handler.TestContainerPlugin.testApiFromPackage(TestContainerPlugin.java:202)
at java.base/jdk.internal.reflect.DirectMethodHandleAccessor.invoke(DirectMethodHandleAccessor.java:103)
at java.base/java.lang.reflect.Method.invoke(Method.java:580)
at com.carrotsearch.randomizedtesting.RandomizedRunner.invoke(RandomizedRunner.java:1758)
at com.carrotsearch.randomizedtesting.RandomizedRunner$8.evaluate(RandomizedRunner.java:946)
at com.carrotsearch.randomizedtesting.RandomizedRunner$9.evaluate(RandomizedRunner.java:982)
at com.carrotsearch.randomizedtesting.RandomizedRunner$10.evaluate(RandomizedRunner.java:996)
at com.carrotsearch.randomizedtesting.rules.SystemPropertiesRestoreRule$1.evaluate(SystemPropertiesRestoreRule.java:80)
at org.junit.rules.RunRules.evaluate(RunRules.java:20)
at org.apache.lucene.util.TestRuleSetupTeardownChained$1.evaluate(TestRuleSetupTeardownChained.java:49)
at org.apache.lucene.util.AbstractBeforeAfterRule$1.evaluate(AbstractBeforeAfterRule.java:45)
at org.apache.lucene.util.TestRuleThreadAndTestName$1.evaluate(TestRuleThreadAndTestName.java:48)
at org.apache.lucene.util.TestRuleIgnoreAfterMaxFailures$1.evaluate(TestRuleIgnoreAfterMaxFailures.java:64)
at org.apache.lucene.util.TestRuleMarkFailure$1.evaluate(TestRuleMarkFailure.java:47)
at org.junit.rules.RunRules.evaluate(RunRules.java:20)
at com.carrotsearch.randomizedtesting.rules.StatementAdapter.evaluate(StatementAdapter.java:36)
at com.carrotsearch.randomizedtesting.ThreadLeakControl$StatementRunner.run(ThreadLeakControl.java:390)
at com.carrotsearch.randomizedtesting.ThreadLeakControl.forkTimeoutingTask(ThreadLeakControl.java:843)
at com.carrotsearch.randomizedtesting.ThreadLeakControl$3.evaluate(ThreadLeakControl.java:490)
at com.carrotsearch.randomizedtesting.RandomizedRunner.runSingleTest(RandomizedRunner.java:955)
at com.carrotsearch.randomizedtesting.RandomizedRunner$5.evaluate(RandomizedRunner.java:840)
at com.carrotsearch.randomizedtesting.RandomizedRunner$6.evaluate(RandomizedRunner.java:891)
at com.carrotsearch.randomizedtesting.RandomizedRunner$7.evaluate(RandomizedRunner.java:902)
at com.carrotsearch.randomizedtesting.rules.StatementAdapter.evaluate(StatementAdapter.java:36)
at com.carrotsearch.randomizedtesting.rules.SystemPropertiesRestoreRule$1.evaluate(SystemPropertiesRestoreRule.java:80)
at org.junit.rules.RunRules.evaluate(RunRules.java:20)
at org.apache.lucene.util.AbstractBeforeAfterRule$1.evaluate(AbstractBeforeAfterRule.java:45)
at com.carrotsearch.randomizedtesting.rules.StatementAdapter.evaluate(StatementAdapter.java:36)
at org.apache.lucene.util.TestRuleStoreClassName$1.evaluate(TestRuleStoreClassName.java:41)
at com.carrotsearch.randomizedtesting.rules.NoShadowingOrOverridesOnMethodsRule$1.evaluate(NoShadowingOrOverridesOnMethodsRule.java:40)
at com.carrotsearch.randomizedtesting.rules.NoShadowingOrOverridesOnMethodsRule$1.evaluate(NoShadowingOrOverridesOnMethodsRule.java:40)
at com.carrotsearch.randomizedtesting.rules.StatementAdapter.evaluate(StatementAdapter.java:36)
at com.carrotsearch.randomizedtesting.rules.StatementAdapter.evaluate(StatementAdapter.java:36)
at org.apache.lucene.util.TestRuleAssertionsRequired$1.evaluate(TestRuleAssertionsRequired.java:53)
at org.apache.lucene.util.TestRuleMarkFailure$1.evaluate(TestRuleMarkFailure.java:47)
at org.apache.lucene.util.TestRuleIgnoreAfterMaxFailures$1.evaluate(TestRuleIgnoreAfterMaxFailures.java:64)
at org.apache.lucene.util.TestRuleIgnoreTestSuites$1.evaluate(TestRuleIgnoreTestSuites.java:54)
at org.junit.rules.RunRules.evaluate(RunRules.java:20)
at com.carrotsearch.randomizedtesting.rules.StatementAdapter.evaluate(StatementAdapter.java:36)
at com.carrotsearch.randomizedtesting.ThreadLeakControl$StatementRunner.run(ThreadLeakControl.java:390)
at com.carrotsearch.randomizedtesting.ThreadLeakControl.lambda$forkTimeoutingTask$0(ThreadLeakControl.java:850)
at java.base/java.lang.Thread.run(Thread.java:1570)
FAILED: org.apache.solr.handler.TestContainerPlugin.testApiFromPackage
Error Message:
Error from server at http://127.0.0.1:50999/solr: Error parsing public keys in Package store: {responseHeader={status=500,QTime=24},error={metadata={error-class=org.apache.solr.common.SolrException,root-error-class=org.apache.solr.common.SolrException},msg=Error parsing public keys in Package store,trace=org.apache.solr.common.SolrException: Error parsing public keys in Package store at org.apache.solr.filestore.PackageStoreAPI$FSWrite.validate(PackageStoreAPI.java:250) at org.apache.solr.filestore.PackageStoreAPI$FSWrite.readSignatures(PackageStoreAPI.java:235) at org.apache.solr.filestore.PackageStoreAPI$FSWrite.upload(PackageStoreAPI.java:203) at org.apache.solr.api.AnnotatedApi$Cmd.invoke(AnnotatedApi.java:299) at org.apache.solr.api.AnnotatedApi.call(AnnotatedApi.java:175) at org.apache.solr.api.V2HttpCall.handleAdmin(V2HttpCall.java:341) at org.apache.solr.servlet.HttpSolrCall.handleAdminRequest(HttpSolrCall.java:807) at org.apache.solr.servlet.HttpSolrCall.call(HttpSolrCall.java:545) at org.apache.solr.servlet.SolrDispatchFilter.doFilter(SolrDispatchFilter.java:437) at org.apache.solr.servlet.SolrDispatchFilter.doFilter(SolrDispatchFilter.java:367) at org.eclipse.jetty.servlet.FilterHolder.doFilter(FilterHolder.java:193) at org.eclipse.jetty.servlet.ServletHandler$Chain.doFilter(ServletHandler.java:1626) at org.apache.solr.client.solrj.embedded.JettySolrRunner$DebugFilter.doFilter(JettySolrRunner.java:166) at org.eclipse.jetty.servlet.FilterHolder.doFilter(FilterHolder.java:193) at org.eclipse.jetty.servlet.ServletHandler$Chain.doFilter(ServletHandler.java:1626) at org.eclipse.jetty.servlet.ServletHandler.doHandle(ServletHandler.java:552) at org.eclipse.jetty.server.handler.ScopedHandler.nextHandle(ScopedHandler.java:233) at org.eclipse.jetty.server.session.SessionHandler.doHandle(SessionHandler.java:1624) at org.eclipse.jetty.server.handler.ScopedHandler.nextHandle(ScopedHandler.java:233) at org.eclipse.jetty.server.handler.ContextHandler.doHandle(ContextHandler.java:1440) at org.eclipse.jetty.server.handler.ScopedHandler.nextScope(ScopedHandler.java:188) at org.eclipse.jetty.servlet.ServletHandler.doScope(ServletHandler.java:505) at org.eclipse.jetty.server.session.SessionHandler.doScope(SessionHandler.java:1594) at org.eclipse.jetty.server.handler.ScopedHandler.nextScope(ScopedHandler.java:186) at org.eclipse.jetty.server.handler.ContextHandler.doScope(ContextHandler.java:1355) at org.eclipse.jetty.server.handler.ScopedHandler.handle(ScopedHandler.java:141) at org.eclipse.jetty.server.handler.HandlerWrapper.handle(HandlerWrapper.java:127) at org.eclipse.jetty.rewrite.handler.RewriteHandler.handle(RewriteHandler.java:322) at org.eclipse.jetty.server.handler.gzip.GzipHandler.handle(GzipHandler.java:722) at org.eclipse.jetty.server.handler.HandlerWrapper.handle(HandlerWrapper.java:127) at org.eclipse.jetty.server.Server.handle(Server.java:516) at org.eclipse.jetty.server.HttpChannel.lambda$handle$1(HttpChannel.java:487) at org.eclipse.jetty.server.HttpChannel.dispatch(HttpChannel.java:732) at org.eclipse.jetty.server.HttpChannel.handle(HttpChannel.java:479) at org.eclipse.jetty.server.HttpConnection.onFillable(HttpConnection.java:277) at org.eclipse.jetty.io.AbstractConnection$ReadCallback.succeeded(AbstractConnection.java:311) at org.eclipse.jetty.io.FillInterest.fillable(FillInterest.java:105) at org.eclipse.jetty.io.ChannelEndPoint$1.run(ChannelEndPoint.java:104) at org.eclipse.jetty.util.thread.QueuedThreadPool.runJob(QueuedThreadPool.java:883) at org.eclipse.jetty.util.thread.QueuedThreadPool$Runner.run(QueuedThreadPool.java:1034) at java.base/java.lang.Thread.run(Thread.java:1570) ,code=500}}
Stack Trace:
org.apache.solr.client.solrj.impl.HttpSolrClient$RemoteExecutionException: Error from server at http://127.0.0.1:50999/solr: Error parsing public keys in Package store: {responseHeader={status=500,QTime=24},error={metadata={error-class=org.apache.solr.common.SolrException,root-error-class=org.apache.solr.common.SolrException},msg=Error parsing public keys in Package store,trace=org.apache.solr.common.SolrException: Error parsing public keys in Package store
at org.apache.solr.filestore.PackageStoreAPI$FSWrite.validate(PackageStoreAPI.java:250)
at org.apache.solr.filestore.PackageStoreAPI$FSWrite.readSignatures(PackageStoreAPI.java:235)
at org.apache.solr.filestore.PackageStoreAPI$FSWrite.upload(PackageStoreAPI.java:203)
at org.apache.solr.api.AnnotatedApi$Cmd.invoke(AnnotatedApi.java:299)
at org.apache.solr.api.AnnotatedApi.call(AnnotatedApi.java:175)
at org.apache.solr.api.V2HttpCall.handleAdmin(V2HttpCall.java:341)
at org.apache.solr.servlet.HttpSolrCall.handleAdminRequest(HttpSolrCall.java:807)
at org.apache.solr.servlet.HttpSolrCall.call(HttpSolrCall.java:545)
at org.apache.solr.servlet.SolrDispatchFilter.doFilter(SolrDispatchFilter.java:437)
at org.apache.solr.servlet.SolrDispatchFilter.doFilter(SolrDispatchFilter.java:367)
at org.eclipse.jetty.servlet.FilterHolder.doFilter(FilterHolder.java:193)
at org.eclipse.jetty.servlet.ServletHandler$Chain.doFilter(ServletHandler.java:1626)
at org.apache.solr.client.solrj.embedded.JettySolrRunner$DebugFilter.doFilter(JettySolrRunner.java:166)
at org.eclipse.jetty.servlet.FilterHolder.doFilter(FilterHolder.java:193)
at org.eclipse.jetty.servlet.ServletHandler$Chain.doFilter(ServletHandler.java:1626)
at org.eclipse.jetty.servlet.ServletHandler.doHandle(ServletHandler.java:552)
at org.eclipse.jetty.server.handler.ScopedHandler.nextHandle(ScopedHandler.java:233)
at org.eclipse.jetty.server.session.SessionHandler.doHandle(SessionHandler.java:1624)
at org.eclipse.jetty.server.handler.ScopedHandler.nextHandle(ScopedHandler.java:233)
at org.eclipse.jetty.server.handler.ContextHandler.doHandle(ContextHandler.java:1440)
at org.eclipse.jetty.server.handler.ScopedHandler.nextScope(ScopedHandler.java:188)
at org.eclipse.jetty.servlet.ServletHandler.doScope(ServletHandler.java:505)
at org.eclipse.jetty.server.session.SessionHandler.doScope(SessionHandler.java:1594)
at org.eclipse.jetty.server.handler.ScopedHandler.nextScope(ScopedHandler.java:186)
at org.eclipse.jetty.server.handler.ContextHandler.doScope(ContextHandler.java:1355)
at org.eclipse.jetty.server.handler.ScopedHandler.handle(ScopedHandler.java:141)
at org.eclipse.jetty.server.handler.HandlerWrapper.handle(HandlerWrapper.java:127)
at org.eclipse.jetty.rewrite.handler.RewriteHandler.handle(RewriteHandler.java:322)
at org.eclipse.jetty.server.handler.gzip.GzipHandler.handle(GzipHandler.java:722)
at org.eclipse.jetty.server.handler.HandlerWrapper.handle(HandlerWrapper.java:127)
at org.eclipse.jetty.server.Server.handle(Server.java:516)
at org.eclipse.jetty.server.HttpChannel.lambda$handle$1(HttpChannel.java:487)
at org.eclipse.jetty.server.HttpChannel.dispatch(HttpChannel.java:732)
at org.eclipse.jetty.server.HttpChannel.handle(HttpChannel.java:479)
at org.eclipse.jetty.server.HttpConnection.onFillable(HttpConnection.java:277)
at org.eclipse.jetty.io.AbstractConnection$ReadCallback.succeeded(AbstractConnection.java:311)
at org.eclipse.jetty.io.FillInterest.fillable(FillInterest.java:105)
at org.eclipse.jetty.io.ChannelEndPoint$1.run(ChannelEndPoint.java:104)
at org.eclipse.jetty.util.thread.QueuedThreadPool.runJob(QueuedThreadPool.java:883)
at org.eclipse.jetty.util.thread.QueuedThreadPool$Runner.run(QueuedThreadPool.java:1034)
at java.base/java.lang.Thread.run(Thread.java:1570)
,code=500}}
at __randomizedtesting.SeedInfo.seed([F75DE56C210DA983:1A031D1D13477E0A]:0)
at org.apache.solr.client.solrj.impl.BaseHttpSolrClient$RemoteExecutionException.create(BaseHttpSolrClient.java:67)
at org.apache.solr.client.solrj.impl.HttpSolrClient.executeMethod(HttpSolrClient.java:647)
at org.apache.solr.client.solrj.impl.HttpSolrClient.request(HttpSolrClient.java:266)
at org.apache.solr.client.solrj.impl.HttpSolrClient.request(HttpSolrClient.java:248)
at org.apache.solr.client.solrj.impl.LBSolrClient.doRequest(LBSolrClient.java:369)
at org.apache.solr.client.solrj.impl.LBSolrClient.request(LBSolrClient.java:297)
at org.apache.solr.client.solrj.impl.BaseCloudSolrClient.sendRequest(BaseCloudSolrClient.java:1188)
at org.apache.solr.client.solrj.impl.BaseCloudSolrClient.requestWithRetryOnStaleState(BaseCloudSolrClient.java:934)
at org.apache.solr.client.solrj.impl.BaseCloudSolrClient.request(BaseCloudSolrClient.java:866)
at org.apache.solr.client.solrj.SolrRequest.process(SolrRequest.java:225)
at org.apache.solr.client.solrj.SolrRequest.process(SolrRequest.java:242)
at org.apache.solr.filestore.TestDistribPackageStore.postFile(TestDistribPackageStore.java:288)
at org.apache.solr.pkg.TestPackages.postFileAndWait(TestPackages.java:812)
at org.apache.solr.handler.TestContainerPlugin.testApiFromPackage(TestContainerPlugin.java:202)
at java.base/jdk.internal.reflect.DirectMethodHandleAccessor.invoke(DirectMethodHandleAccessor.java:103)
at java.base/java.lang.reflect.Method.invoke(Method.java:580)
at com.carrotsearch.randomizedtesting.RandomizedRunner.invoke(RandomizedRunner.java:1758)
at com.carrotsearch.randomizedtesting.RandomizedRunner$8.evaluate(RandomizedRunner.java:946)
at com.carrotsearch.randomizedtesting.RandomizedRunner$9.evaluate(RandomizedRunner.java:982)
at com.carrotsearch.randomizedtesting.RandomizedRunner$10.evaluate(RandomizedRunner.java:996)
at com.carrotsearch.randomizedtesting.rules.SystemPropertiesRestoreRule$1.evaluate(SystemPropertiesRestoreRule.java:80)
at org.junit.rules.RunRules.evaluate(RunRules.java:20)
at org.apache.lucene.util.TestRuleSetupTeardownChained$1.evaluate(TestRuleSetupTeardownChained.java:49)
at org.apache.lucene.util.AbstractBeforeAfterRule$1.evaluate(AbstractBeforeAfterRule.java:45)
at org.apache.lucene.util.TestRuleThreadAndTestName$1.evaluate(TestRuleThreadAndTestName.java:48)
at org.apache.lucene.util.TestRuleIgnoreAfterMaxFailures$1.evaluate(TestRuleIgnoreAfterMaxFailures.java:64)
at org.apache.lucene.util.TestRuleMarkFailure$1.evaluate(TestRuleMarkFailure.java:47)
at org.junit.rules.RunRules.evaluate(RunRules.java:20)
at com.carrotsearch.randomizedtesting.rules.StatementAdapter.evaluate(StatementAdapter.java:36)
at com.carrotsearch.randomizedtesting.ThreadLeakControl$StatementRunner.run(ThreadLeakControl.java:390)
at com.carrotsearch.randomizedtesting.ThreadLeakControl.forkTimeoutingTask(ThreadLeakControl.java:843)
at com.carrotsearch.randomizedtesting.ThreadLeakControl$3.evaluate(ThreadLeakControl.java:490)
at com.carrotsearch.randomizedtesting.RandomizedRunner.runSingleTest(RandomizedRunner.java:955)
at com.carrotsearch.randomizedtesting.RandomizedRunner$5.evaluate(RandomizedRunner.java:840)
at com.carrotsearch.randomizedtesting.RandomizedRunner$6.evaluate(RandomizedRunner.java:891)
at com.carrotsearch.randomizedtesting.RandomizedRunner$7.evaluate(RandomizedRunner.java:902)
at com.carrotsearch.randomizedtesting.rules.StatementAdapter.evaluate(StatementAdapter.java:36)
at com.carrotsearch.randomizedtesting.rules.SystemPropertiesRestoreRule$1.evaluate(SystemPropertiesRestoreRule.java:80)
at org.junit.rules.RunRules.evaluate(RunRules.java:20)
at org.apache.lucene.util.AbstractBeforeAfterRule$1.evaluate(AbstractBeforeAfterRule.java:45)
at com.carrotsearch.randomizedtesting.rules.StatementAdapter.evaluate(StatementAdapter.java:36)
at org.apache.lucene.util.TestRuleStoreClassName$1.evaluate(TestRuleStoreClassName.java:41)
at com.carrotsearch.randomizedtesting.rules.NoShadowingOrOverridesOnMethodsRule$1.evaluate(NoShadowingOrOverridesOnMethodsRule.java:40)
at com.carrotsearch.randomizedtesting.rules.NoShadowingOrOverridesOnMethodsRule$1.evaluate(NoShadowingOrOverridesOnMethodsRule.java:40)
at com.carrotsearch.randomizedtesting.rules.StatementAdapter.evaluate(StatementAdapter.java:36)
at com.carrotsearch.randomizedtesting.rules.StatementAdapter.evaluate(StatementAdapter.java:36)
at org.apache.lucene.util.TestRuleAssertionsRequired$1.evaluate(TestRuleAssertionsRequired.java:53)
at org.apache.lucene.util.TestRuleMarkFailure$1.evaluate(TestRuleMarkFailure.java:47)
at org.apache.lucene.util.TestRuleIgnoreAfterMaxFailures$1.evaluate(TestRuleIgnoreAfterMaxFailures.java:64)
at org.apache.lucene.util.TestRuleIgnoreTestSuites$1.evaluate(TestRuleIgnoreTestSuites.java:54)
at org.junit.rules.RunRules.evaluate(RunRules.java:20)
at com.carrotsearch.randomizedtesting.rules.StatementAdapter.evaluate(StatementAdapter.java:36)
at com.carrotsearch.randomizedtesting.ThreadLeakControl$StatementRunner.run(ThreadLeakControl.java:390)
at com.carrotsearch.randomizedtesting.ThreadLeakControl.lambda$forkTimeoutingTask$0(ThreadLeakControl.java:850)
at java.base/java.lang.Thread.run(Thread.java:1570)
FAILED: org.apache.solr.handler.TestContainerPlugin.testApiFromPackage
Error Message:
Error from server at http://127.0.0.1:51021/solr: Error parsing public keys in Package store: {responseHeader={status=500,QTime=107},error={metadata={error-class=org.apache.solr.common.SolrException,root-error-class=org.apache.solr.common.SolrException},msg=Error parsing public keys in Package store,trace=org.apache.solr.common.SolrException: Error parsing public keys in Package store at org.apache.solr.filestore.PackageStoreAPI$FSWrite.validate(PackageStoreAPI.java:250) at org.apache.solr.filestore.PackageStoreAPI$FSWrite.readSignatures(PackageStoreAPI.java:235) at org.apache.solr.filestore.PackageStoreAPI$FSWrite.upload(PackageStoreAPI.java:203) at org.apache.solr.api.AnnotatedApi$Cmd.invoke(AnnotatedApi.java:299) at org.apache.solr.api.AnnotatedApi.call(AnnotatedApi.java:175) at org.apache.solr.api.V2HttpCall.handleAdmin(V2HttpCall.java:341) at org.apache.solr.servlet.HttpSolrCall.handleAdminRequest(HttpSolrCall.java:807) at org.apache.solr.servlet.HttpSolrCall.call(HttpSolrCall.java:545) at org.apache.solr.servlet.SolrDispatchFilter.doFilter(SolrDispatchFilter.java:437) at org.apache.solr.servlet.SolrDispatchFilter.doFilter(SolrDispatchFilter.java:367) at org.eclipse.jetty.servlet.FilterHolder.doFilter(FilterHolder.java:193) at org.eclipse.jetty.servlet.ServletHandler$Chain.doFilter(ServletHandler.java:1626) at org.apache.solr.client.solrj.embedded.JettySolrRunner$DebugFilter.doFilter(JettySolrRunner.java:166) at org.eclipse.jetty.servlet.FilterHolder.doFilter(FilterHolder.java:193) at org.eclipse.jetty.servlet.ServletHandler$Chain.doFilter(ServletHandler.java:1626) at org.eclipse.jetty.servlet.ServletHandler.doHandle(ServletHandler.java:552) at org.eclipse.jetty.server.handler.ScopedHandler.nextHandle(ScopedHandler.java:233) at org.eclipse.jetty.server.session.SessionHandler.doHandle(SessionHandler.java:1624) at org.eclipse.jetty.server.handler.ScopedHandler.nextHandle(ScopedHandler.java:233) at org.eclipse.jetty.server.handler.ContextHandler.doHandle(ContextHandler.java:1440) at org.eclipse.jetty.server.handler.ScopedHandler.nextScope(ScopedHandler.java:188) at org.eclipse.jetty.servlet.ServletHandler.doScope(ServletHandler.java:505) at org.eclipse.jetty.server.session.SessionHandler.doScope(SessionHandler.java:1594) at org.eclipse.jetty.server.handler.ScopedHandler.nextScope(ScopedHandler.java:186) at org.eclipse.jetty.server.handler.ContextHandler.doScope(ContextHandler.java:1355) at org.eclipse.jetty.server.handler.ScopedHandler.handle(ScopedHandler.java:141) at org.eclipse.jetty.server.handler.HandlerWrapper.handle(HandlerWrapper.java:127) at org.eclipse.jetty.rewrite.handler.RewriteHandler.handle(RewriteHandler.java:322) at org.eclipse.jetty.server.handler.gzip.GzipHandler.handle(GzipHandler.java:722) at org.eclipse.jetty.server.handler.HandlerWrapper.handle(HandlerWrapper.java:127) at org.eclipse.jetty.server.Server.handle(Server.java:516) at org.eclipse.jetty.server.HttpChannel.lambda$handle$1(HttpChannel.java:487) at org.eclipse.jetty.server.HttpChannel.dispatch(HttpChannel.java:732) at org.eclipse.jetty.server.HttpChannel.handle(HttpChannel.java:479) at org.eclipse.jetty.server.HttpConnection.onFillable(HttpConnection.java:277) at org.eclipse.jetty.io.AbstractConnection$ReadCallback.succeeded(AbstractConnection.java:311) at org.eclipse.jetty.io.FillInterest.fillable(FillInterest.java:105) at org.eclipse.jetty.io.ChannelEndPoint$1.run(ChannelEndPoint.java:104) at org.eclipse.jetty.util.thread.QueuedThreadPool.runJob(QueuedThreadPool.java:883) at org.eclipse.jetty.util.thread.QueuedThreadPool$Runner.run(QueuedThreadPool.java:1034) at java.base/java.lang.Thread.run(Thread.java:1570) ,code=500}}
Stack Trace:
org.apache.solr.client.solrj.impl.HttpSolrClient$RemoteExecutionException: Error from server at http://127.0.0.1:51021/solr: Error parsing public keys in Package store: {responseHeader={status=500,QTime=107},error={metadata={error-class=org.apache.solr.common.SolrException,root-error-class=org.apache.solr.common.SolrException},msg=Error parsing public keys in Package store,trace=org.apache.solr.common.SolrException: Error parsing public keys in Package store
at org.apache.solr.filestore.PackageStoreAPI$FSWrite.validate(PackageStoreAPI.java:250)
at org.apache.solr.filestore.PackageStoreAPI$FSWrite.readSignatures(PackageStoreAPI.java:235)
at org.apache.solr.filestore.PackageStoreAPI$FSWrite.upload(PackageStoreAPI.java:203)
at org.apache.solr.api.AnnotatedApi$Cmd.invoke(AnnotatedApi.java:299)
at org.apache.solr.api.AnnotatedApi.call(AnnotatedApi.java:175)
at org.apache.solr.api.V2HttpCall.handleAdmin(V2HttpCall.java:341)
at org.apache.solr.servlet.HttpSolrCall.handleAdminRequest(HttpSolrCall.java:807)
at org.apache.solr.servlet.HttpSolrCall.call(HttpSolrCall.java:545)
at org.apache.solr.servlet.SolrDispatchFilter.doFilter(SolrDispatchFilter.java:437)
at org.apache.solr.servlet.SolrDispatchFilter.doFilter(SolrDispatchFilter.java:367)
at org.eclipse.jetty.servlet.FilterHolder.doFilter(FilterHolder.java:193)
at org.eclipse.jetty.servlet.ServletHandler$Chain.doFilter(ServletHandler.java:1626)
at org.apache.solr.client.solrj.embedded.JettySolrRunner$DebugFilter.doFilter(JettySolrRunner.java:166)
at org.eclipse.jetty.servlet.FilterHolder.doFilter(FilterHolder.java:193)
at org.eclipse.jetty.servlet.ServletHandler$Chain.doFilter(ServletHandler.java:1626)
at org.eclipse.jetty.servlet.ServletHandler.doHandle(ServletHandler.java:552)
at org.eclipse.jetty.server.handler.ScopedHandler.nextHandle(ScopedHandler.java:233)
at org.eclipse.jetty.server.session.SessionHandler.doHandle(SessionHandler.java:1624)
at org.eclipse.jetty.server.handler.ScopedHandler.nextHandle(ScopedHandler.java:233)
at org.eclipse.jetty.server.handler.ContextHandler.doHandle(ContextHandler.java:1440)
at org.eclipse.jetty.server.handler.ScopedHandler.nextScope(ScopedHandler.java:188)
at org.eclipse.jetty.servlet.ServletHandler.doScope(ServletHandler.java:505)
at org.eclipse.jetty.server.session.SessionHandler.doScope(SessionHandler.java:1594)
at org.eclipse.jetty.server.handler.ScopedHandler.nextScope(ScopedHandler.java:186)
at org.eclipse.jetty.server.handler.ContextHandler.doScope(ContextHandler.java:1355)
at org.eclipse.jetty.server.handler.ScopedHandler.handle(ScopedHandler.java:141)
at org.eclipse.jetty.server.handler.HandlerWrapper.handle(HandlerWrapper.java:127)
at org.eclipse.jetty.rewrite.handler.RewriteHandler.handle(RewriteHandler.java:322)
at org.eclipse.jetty.server.handler.gzip.GzipHandler.handle(GzipHandler.java:722)
at org.eclipse.jetty.server.handler.HandlerWrapper.handle(HandlerWrapper.java:127)
at org.eclipse.jetty.server.Server.handle(Server.java:516)
at org.eclipse.jetty.server.HttpChannel.lambda$handle$1(HttpChannel.java:487)
at org.eclipse.jetty.server.HttpChannel.dispatch(HttpChannel.java:732)
at org.eclipse.jetty.server.HttpChannel.handle(HttpChannel.java:479)
at org.eclipse.jetty.server.HttpConnection.onFillable(HttpConnection.java:277)
at org.eclipse.jetty.io.AbstractConnection$ReadCallback.succeeded(AbstractConnection.java:311)
at org.eclipse.jetty.io.FillInterest.fillable(FillInterest.java:105)
at org.eclipse.jetty.io.ChannelEndPoint$1.run(ChannelEndPoint.java:104)
at org.eclipse.jetty.util.thread.QueuedThreadPool.runJob(QueuedThreadPool.java:883)
at org.eclipse.jetty.util.thread.QueuedThreadPool$Runner.run(QueuedThreadPool.java:1034)
at java.base/java.lang.Thread.run(Thread.java:1570)
,code=500}}
at __randomizedtesting.SeedInfo.seed([F75DE56C210DA983:1A031D1D13477E0A]:0)
at org.apache.solr.client.solrj.impl.BaseHttpSolrClient$RemoteExecutionException.create(BaseHttpSolrClient.java:67)
at org.apache.solr.client.solrj.impl.HttpSolrClient.executeMethod(HttpSolrClient.java:647)
at org.apache.solr.client.solrj.impl.HttpSolrClient.request(HttpSolrClient.java:266)
at org.apache.solr.client.solrj.impl.HttpSolrClient.request(HttpSolrClient.java:248)
at org.apache.solr.client.solrj.impl.LBSolrClient.doRequest(LBSolrClient.java:369)
at org.apache.solr.client.solrj.impl.LBSolrClient.request(LBSolrClient.java:297)
at org.apache.solr.client.solrj.impl.BaseCloudSolrClient.sendRequest(BaseCloudSolrClient.java:1188)
at org.apache.solr.client.solrj.impl.BaseCloudSolrClient.requestWithRetryOnStaleState(BaseCloudSolrClient.java:934)
at org.apache.solr.client.solrj.impl.BaseCloudSolrClient.request(BaseCloudSolrClient.java:866)
at org.apache.solr.client.solrj.SolrRequest.process(SolrRequest.java:225)
at org.apache.solr.client.solrj.SolrRequest.process(SolrRequest.java:242)
at org.apache.solr.filestore.TestDistribPackageStore.postFile(TestDistribPackageStore.java:288)
at org.apache.solr.pkg.TestPackages.postFileAndWait(TestPackages.java:812)
at org.apache.solr.handler.TestContainerPlugin.testApiFromPackage(TestContainerPlugin.java:202)
at java.base/jdk.internal.reflect.DirectMethodHandleAccessor.invoke(DirectMethodHandleAccessor.java:103)
at java.base/java.lang.reflect.Method.invoke(Method.java:580)
at com.carrotsearch.randomizedtesting.RandomizedRunner.invoke(RandomizedRunner.java:1758)
at com.carrotsearch.randomizedtesting.RandomizedRunner$8.evaluate(RandomizedRunner.java:946)
at com.carrotsearch.randomizedtesting.RandomizedRunner$9.evaluate(RandomizedRunner.java:982)
at com.carrotsearch.randomizedtesting.RandomizedRunner$10.evaluate(RandomizedRunner.java:996)
at com.carrotsearch.randomizedtesting.rules.SystemPropertiesRestoreRule$1.evaluate(SystemPropertiesRestoreRule.java:80)
at org.junit.rules.RunRules.evaluate(RunRules.java:20)
at org.apache.lucene.util.TestRuleSetupTeardownChained$1.evaluate(TestRuleSetupTeardownChained.java:49)
at org.apache.lucene.util.AbstractBeforeAfterRule$1.evaluate(AbstractBeforeAfterRule.java:45)
at org.apache.lucene.util.TestRuleThreadAndTestName$1.evaluate(TestRuleThreadAndTestName.java:48)
at org.apache.lucene.util.TestRuleIgnoreAfterMaxFailures$1.evaluate(TestRuleIgnoreAfterMaxFailures.java:64)
at org.apache.lucene.util.TestRuleMarkFailure$1.evaluate(TestRuleMarkFailure.java:47)
at org.junit.rules.RunRules.evaluate(RunRules.java:20)
at com.carrotsearch.randomizedtesting.rules.StatementAdapter.evaluate(StatementAdapter.java:36)
at com.carrotsearch.randomizedtesting.ThreadLeakControl$StatementRunner.run(ThreadLeakControl.java:390)
at com.carrotsearch.randomizedtesting.ThreadLeakControl.forkTimeoutingTask(ThreadLeakControl.java:843)
at com.carrotsearch.randomizedtesting.ThreadLeakControl$3.evaluate(ThreadLeakControl.java:490)
at com.carrotsearch.randomizedtesting.RandomizedRunner.runSingleTest(RandomizedRunner.java:955)
at com.carrotsearch.randomizedtesting.RandomizedRunner$5.evaluate(RandomizedRunner.java:840)
at com.carrotsearch.randomizedtesting.RandomizedRunner$6.evaluate(RandomizedRunner.java:891)
at com.carrotsearch.randomizedtesting.RandomizedRunner$7.evaluate(RandomizedRunner.java:902)
at com.carrotsearch.randomizedtesting.rules.StatementAdapter.evaluate(StatementAdapter.java:36)
at com.carrotsearch.randomizedtesting.rules.SystemPropertiesRestoreRule$1.evaluate(SystemPropertiesRestoreRule.java:80)
at org.junit.rules.RunRules.evaluate(RunRules.java:20)
at org.apache.lucene.util.AbstractBeforeAfterRule$1.evaluate(AbstractBeforeAfterRule.java:45)
at com.carrotsearch.randomizedtesting.rules.StatementAdapter.evaluate(StatementAdapter.java:36)
at org.apache.lucene.util.TestRuleStoreClassName$1.evaluate(TestRuleStoreClassName.java:41)
at com.carrotsearch.randomizedtesting.rules.NoShadowingOrOverridesOnMethodsRule$1.evaluate(NoShadowingOrOverridesOnMethodsRule.java:40)
at com.carrotsearch.randomizedtesting.rules.NoShadowingOrOverridesOnMethodsRule$1.evaluate(NoShadowingOrOverridesOnMethodsRule.java:40)
at com.carrotsearch.randomizedtesting.rules.StatementAdapter.evaluate(StatementAdapter.java:36)
at com.carrotsearch.randomizedtesting.rules.StatementAdapter.evaluate(StatementAdapter.java:36)
at org.apache.lucene.util.TestRuleAssertionsRequired$1.evaluate(TestRuleAssertionsRequired.java:53)
at org.apache.lucene.util.TestRuleMarkFailure$1.evaluate(TestRuleMarkFailure.java:47)
at org.apache.lucene.util.TestRuleIgnoreAfterMaxFailures$1.evaluate(TestRuleIgnoreAfterMaxFailures.java:64)
at org.apache.lucene.util.TestRuleIgnoreTestSuites$1.evaluate(TestRuleIgnoreTestSuites.java:54)
at org.junit.rules.RunRules.evaluate(RunRules.java:20)
at com.carrotsearch.randomizedtesting.rules.StatementAdapter.evaluate(StatementAdapter.java:36)
at com.carrotsearch.randomizedtesting.ThreadLeakControl$StatementRunner.run(ThreadLeakControl.java:390)
at com.carrotsearch.randomizedtesting.ThreadLeakControl.lambda$forkTimeoutingTask$0(ThreadLeakControl.java:850)
at java.base/java.lang.Thread.run(Thread.java:1570)
FAILED: org.apache.solr.handler.TestContainerPlugin.testApiFromPackage
Error Message:
Error from server at http://127.0.0.1:51003/solr: Error parsing public keys in Package store: {responseHeader={status=500,QTime=21},error={metadata={error-class=org.apache.solr.common.SolrException,root-error-class=org.apache.solr.common.SolrException},msg=Error parsing public keys in Package store,trace=org.apache.solr.common.SolrException: Error parsing public keys in Package store at org.apache.solr.filestore.PackageStoreAPI$FSWrite.validate(PackageStoreAPI.java:250) at org.apache.solr.filestore.PackageStoreAPI$FSWrite.readSignatures(PackageStoreAPI.java:235) at org.apache.solr.filestore.PackageStoreAPI$FSWrite.upload(PackageStoreAPI.java:203) at org.apache.solr.api.AnnotatedApi$Cmd.invoke(AnnotatedApi.java:299) at org.apache.solr.api.AnnotatedApi.call(AnnotatedApi.java:175) at org.apache.solr.api.V2HttpCall.handleAdmin(V2HttpCall.java:341) at org.apache.solr.servlet.HttpSolrCall.handleAdminRequest(HttpSolrCall.java:807) at org.apache.solr.servlet.HttpSolrCall.call(HttpSolrCall.java:545) at org.apache.solr.servlet.SolrDispatchFilter.doFilter(SolrDispatchFilter.java:437) at org.apache.solr.servlet.SolrDispatchFilter.doFilter(SolrDispatchFilter.java:367) at org.eclipse.jetty.servlet.FilterHolder.doFilter(FilterHolder.java:193) at org.eclipse.jetty.servlet.ServletHandler$Chain.doFilter(ServletHandler.java:1626) at org.apache.solr.client.solrj.embedded.JettySolrRunner$DebugFilter.doFilter(JettySolrRunner.java:166) at org.eclipse.jetty.servlet.FilterHolder.doFilter(FilterHolder.java:193) at org.eclipse.jetty.servlet.ServletHandler$Chain.doFilter(ServletHandler.java:1626) at org.eclipse.jetty.servlet.ServletHandler.doHandle(ServletHandler.java:552) at org.eclipse.jetty.server.handler.ScopedHandler.nextHandle(ScopedHandler.java:233) at org.eclipse.jetty.server.session.SessionHandler.doHandle(SessionHandler.java:1624) at org.eclipse.jetty.server.handler.ScopedHandler.nextHandle(ScopedHandler.java:233) at org.eclipse.jetty.server.handler.ContextHandler.doHandle(ContextHandler.java:1440) at org.eclipse.jetty.server.handler.ScopedHandler.nextScope(ScopedHandler.java:188) at org.eclipse.jetty.servlet.ServletHandler.doScope(ServletHandler.java:505) at org.eclipse.jetty.server.session.SessionHandler.doScope(SessionHandler.java:1594) at org.eclipse.jetty.server.handler.ScopedHandler.nextScope(ScopedHandler.java:186) at org.eclipse.jetty.server.handler.ContextHandler.doScope(ContextHandler.java:1355) at org.eclipse.jetty.server.handler.ScopedHandler.handle(ScopedHandler.java:141) at org.eclipse.jetty.server.handler.HandlerWrapper.handle(HandlerWrapper.java:127) at org.eclipse.jetty.rewrite.handler.RewriteHandler.handle(RewriteHandler.java:322) at org.eclipse.jetty.server.handler.gzip.GzipHandler.handle(GzipHandler.java:722) at org.eclipse.jetty.server.handler.HandlerWrapper.handle(HandlerWrapper.java:127) at org.eclipse.jetty.server.Server.handle(Server.java:516) at org.eclipse.jetty.server.HttpChannel.lambda$handle$1(HttpChannel.java:487) at org.eclipse.jetty.server.HttpChannel.dispatch(HttpChannel.java:732) at org.eclipse.jetty.server.HttpChannel.handle(HttpChannel.java:479) at org.eclipse.jetty.server.HttpConnection.onFillable(HttpConnection.java:277) at org.eclipse.jetty.io.AbstractConnection$ReadCallback.succeeded(AbstractConnection.java:311) at org.eclipse.jetty.io.FillInterest.fillable(FillInterest.java:105) at org.eclipse.jetty.io.ChannelEndPoint$1.run(ChannelEndPoint.java:104) at org.eclipse.jetty.util.thread.QueuedThreadPool.runJob(QueuedThreadPool.java:883) at org.eclipse.jetty.util.thread.QueuedThreadPool$Runner.run(QueuedThreadPool.java:1034) at java.base/java.lang.Thread.run(Thread.java:1570) ,code=500}}
Stack Trace:
org.apache.solr.client.solrj.impl.HttpSolrClient$RemoteExecutionException: Error from server at http://127.0.0.1:51003/solr: Error parsing public keys in Package store: {responseHeader={status=500,QTime=21},error={metadata={error-class=org.apache.solr.common.SolrException,root-error-class=org.apache.solr.common.SolrException},msg=Error parsing public keys in Package store,trace=org.apache.solr.common.SolrException: Error parsing public keys in Package store
at org.apache.solr.filestore.PackageStoreAPI$FSWrite.validate(PackageStoreAPI.java:250)
at org.apache.solr.filestore.PackageStoreAPI$FSWrite.readSignatures(PackageStoreAPI.java:235)
at org.apache.solr.filestore.PackageStoreAPI$FSWrite.upload(PackageStoreAPI.java:203)
at org.apache.solr.api.AnnotatedApi$Cmd.invoke(AnnotatedApi.java:299)
at org.apache.solr.api.AnnotatedApi.call(AnnotatedApi.java:175)
at org.apache.solr.api.V2HttpCall.handleAdmin(V2HttpCall.java:341)
at org.apache.solr.servlet.HttpSolrCall.handleAdminRequest(HttpSolrCall.java:807)
at org.apache.solr.servlet.HttpSolrCall.call(HttpSolrCall.java:545)
at org.apache.solr.servlet.SolrDispatchFilter.doFilter(SolrDispatchFilter.java:437)
at org.apache.solr.servlet.SolrDispatchFilter.doFilter(SolrDispatchFilter.java:367)
at org.eclipse.jetty.servlet.FilterHolder.doFilter(FilterHolder.java:193)
at org.eclipse.jetty.servlet.ServletHandler$Chain.doFilter(ServletHandler.java:1626)
at org.apache.solr.client.solrj.embedded.JettySolrRunner$DebugFilter.doFilter(JettySolrRunner.java:166)
at org.eclipse.jetty.servlet.FilterHolder.doFilter(FilterHolder.java:193)
at org.eclipse.jetty.servlet.ServletHandler$Chain.doFilter(ServletHandler.java:1626)
at org.eclipse.jetty.servlet.ServletHandler.doHandle(ServletHandler.java:552)
at org.eclipse.jetty.server.handler.ScopedHandler.nextHandle(ScopedHandler.java:233)
at org.eclipse.jetty.server.session.SessionHandler.doHandle(SessionHandler.java:1624)
at org.eclipse.jetty.server.handler.ScopedHandler.nextHandle(ScopedHandler.java:233)
at org.eclipse.jetty.server.handler.ContextHandler.doHandle(ContextHandler.java:1440)
at org.eclipse.jetty.server.handler.ScopedHandler.nextScope(ScopedHandler.java:188)
at org.eclipse.jetty.servlet.ServletHandler.doScope(ServletHandler.java:505)
at org.eclipse.jetty.server.session.SessionHandler.doScope(SessionHandler.java:1594)
at org.eclipse.jetty.server.handler.ScopedHandler.nextScope(ScopedHandler.java:186)
at org.eclipse.jetty.server.handler.ContextHandler.doScope(ContextHandler.java:1355)
at org.eclipse.jetty.server.handler.ScopedHandler.handle(ScopedHandler.java:141)
at org.eclipse.jetty.server.handler.HandlerWrapper.handle(HandlerWrapper.java:127)
at org.eclipse.jetty.rewrite.handler.RewriteHandler.handle(RewriteHandler.java:322)
at org.eclipse.jetty.server.handler.gzip.GzipHandler.handle(GzipHandler.java:722)
at org.eclipse.jetty.server.handler.HandlerWrapper.handle(HandlerWrapper.java:127)
at org.eclipse.jetty.server.Server.handle(Server.java:516)
at org.eclipse.jetty.server.HttpChannel.lambda$handle$1(HttpChannel.java:487)
at org.eclipse.jetty.server.HttpChannel.dispatch(HttpChannel.java:732)
at org.eclipse.jetty.server.HttpChannel.handle(HttpChannel.java:479)
at org.eclipse.jetty.server.HttpConnection.onFillable(HttpConnection.java:277)
at org.eclipse.jetty.io.AbstractConnection$ReadCallback.succeeded(AbstractConnection.java:311)
at org.eclipse.jetty.io.FillInterest.fillable(FillInterest.java:105)
at org.eclipse.jetty.io.ChannelEndPoint$1.run(ChannelEndPoint.java:104)
at org.eclipse.jetty.util.thread.QueuedThreadPool.runJob(QueuedThreadPool.java:883)
at org.eclipse.jetty.util.thread.QueuedThreadPool$Runner.run(QueuedThreadPool.java:1034)
at java.base/java.lang.Thread.run(Thread.java:1570)
,code=500}}
at __randomizedtesting.SeedInfo.seed([F75DE56C210DA983:1A031D1D13477E0A]:0)
at org.apache.solr.client.solrj.impl.BaseHttpSolrClient$RemoteExecutionException.create(BaseHttpSolrClient.java:67)
at org.apache.solr.client.solrj.impl.HttpSolrClient.executeMethod(HttpSolrClient.java:647)
at org.apache.solr.client.solrj.impl.HttpSolrClient.request(HttpSolrClient.java:266)
at org.apache.solr.client.solrj.impl.HttpSolrClient.request(HttpSolrClient.java:248)
at org.apache.solr.client.solrj.impl.LBSolrClient.doRequest(LBSolrClient.java:369)
at org.apache.solr.client.solrj.impl.LBSolrClient.request(LBSolrClient.java:297)
at org.apache.solr.client.solrj.impl.BaseCloudSolrClient.sendRequest(BaseCloudSolrClient.java:1188)
at org.apache.solr.client.solrj.impl.BaseCloudSolrClient.requestWithRetryOnStaleState(BaseCloudSolrClient.java:934)
at org.apache.solr.client.solrj.impl.BaseCloudSolrClient.request(BaseCloudSolrClient.java:866)
at org.apache.solr.client.solrj.SolrRequest.process(SolrRequest.java:225)
at org.apache.solr.client.solrj.SolrRequest.process(SolrRequest.java:242)
at org.apache.solr.filestore.TestDistribPackageStore.postFile(TestDistribPackageStore.java:288)
at org.apache.solr.pkg.TestPackages.postFileAndWait(TestPackages.java:812)
at org.apache.solr.handler.TestContainerPlugin.testApiFromPackage(TestContainerPlugin.java:202)
at java.base/jdk.internal.reflect.DirectMethodHandleAccessor.invoke(DirectMethodHandleAccessor.java:103)
at java.base/java.lang.reflect.Method.invoke(Method.java:580)
at com.carrotsearch.randomizedtesting.RandomizedRunner.invoke(RandomizedRunner.java:1758)
at com.carrotsearch.randomizedtesting.RandomizedRunner$8.evaluate(RandomizedRunner.java:946)
at com.carrotsearch.randomizedtesting.RandomizedRunner$9.evaluate(RandomizedRunner.java:982)
at com.carrotsearch.randomizedtesting.RandomizedRunner$10.evaluate(RandomizedRunner.java:996)
at com.carrotsearch.randomizedtesting.rules.SystemPropertiesRestoreRule$1.evaluate(SystemPropertiesRestoreRule.java:80)
at org.junit.rules.RunRules.evaluate(RunRules.java:20)
at org.apache.lucene.util.TestRuleSetupTeardownChained$1.evaluate(TestRuleSetupTeardownChained.java:49)
at org.apache.lucene.util.AbstractBeforeAfterRule$1.evaluate(AbstractBeforeAfterRule.java:45)
at org.apache.lucene.util.TestRuleThreadAndTestName$1.evaluate(TestRuleThreadAndTestName.java:48)
at org.apache.lucene.util.TestRuleIgnoreAfterMaxFailures$1.evaluate(TestRuleIgnoreAfterMaxFailures.java:64)
at org.apache.lucene.util.TestRuleMarkFailure$1.evaluate(TestRuleMarkFailure.java:47)
at org.junit.rules.RunRules.evaluate(RunRules.java:20)
at com.carrotsearch.randomizedtesting.rules.StatementAdapter.evaluate(StatementAdapter.java:36)
at com.carrotsearch.randomizedtesting.ThreadLeakControl$StatementRunner.run(ThreadLeakControl.java:390)
at com.carrotsearch.randomizedtesting.ThreadLeakControl.forkTimeoutingTask(ThreadLeakControl.java:843)
at com.carrotsearch.randomizedtesting.ThreadLeakControl$3.evaluate(ThreadLeakControl.java:490)
at com.carrotsearch.randomizedtesting.RandomizedRunner.runSingleTest(RandomizedRunner.java:955)
at com.carrotsearch.randomizedtesting.RandomizedRunner$5.evaluate(RandomizedRunner.java:840)
at com.carrotsearch.randomizedtesting.RandomizedRunner$6.evaluate(RandomizedRunner.java:891)
at com.carrotsearch.randomizedtesting.RandomizedRunner$7.evaluate(RandomizedRunner.java:902)
at com.carrotsearch.randomizedtesting.rules.StatementAdapter.evaluate(StatementAdapter.java:36)
at com.carrotsearch.randomizedtesting.rules.SystemPropertiesRestoreRule$1.evaluate(SystemPropertiesRestoreRule.java:80)
at org.junit.rules.RunRules.evaluate(RunRules.java:20)
at org.apache.lucene.util.AbstractBeforeAfterRule$1.evaluate(AbstractBeforeAfterRule.java:45)
at com.carrotsearch.randomizedtesting.rules.StatementAdapter.evaluate(StatementAdapter.java:36)
at org.apache.lucene.util.TestRuleStoreClassName$1.evaluate(TestRuleStoreClassName.java:41)
at com.carrotsearch.randomizedtesting.rules.NoShadowingOrOverridesOnMethodsRule$1.evaluate(NoShadowingOrOverridesOnMethodsRule.java:40)
at com.carrotsearch.randomizedtesting.rules.NoShadowingOrOverridesOnMethodsRule$1.evaluate(NoShadowingOrOverridesOnMethodsRule.java:40)
at com.carrotsearch.randomizedtesting.rules.StatementAdapter.evaluate(StatementAdapter.java:36)
at com.carrotsearch.randomizedtesting.rules.StatementAdapter.evaluate(StatementAdapter.java:36)
at org.apache.lucene.util.TestRuleAssertionsRequired$1.evaluate(TestRuleAssertionsRequired.java:53)
at org.apache.lucene.util.TestRuleMarkFailure$1.evaluate(TestRuleMarkFailure.java:47)
at org.apache.lucene.util.TestRuleIgnoreAfterMaxFailures$1.evaluate(TestRuleIgnoreAfterMaxFailures.java:64)
at org.apache.lucene.util.TestRuleIgnoreTestSuites$1.evaluate(TestRuleIgnoreTestSuites.java:54)
at org.junit.rules.RunRules.evaluate(RunRules.java:20)
at com.carrotsearch.randomizedtesting.rules.StatementAdapter.evaluate(StatementAdapter.java:36)
at com.carrotsearch.randomizedtesting.ThreadLeakControl$StatementRunner.run(ThreadLeakControl.java:390)
at com.carrotsearch.randomizedtesting.ThreadLeakControl.lambda$forkTimeoutingTask$0(ThreadLeakControl.java:850)
at java.base/java.lang.Thread.run(Thread.java:1570)
FAILED: org.apache.solr.handler.TestContainerPlugin.testApiFromPackage
Error Message:
Error from server at http://127.0.0.1:51001/solr: Error parsing public keys in Package store: {responseHeader={status=500,QTime=30},error={metadata={error-class=org.apache.solr.common.SolrException,root-error-class=org.apache.solr.common.SolrException},msg=Error parsing public keys in Package store,trace=org.apache.solr.common.SolrException: Error parsing public keys in Package store at org.apache.solr.filestore.PackageStoreAPI$FSWrite.validate(PackageStoreAPI.java:250) at org.apache.solr.filestore.PackageStoreAPI$FSWrite.readSignatures(PackageStoreAPI.java:235) at org.apache.solr.filestore.PackageStoreAPI$FSWrite.upload(PackageStoreAPI.java:203) at org.apache.solr.api.AnnotatedApi$Cmd.invoke(AnnotatedApi.java:299) at org.apache.solr.api.AnnotatedApi.call(AnnotatedApi.java:175) at org.apache.solr.api.V2HttpCall.handleAdmin(V2HttpCall.java:341) at org.apache.solr.servlet.HttpSolrCall.handleAdminRequest(HttpSolrCall.java:807) at org.apache.solr.servlet.HttpSolrCall.call(HttpSolrCall.java:545) at org.apache.solr.servlet.SolrDispatchFilter.doFilter(SolrDispatchFilter.java:437) at org.apache.solr.servlet.SolrDispatchFilter.doFilter(SolrDispatchFilter.java:367) at org.eclipse.jetty.servlet.FilterHolder.doFilter(FilterHolder.java:193) at org.eclipse.jetty.servlet.ServletHandler$Chain.doFilter(ServletHandler.java:1626) at org.apache.solr.client.solrj.embedded.JettySolrRunner$DebugFilter.doFilter(JettySolrRunner.java:166) at org.eclipse.jetty.servlet.FilterHolder.doFilter(FilterHolder.java:193) at org.eclipse.jetty.servlet.ServletHandler$Chain.doFilter(ServletHandler.java:1626) at org.eclipse.jetty.servlet.ServletHandler.doHandle(ServletHandler.java:552) at org.eclipse.jetty.server.handler.ScopedHandler.nextHandle(ScopedHandler.java:233) at org.eclipse.jetty.server.session.SessionHandler.doHandle(SessionHandler.java:1624) at org.eclipse.jetty.server.handler.ScopedHandler.nextHandle(ScopedHandler.java:233) at org.eclipse.jetty.server.handler.ContextHandler.doHandle(ContextHandler.java:1440) at org.eclipse.jetty.server.handler.ScopedHandler.nextScope(ScopedHandler.java:188) at org.eclipse.jetty.servlet.ServletHandler.doScope(ServletHandler.java:505) at org.eclipse.jetty.server.session.SessionHandler.doScope(SessionHandler.java:1594) at org.eclipse.jetty.server.handler.ScopedHandler.nextScope(ScopedHandler.java:186) at org.eclipse.jetty.server.handler.ContextHandler.doScope(ContextHandler.java:1355) at org.eclipse.jetty.server.handler.ScopedHandler.handle(ScopedHandler.java:141) at org.eclipse.jetty.server.handler.HandlerWrapper.handle(HandlerWrapper.java:127) at org.eclipse.jetty.rewrite.handler.RewriteHandler.handle(RewriteHandler.java:322) at org.eclipse.jetty.server.handler.gzip.GzipHandler.handle(GzipHandler.java:722) at org.eclipse.jetty.server.handler.HandlerWrapper.handle(HandlerWrapper.java:127) at org.eclipse.jetty.server.Server.handle(Server.java:516) at org.eclipse.jetty.server.HttpChannel.lambda$handle$1(HttpChannel.java:487) at org.eclipse.jetty.server.HttpChannel.dispatch(HttpChannel.java:732) at org.eclipse.jetty.server.HttpChannel.handle(HttpChannel.java:479) at org.eclipse.jetty.server.HttpConnection.onFillable(HttpConnection.java:277) at org.eclipse.jetty.io.AbstractConnection$ReadCallback.succeeded(AbstractConnection.java:311) at org.eclipse.jetty.io.FillInterest.fillable(FillInterest.java:105) at org.eclipse.jetty.io.ChannelEndPoint$1.run(ChannelEndPoint.java:104) at org.eclipse.jetty.util.thread.QueuedThreadPool.runJob(QueuedThreadPool.java:883) at org.eclipse.jetty.util.thread.QueuedThreadPool$Runner.run(QueuedThreadPool.java:1034) at java.base/java.lang.Thread.run(Thread.java:1570) ,code=500}}
Stack Trace:
org.apache.solr.client.solrj.impl.HttpSolrClient$RemoteExecutionException: Error from server at http://127.0.0.1:51001/solr: Error parsing public keys in Package store: {responseHeader={status=500,QTime=30},error={metadata={error-class=org.apache.solr.common.SolrException,root-error-class=org.apache.solr.common.SolrException},msg=Error parsing public keys in Package store,trace=org.apache.solr.common.SolrException: Error parsing public keys in Package store
at org.apache.solr.filestore.PackageStoreAPI$FSWrite.validate(PackageStoreAPI.java:250)
at org.apache.solr.filestore.PackageStoreAPI$FSWrite.readSignatures(PackageStoreAPI.java:235)
at org.apache.solr.filestore.PackageStoreAPI$FSWrite.upload(PackageStoreAPI.java:203)
at org.apache.solr.api.AnnotatedApi$Cmd.invoke(AnnotatedApi.java:299)
at org.apache.solr.api.AnnotatedApi.call(AnnotatedApi.java:175)
at org.apache.solr.api.V2HttpCall.handleAdmin(V2HttpCall.java:341)
at org.apache.solr.servlet.HttpSolrCall.handleAdminRequest(HttpSolrCall.java:807)
at org.apache.solr.servlet.HttpSolrCall.call(HttpSolrCall.java:545)
at org.apache.solr.servlet.SolrDispatchFilter.doFilter(SolrDispatchFilter.java:437)
at org.apache.solr.servlet.SolrDispatchFilter.doFilter(SolrDispatchFilter.java:367)
at org.eclipse.jetty.servlet.FilterHolder.doFilter(FilterHolder.java:193)
at org.eclipse.jetty.servlet.ServletHandler$Chain.doFilter(ServletHandler.java:1626)
at org.apache.solr.client.solrj.embedded.JettySolrRunner$DebugFilter.doFilter(JettySolrRunner.java:166)
at org.eclipse.jetty.servlet.FilterHolder.doFilter(FilterHolder.java:193)
at org.eclipse.jetty.servlet.ServletHandler$Chain.doFilter(ServletHandler.java:1626)
at org.eclipse.jetty.servlet.ServletHandler.doHandle(ServletHandler.java:552)
at org.eclipse.jetty.server.handler.ScopedHandler.nextHandle(ScopedHandler.java:233)
at org.eclipse.jetty.server.session.SessionHandler.doHandle(SessionHandler.java:1624)
at org.eclipse.jetty.server.handler.ScopedHandler.nextHandle(ScopedHandler.java:233)
at org.eclipse.jetty.server.handler.ContextHandler.doHandle(ContextHandler.java:1440)
at org.eclipse.jetty.server.handler.ScopedHandler.nextScope(ScopedHandler.java:188)
at org.eclipse.jetty.servlet.ServletHandler.doScope(ServletHandler.java:505)
at org.eclipse.jetty.server.session.SessionHandler.doScope(SessionHandler.java:1594)
at org.eclipse.jetty.server.handler.ScopedHandler.nextScope(ScopedHandler.java:186)
at org.eclipse.jetty.server.handler.ContextHandler.doScope(ContextHandler.java:1355)
at org.eclipse.jetty.server.handler.ScopedHandler.handle(ScopedHandler.java:141)
at org.eclipse.jetty.server.handler.HandlerWrapper.handle(HandlerWrapper.java:127)
at org.eclipse.jetty.rewrite.handler.RewriteHandler.handle(RewriteHandler.java:322)
at org.eclipse.jetty.server.handler.gzip.GzipHandler.handle(GzipHandler.java:722)
at org.eclipse.jetty.server.handler.HandlerWrapper.handle(HandlerWrapper.java:127)
at org.eclipse.jetty.server.Server.handle(Server.java:516)
at org.eclipse.jetty.server.HttpChannel.lambda$handle$1(HttpChannel.java:487)
at org.eclipse.jetty.server.HttpChannel.dispatch(HttpChannel.java:732)
at org.eclipse.jetty.server.HttpChannel.handle(HttpChannel.java:479)
at org.eclipse.jetty.server.HttpConnection.onFillable(HttpConnection.java:277)
at org.eclipse.jetty.io.AbstractConnection$ReadCallback.succeeded(AbstractConnection.java:311)
at org.eclipse.jetty.io.FillInterest.fillable(FillInterest.java:105)
at org.eclipse.jetty.io.ChannelEndPoint$1.run(ChannelEndPoint.java:104)
at org.eclipse.jetty.util.thread.QueuedThreadPool.runJob(QueuedThreadPool.java:883)
at org.eclipse.jetty.util.thread.QueuedThreadPool$Runner.run(QueuedThreadPool.java:1034)
at java.base/java.lang.Thread.run(Thread.java:1570)
,code=500}}
at __randomizedtesting.SeedInfo.seed([F75DE56C210DA983:1A031D1D13477E0A]:0)
at org.apache.solr.client.solrj.impl.BaseHttpSolrClient$RemoteExecutionException.create(BaseHttpSolrClient.java:67)
at org.apache.solr.client.solrj.impl.HttpSolrClient.executeMethod(HttpSolrClient.java:647)
at org.apache.solr.client.solrj.impl.HttpSolrClient.request(HttpSolrClient.java:266)
at org.apache.solr.client.solrj.impl.HttpSolrClient.request(HttpSolrClient.java:248)
at org.apache.solr.client.solrj.impl.LBSolrClient.doRequest(LBSolrClient.java:369)
at org.apache.solr.client.solrj.impl.LBSolrClient.request(LBSolrClient.java:297)
at org.apache.solr.client.solrj.impl.BaseCloudSolrClient.sendRequest(BaseCloudSolrClient.java:1188)
at org.apache.solr.client.solrj.impl.BaseCloudSolrClient.requestWithRetryOnStaleState(BaseCloudSolrClient.java:934)
at org.apache.solr.client.solrj.impl.BaseCloudSolrClient.request(BaseCloudSolrClient.java:866)
at org.apache.solr.client.solrj.SolrRequest.process(SolrRequest.java:225)
at org.apache.solr.client.solrj.SolrRequest.process(SolrRequest.java:242)
at org.apache.solr.filestore.TestDistribPackageStore.postFile(TestDistribPackageStore.java:288)
at org.apache.solr.pkg.TestPackages.postFileAndWait(TestPackages.java:812)
at org.apache.solr.handler.TestContainerPlugin.testApiFromPackage(TestContainerPlugin.java:202)
at java.base/jdk.internal.reflect.DirectMethodHandleAccessor.invoke(DirectMethodHandleAccessor.java:103)
at java.base/java.lang.reflect.Method.invoke(Method.java:580)
at com.carrotsearch.randomizedtesting.RandomizedRunner.invoke(RandomizedRunner.java:1758)
at com.carrotsearch.randomizedtesting.RandomizedRunner$8.evaluate(RandomizedRunner.java:946)
at com.carrotsearch.randomizedtesting.RandomizedRunner$9.evaluate(RandomizedRunner.java:982)
at com.carrotsearch.randomizedtesting.RandomizedRunner$10.evaluate(RandomizedRunner.java:996)
at com.carrotsearch.randomizedtesting.rules.SystemPropertiesRestoreRule$1.evaluate(SystemPropertiesRestoreRule.java:80)
at org.junit.rules.RunRules.evaluate(RunRules.java:20)
at org.apache.lucene.util.TestRuleSetupTeardownChained$1.evaluate(TestRuleSetupTeardownChained.java:49)
at org.apache.lucene.util.AbstractBeforeAfterRule$1.evaluate(AbstractBeforeAfterRule.java:45)
at org.apache.lucene.util.TestRuleThreadAndTestName$1.evaluate(TestRuleThreadAndTestName.java:48)
at org.apache.lucene.util.TestRuleIgnoreAfterMaxFailures$1.evaluate(TestRuleIgnoreAfterMaxFailures.java:64)
at org.apache.lucene.util.TestRuleMarkFailure$1.evaluate(TestRuleMarkFailure.java:47)
at org.junit.rules.RunRules.evaluate(RunRules.java:20)
at com.carrotsearch.randomizedtesting.rules.StatementAdapter.evaluate(StatementAdapter.java:36)
at com.carrotsearch.randomizedtesting.ThreadLeakControl$StatementRunner.run(ThreadLeakControl.java:390)
at com.carrotsearch.randomizedtesting.ThreadLeakControl.forkTimeoutingTask(ThreadLeakControl.java:843)
at com.carrotsearch.randomizedtesting.ThreadLeakControl$3.evaluate(ThreadLeakControl.java:490)
at com.carrotsearch.randomizedtesting.RandomizedRunner.runSingleTest(RandomizedRunner.java:955)
at com.carrotsearch.randomizedtesting.RandomizedRunner$5.evaluate(RandomizedRunner.java:840)
at com.carrotsearch.randomizedtesting.RandomizedRunner$6.evaluate(RandomizedRunner.java:891)
at com.carrotsearch.randomizedtesting.RandomizedRunner$7.evaluate(RandomizedRunner.java:902)
at com.carrotsearch.randomizedtesting.rules.StatementAdapter.evaluate(StatementAdapter.java:36)
at com.carrotsearch.randomizedtesting.rules.SystemPropertiesRestoreRule$1.evaluate(SystemPropertiesRestoreRule.java:80)
at org.junit.rules.RunRules.evaluate(RunRules.java:20)
at org.apache.lucene.util.AbstractBeforeAfterRule$1.evaluate(AbstractBeforeAfterRule.java:45)
at com.carrotsearch.randomizedtesting.rules.StatementAdapter.evaluate(StatementAdapter.java:36)
at org.apache.lucene.util.TestRuleStoreClassName$1.evaluate(TestRuleStoreClassName.java:41)
at com.carrotsearch.randomizedtesting.rules.NoShadowingOrOverridesOnMethodsRule$1.evaluate(NoShadowingOrOverridesOnMethodsRule.java:40)
at com.carrotsearch.randomizedtesting.rules.NoShadowingOrOverridesOnMethodsRule$1.evaluate(NoShadowingOrOverridesOnMethodsRule.java:40)
at com.carrotsearch.randomizedtesting.rules.StatementAdapter.evaluate(StatementAdapter.java:36)
at com.carrotsearch.randomizedtesting.rules.StatementAdapter.evaluate(StatementAdapter.java:36)
at org.apache.lucene.util.TestRuleAssertionsRequired$1.evaluate(TestRuleAssertionsRequired.java:53)
at org.apache.lucene.util.TestRuleMarkFailure$1.evaluate(TestRuleMarkFailure.java:47)
at org.apache.lucene.util.TestRuleIgnoreAfterMaxFailures$1.evaluate(TestRuleIgnoreAfterMaxFailures.java:64)
at org.apache.lucene.util.TestRuleIgnoreTestSuites$1.evaluate(TestRuleIgnoreTestSuites.java:54)
at org.junit.rules.RunRules.evaluate(RunRules.java:20)
at com.carrotsearch.randomizedtesting.rules.StatementAdapter.evaluate(StatementAdapter.java:36)
at com.carrotsearch.randomizedtesting.ThreadLeakControl$StatementRunner.run(ThreadLeakControl.java:390)
at com.carrotsearch.randomizedtesting.ThreadLeakControl.lambda$forkTimeoutingTask$0(ThreadLeakControl.java:850)
at java.base/java.lang.Thread.run(Thread.java:1570)
FAILED: org.apache.solr.handler.TestContainerPlugin.testApiFromPackage
Error Message:
Error from server at http://127.0.0.1:56828/solr: Error parsing public keys in Package store: {responseHeader={status=500,QTime=5},error={metadata={error-class=org.apache.solr.common.SolrException,root-error-class=org.apache.solr.common.SolrException},msg=Error parsing public keys in Package store,trace=org.apache.solr.common.SolrException: Error parsing public keys in Package store at org.apache.solr.filestore.PackageStoreAPI$FSWrite.validate(PackageStoreAPI.java:250) at org.apache.solr.filestore.PackageStoreAPI$FSWrite.readSignatures(PackageStoreAPI.java:235) at org.apache.solr.filestore.PackageStoreAPI$FSWrite.upload(PackageStoreAPI.java:203) at org.apache.solr.api.AnnotatedApi$Cmd.invoke(AnnotatedApi.java:299) at org.apache.solr.api.AnnotatedApi.call(AnnotatedApi.java:175) at org.apache.solr.api.V2HttpCall.handleAdmin(V2HttpCall.java:341) at org.apache.solr.servlet.HttpSolrCall.handleAdminRequest(HttpSolrCall.java:807) at org.apache.solr.servlet.HttpSolrCall.call(HttpSolrCall.java:545) at org.apache.solr.servlet.SolrDispatchFilter.doFilter(SolrDispatchFilter.java:437) at org.apache.solr.servlet.SolrDispatchFilter.doFilter(SolrDispatchFilter.java:367) at org.eclipse.jetty.servlet.FilterHolder.doFilter(FilterHolder.java:193) at org.eclipse.jetty.servlet.ServletHandler$Chain.doFilter(ServletHandler.java:1626) at org.apache.solr.client.solrj.embedded.JettySolrRunner$DebugFilter.doFilter(JettySolrRunner.java:166) at org.eclipse.jetty.servlet.FilterHolder.doFilter(FilterHolder.java:193) at org.eclipse.jetty.servlet.ServletHandler$Chain.doFilter(ServletHandler.java:1626) at org.eclipse.jetty.servlet.ServletHandler.doHandle(ServletHandler.java:552) at org.eclipse.jetty.server.handler.ScopedHandler.nextHandle(ScopedHandler.java:233) at org.eclipse.jetty.server.session.SessionHandler.doHandle(SessionHandler.java:1624) at org.eclipse.jetty.server.handler.ScopedHandler.nextHandle(ScopedHandler.java:233) at org.eclipse.jetty.server.handler.ContextHandler.doHandle(ContextHandler.java:1440) at org.eclipse.jetty.server.handler.ScopedHandler.nextScope(ScopedHandler.java:188) at org.eclipse.jetty.servlet.ServletHandler.doScope(ServletHandler.java:505) at org.eclipse.jetty.server.session.SessionHandler.doScope(SessionHandler.java:1594) at org.eclipse.jetty.server.handler.ScopedHandler.nextScope(ScopedHandler.java:186) at org.eclipse.jetty.server.handler.ContextHandler.doScope(ContextHandler.java:1355) at org.eclipse.jetty.server.handler.ScopedHandler.handle(ScopedHandler.java:141) at org.eclipse.jetty.server.handler.HandlerWrapper.handle(HandlerWrapper.java:127) at org.eclipse.jetty.rewrite.handler.RewriteHandler.handle(RewriteHandler.java:322) at org.eclipse.jetty.server.handler.gzip.GzipHandler.handle(GzipHandler.java:722) at org.eclipse.jetty.server.handler.HandlerWrapper.handle(HandlerWrapper.java:127) at org.eclipse.jetty.server.Server.handle(Server.java:516) at org.eclipse.jetty.server.HttpChannel.lambda$handle$1(HttpChannel.java:487) at org.eclipse.jetty.server.HttpChannel.dispatch(HttpChannel.java:732) at org.eclipse.jetty.server.HttpChannel.handle(HttpChannel.java:479) at org.eclipse.jetty.server.HttpConnection.onFillable(HttpConnection.java:277) at org.eclipse.jetty.io.AbstractConnection$ReadCallback.succeeded(AbstractConnection.java:311) at org.eclipse.jetty.io.FillInterest.fillable(FillInterest.java:105) at org.eclipse.jetty.io.ChannelEndPoint$1.run(ChannelEndPoint.java:104) at org.eclipse.jetty.util.thread.QueuedThreadPool.runJob(QueuedThreadPool.java:883) at org.eclipse.jetty.util.thread.QueuedThreadPool$Runner.run(QueuedThreadPool.java:1034) at java.base/java.lang.Thread.run(Thread.java:1570) ,code=500}}
Stack Trace:
org.apache.solr.client.solrj.impl.HttpSolrClient$RemoteExecutionException: Error from server at http://127.0.0.1:56828/solr: Error parsing public keys in Package store: {responseHeader={status=500,QTime=5},error={metadata={error-class=org.apache.solr.common.SolrException,root-error-class=org.apache.solr.common.SolrException},msg=Error parsing public keys in Package store,trace=org.apache.solr.common.SolrException: Error parsing public keys in Package store
at org.apache.solr.filestore.PackageStoreAPI$FSWrite.validate(PackageStoreAPI.java:250)
at org.apache.solr.filestore.PackageStoreAPI$FSWrite.readSignatures(PackageStoreAPI.java:235)
at org.apache.solr.filestore.PackageStoreAPI$FSWrite.upload(PackageStoreAPI.java:203)
at org.apache.solr.api.AnnotatedApi$Cmd.invoke(AnnotatedApi.java:299)
at org.apache.solr.api.AnnotatedApi.call(AnnotatedApi.java:175)
at org.apache.solr.api.V2HttpCall.handleAdmin(V2HttpCall.java:341)
at org.apache.solr.servlet.HttpSolrCall.handleAdminRequest(HttpSolrCall.java:807)
at org.apache.solr.servlet.HttpSolrCall.call(HttpSolrCall.java:545)
at org.apache.solr.servlet.SolrDispatchFilter.doFilter(SolrDispatchFilter.java:437)
at org.apache.solr.servlet.SolrDispatchFilter.doFilter(SolrDispatchFilter.java:367)
at org.eclipse.jetty.servlet.FilterHolder.doFilter(FilterHolder.java:193)
at org.eclipse.jetty.servlet.ServletHandler$Chain.doFilter(ServletHandler.java:1626)
at org.apache.solr.client.solrj.embedded.JettySolrRunner$DebugFilter.doFilter(JettySolrRunner.java:166)
at org.eclipse.jetty.servlet.FilterHolder.doFilter(FilterHolder.java:193)
at org.eclipse.jetty.servlet.ServletHandler$Chain.doFilter(ServletHandler.java:1626)
at org.eclipse.jetty.servlet.ServletHandler.doHandle(ServletHandler.java:552)
at org.eclipse.jetty.server.handler.ScopedHandler.nextHandle(ScopedHandler.java:233)
at org.eclipse.jetty.server.session.SessionHandler.doHandle(SessionHandler.java:1624)
at org.eclipse.jetty.server.handler.ScopedHandler.nextHandle(ScopedHandler.java:233)
at org.eclipse.jetty.server.handler.ContextHandler.doHandle(ContextHandler.java:1440)
at org.eclipse.jetty.server.handler.ScopedHandler.nextScope(ScopedHandler.java:188)
at org.eclipse.jetty.servlet.ServletHandler.doScope(ServletHandler.java:505)
at org.eclipse.jetty.server.session.SessionHandler.doScope(SessionHandler.java:1594)
at org.eclipse.jetty.server.handler.ScopedHandler.nextScope(ScopedHandler.java:186)
at org.eclipse.jetty.server.handler.ContextHandler.doScope(ContextHandler.java:1355)
at org.eclipse.jetty.server.handler.ScopedHandler.handle(ScopedHandler.java:141)
at org.eclipse.jetty.server.handler.HandlerWrapper.handle(HandlerWrapper.java:127)
at org.eclipse.jetty.rewrite.handler.RewriteHandler.handle(RewriteHandler.java:322)
at org.eclipse.jetty.server.handler.gzip.GzipHandler.handle(GzipHandler.java:722)
at org.eclipse.jetty.server.handler.HandlerWrapper.handle(HandlerWrapper.java:127)
at org.eclipse.jetty.server.Server.handle(Server.java:516)
at org.eclipse.jetty.server.HttpChannel.lambda$handle$1(HttpChannel.java:487)
at org.eclipse.jetty.server.HttpChannel.dispatch(HttpChannel.java:732)
at org.eclipse.jetty.server.HttpChannel.handle(HttpChannel.java:479)
at org.eclipse.jetty.server.HttpConnection.onFillable(HttpConnection.java:277)
at org.eclipse.jetty.io.AbstractConnection$ReadCallback.succeeded(AbstractConnection.java:311)
at org.eclipse.jetty.io.FillInterest.fillable(FillInterest.java:105)
at org.eclipse.jetty.io.ChannelEndPoint$1.run(ChannelEndPoint.java:104)
at org.eclipse.jetty.util.thread.QueuedThreadPool.runJob(QueuedThreadPool.java:883)
at org.eclipse.jetty.util.thread.QueuedThreadPool$Runner.run(QueuedThreadPool.java:1034)
at java.base/java.lang.Thread.run(Thread.java:1570)
,code=500}}
at __randomizedtesting.SeedInfo.seed([F75DE56C210DA983:1A031D1D13477E0A]:0)
at org.apache.solr.client.solrj.impl.BaseHttpSolrClient$RemoteExecutionException.create(BaseHttpSolrClient.java:67)
at org.apache.solr.client.solrj.impl.HttpSolrClient.executeMethod(HttpSolrClient.java:647)
at org.apache.solr.client.solrj.impl.HttpSolrClient.request(HttpSolrClient.java:266)
at org.apache.solr.client.solrj.impl.HttpSolrClient.request(HttpSolrClient.java:248)
at org.apache.solr.client.solrj.impl.LBSolrClient.doRequest(LBSolrClient.java:369)
at org.apache.solr.client.solrj.impl.LBSolrClient.request(LBSolrClient.java:297)
at org.apache.solr.client.solrj.impl.BaseCloudSolrClient.sendRequest(BaseCloudSolrClient.java:1188)
at org.apache.solr.client.solrj.impl.BaseCloudSolrClient.requestWithRetryOnStaleState(BaseCloudSolrClient.java:934)
at org.apache.solr.client.solrj.impl.BaseCloudSolrClient.request(BaseCloudSolrClient.java:866)
at org.apache.solr.client.solrj.SolrRequest.process(SolrRequest.java:225)
at org.apache.solr.client.solrj.SolrRequest.process(SolrRequest.java:242)
at org.apache.solr.filestore.TestDistribPackageStore.postFile(TestDistribPackageStore.java:288)
at org.apache.solr.pkg.TestPackages.postFileAndWait(TestPackages.java:812)
at org.apache.solr.handler.TestContainerPlugin.testApiFromPackage(TestContainerPlugin.java:202)
at java.base/jdk.internal.reflect.DirectMethodHandleAccessor.invoke(DirectMethodHandleAccessor.java:103)
at java.base/java.lang.reflect.Method.invoke(Method.java:580)
at com.carrotsearch.randomizedtesting.RandomizedRunner.invoke(RandomizedRunner.java:1758)
at com.carrotsearch.randomizedtesting.RandomizedRunner$8.evaluate(RandomizedRunner.java:946)
at com.carrotsearch.randomizedtesting.RandomizedRunner$9.evaluate(RandomizedRunner.java:982)
at com.carrotsearch.randomizedtesting.RandomizedRunner$10.evaluate(RandomizedRunner.java:996)
at com.carrotsearch.randomizedtesting.rules.SystemPropertiesRestoreRule$1.evaluate(SystemPropertiesRestoreRule.java:80)
at org.junit.rules.RunRules.evaluate(RunRules.java:20)
at org.apache.lucene.util.TestRuleSetupTeardownChained$1.evaluate(TestRuleSetupTeardownChained.java:49)
at org.apache.lucene.util.AbstractBeforeAfterRule$1.evaluate(AbstractBeforeAfterRule.java:45)
at org.apache.lucene.util.TestRuleThreadAndTestName$1.evaluate(TestRuleThreadAndTestName.java:48)
at org.apache.lucene.util.TestRuleIgnoreAfterMaxFailures$1.evaluate(TestRuleIgnoreAfterMaxFailures.java:64)
at org.apache.lucene.util.TestRuleMarkFailure$1.evaluate(TestRuleMarkFailure.java:47)
at org.junit.rules.RunRules.evaluate(RunRules.java:20)
at com.carrotsearch.randomizedtesting.rules.StatementAdapter.evaluate(StatementAdapter.java:36)
at com.carrotsearch.randomizedtesting.ThreadLeakControl$StatementRunner.run(ThreadLeakControl.java:390)
at com.carrotsearch.randomizedtesting.ThreadLeakControl.forkTimeoutingTask(ThreadLeakControl.java:843)
at com.carrotsearch.randomizedtesting.ThreadLeakControl$3.evaluate(ThreadLeakControl.java:490)
at com.carrotsearch.randomizedtesting.RandomizedRunner.runSingleTest(RandomizedRunner.java:955)
at com.carrotsearch.randomizedtesting.RandomizedRunner$5.evaluate(RandomizedRunner.java:840)
at com.carrotsearch.randomizedtesting.RandomizedRunner$6.evaluate(RandomizedRunner.java:891)
at com.carrotsearch.randomizedtesting.RandomizedRunner$7.evaluate(RandomizedRunner.java:902)
at com.carrotsearch.randomizedtesting.rules.StatementAdapter.evaluate(StatementAdapter.java:36)
at com.carrotsearch.randomizedtesting.rules.SystemPropertiesRestoreRule$1.evaluate(SystemPropertiesRestoreRule.java:80)
at org.junit.rules.RunRules.evaluate(RunRules.java:20)
at org.apache.lucene.util.AbstractBeforeAfterRule$1.evaluate(AbstractBeforeAfterRule.java:45)
at com.carrotsearch.randomizedtesting.rules.StatementAdapter.evaluate(StatementAdapter.java:36)
at org.apache.lucene.util.TestRuleStoreClassName$1.evaluate(TestRuleStoreClassName.java:41)
at com.carrotsearch.randomizedtesting.rules.NoShadowingOrOverridesOnMethodsRule$1.evaluate(NoShadowingOrOverridesOnMethodsRule.java:40)
at com.carrotsearch.randomizedtesting.rules.NoShadowingOrOverridesOnMethodsRule$1.evaluate(NoShadowingOrOverridesOnMethodsRule.java:40)
at com.carrotsearch.randomizedtesting.rules.StatementAdapter.evaluate(StatementAdapter.java:36)
at com.carrotsearch.randomizedtesting.rules.StatementAdapter.evaluate(StatementAdapter.java:36)
at org.apache.lucene.util.TestRuleAssertionsRequired$1.evaluate(TestRuleAssertionsRequired.java:53)
at org.apache.lucene.util.TestRuleMarkFailure$1.evaluate(TestRuleMarkFailure.java:47)
at org.apache.lucene.util.TestRuleIgnoreAfterMaxFailures$1.evaluate(TestRuleIgnoreAfterMaxFailures.java:64)
at org.apache.lucene.util.TestRuleIgnoreTestSuites$1.evaluate(TestRuleIgnoreTestSuites.java:54)
at org.junit.rules.RunRules.evaluate(RunRules.java:20)
at com.carrotsearch.randomizedtesting.rules.StatementAdapter.evaluate(StatementAdapter.java:36)
at com.carrotsearch.randomizedtesting.ThreadLeakControl$StatementRunner.run(ThreadLeakControl.java:390)
at com.carrotsearch.randomizedtesting.ThreadLeakControl.lambda$forkTimeoutingTask$0(ThreadLeakControl.java:850)
at java.base/java.lang.Thread.run(Thread.java:1570)