You are viewing a plain text version of this content. The canonical link for it is here.
Posted to dev@kafka.apache.org by Apache Jenkins Server <je...@builds.apache.org> on 2020/05/21 21:03:58 UTC
Build failed in Jenkins: kafka-2.4-jdk8 #213
See <https://builds.apache.org/job/kafka-2.4-jdk8/213/display/redirect?page=changes>
Changes:
[rhauch] MINOR: Correct MirrorMaker2 integration test configs for Connect
------------------------------------------
[...truncated 2.29 MB...]
kafka.api.SaslSslAdminClientIntegrationTest > testCreateTopicsResponseMetadataAndConfig PASSED
kafka.api.SaslSslAdminClientIntegrationTest > testAttemptToCreateInvalidAcls STARTED
kafka.api.SaslSslAdminClientIntegrationTest > testAttemptToCreateInvalidAcls PASSED
kafka.api.SaslSslAdminClientIntegrationTest > testAclAuthorizationDenied STARTED
kafka.api.SaslSslAdminClientIntegrationTest > testAclAuthorizationDenied PASSED
kafka.api.SaslSslAdminClientIntegrationTest > testAclOperations STARTED
kafka.api.SaslSslAdminClientIntegrationTest > testAclOperations PASSED
kafka.api.SaslSslAdminClientIntegrationTest > testAclOperations2 STARTED
kafka.api.SaslSslAdminClientIntegrationTest > testAclOperations2 PASSED
kafka.api.SaslSslAdminClientIntegrationTest > testAclDelete STARTED
kafka.api.SaslSslAdminClientIntegrationTest > testAclDelete PASSED
kafka.api.SaslSslAdminClientIntegrationTest > testDescribeReplicaLogDirs STARTED
kafka.api.SaslSslAdminClientIntegrationTest > testDescribeReplicaLogDirs PASSED
kafka.api.SaslSslAdminClientIntegrationTest > testIncrementalAlterConfigsForLog4jLogLevels STARTED
kafka.api.SaslSslAdminClientIntegrationTest > testIncrementalAlterConfigsForLog4jLogLevels SKIPPED
kafka.api.SaslSslAdminClientIntegrationTest > testIncrementalAlterConfigsForLog4jLogLevelsCannotResetRootLogger STARTED
kafka.api.SaslSslAdminClientIntegrationTest > testIncrementalAlterConfigsForLog4jLogLevelsCannotResetRootLogger SKIPPED
kafka.api.SaslSslAdminClientIntegrationTest > testInvalidAlterPartitionReassignments STARTED
kafka.api.SaslSslAdminClientIntegrationTest > testInvalidAlterPartitionReassignments PASSED
kafka.api.SaslSslAdminClientIntegrationTest > testInvalidAlterConfigs STARTED
kafka.api.SaslSslAdminClientIntegrationTest > testInvalidAlterConfigs PASSED
kafka.api.SaslSslAdminClientIntegrationTest > testElectUncleanLeadersNoop STARTED
kafka.api.SaslSslAdminClientIntegrationTest > testElectUncleanLeadersNoop PASSED
kafka.api.SaslSslAdminClientIntegrationTest > testAlterLogDirsAfterDeleteRecords STARTED
kafka.api.SaslSslAdminClientIntegrationTest > testAlterLogDirsAfterDeleteRecords PASSED
kafka.api.SaslSslAdminClientIntegrationTest > testElectUncleanLeadersAndNoop STARTED
ERROR: Could not install GRADLE_4_10_3_HOME
java.lang.NullPointerException
kafka.api.SaslSslAdminClientIntegrationTest > testElectUncleanLeadersAndNoop PASSED
kafka.api.SaslSslAdminClientIntegrationTest > testElectPreferredLeaders STARTED
kafka.api.SaslSslAdminClientIntegrationTest > testElectPreferredLeaders PASSED
kafka.api.SaslSslAdminClientIntegrationTest > testDeleteConsumerGroupOffsets STARTED
kafka.api.SaslSslAdminClientIntegrationTest > testDeleteConsumerGroupOffsets PASSED
kafka.api.SaslSslAdminClientIntegrationTest > testListReassignmentsDoesNotShowNonReassigningPartitions STARTED
kafka.api.SaslSslAdminClientIntegrationTest > testListReassignmentsDoesNotShowNonReassigningPartitions PASSED
kafka.api.SaslSslAdminClientIntegrationTest > testConsumeAfterDeleteRecords STARTED
kafka.api.SaslSslAdminClientIntegrationTest > testConsumeAfterDeleteRecords PASSED
kafka.api.SaslSslAdminClientIntegrationTest > testClose STARTED
kafka.api.SaslSslAdminClientIntegrationTest > testClose PASSED
kafka.api.SaslSslAdminClientIntegrationTest > testReplicaCanFetchFromLogStartOffsetAfterDeleteRecords STARTED
kafka.api.SaslSslAdminClientIntegrationTest > testReplicaCanFetchFromLogStartOffsetAfterDeleteRecords PASSED
kafka.api.SaslSslAdminClientIntegrationTest > testIncrementalAlterConfigsForLog4jLogLevelsDoesNotWorkWithInvalidConfigs STARTED
kafka.api.SaslSslAdminClientIntegrationTest > testIncrementalAlterConfigsForLog4jLogLevelsDoesNotWorkWithInvalidConfigs SKIPPED
kafka.api.SaslSslAdminClientIntegrationTest > testDescribeConfigsForLog4jLogLevels STARTED
kafka.api.SaslSslAdminClientIntegrationTest > testDescribeConfigsForLog4jLogLevels PASSED
kafka.api.SaslSslAdminClientIntegrationTest > testMinimumRequestTimeouts STARTED
kafka.api.SaslSslAdminClientIntegrationTest > testMinimumRequestTimeouts PASSED
kafka.api.SaslSslAdminClientIntegrationTest > testIncrementalAlterConfigsForLog4jLogLevelsCanResetLoggerToCurrentRoot STARTED
kafka.api.SaslSslAdminClientIntegrationTest > testIncrementalAlterConfigsForLog4jLogLevelsCanResetLoggerToCurrentRoot SKIPPED
kafka.api.SaslSslAdminClientIntegrationTest > testForceClose STARTED
kafka.api.SaslSslAdminClientIntegrationTest > testForceClose PASSED
kafka.api.SaslSslAdminClientIntegrationTest > testListNodes STARTED
kafka.api.SaslSslAdminClientIntegrationTest > testListNodes PASSED
kafka.api.SaslSslAdminClientIntegrationTest > testDelayedClose STARTED
kafka.api.SaslSslAdminClientIntegrationTest > testDelayedClose PASSED
kafka.api.SaslSslAdminClientIntegrationTest > testLongTopicNames STARTED
kafka.api.SaslSslAdminClientIntegrationTest > testLongTopicNames PASSED
kafka.api.SaslSslAdminClientIntegrationTest > testCreateDeleteTopics STARTED
kafka.api.SaslSslAdminClientIntegrationTest > testCreateDeleteTopics PASSED
kafka.api.SaslSslAdminClientIntegrationTest > testOffsetsForTimesAfterDeleteRecords STARTED
kafka.api.SaslSslAdminClientIntegrationTest > testOffsetsForTimesAfterDeleteRecords PASSED
kafka.api.SaslSslAdminClientIntegrationTest > testListReassignmentsDoesNotShowDeletedPartitions STARTED
kafka.api.SaslSslAdminClientIntegrationTest > testListReassignmentsDoesNotShowDeletedPartitions PASSED
kafka.api.SaslSslAdminClientIntegrationTest > testDeleteRecordsWithException STARTED
kafka.api.SaslSslAdminClientIntegrationTest > testDeleteRecordsWithException PASSED
kafka.api.SaslSslAdminClientIntegrationTest > testDescribeLogDirs STARTED
kafka.api.SaslSslAdminClientIntegrationTest > testDescribeLogDirs PASSED
kafka.api.SaslSslAdminClientIntegrationTest > testAlterReplicaLogDirs STARTED
kafka.api.SaslSslAdminClientIntegrationTest > testAlterReplicaLogDirs PASSED
kafka.api.SaslSslAdminClientIntegrationTest > testLogStartOffsetCheckpoint STARTED
kafka.api.SaslSslAdminClientIntegrationTest > testLogStartOffsetCheckpoint PASSED
kafka.api.SaslSslAdminClientIntegrationTest > testAuthorizedOperations STARTED
kafka.api.SaslSslAdminClientIntegrationTest > testAuthorizedOperations PASSED
kafka.api.SaslSslAdminClientIntegrationTest > testAlterConfigsForLog4jLogLevelsDoesNotWork STARTED
kafka.api.SaslSslAdminClientIntegrationTest > testAlterConfigsForLog4jLogLevelsDoesNotWork SKIPPED
kafka.api.SaslSslAdminClientIntegrationTest > testDescribeCluster STARTED
kafka.api.SaslSslAdminClientIntegrationTest > testDescribeCluster PASSED
kafka.api.SaslSslAdminClientIntegrationTest > testElectUncleanLeadersForManyPartitions STARTED
kafka.api.SaslSslAdminClientIntegrationTest > testElectUncleanLeadersForManyPartitions PASSED
kafka.api.SaslSslAdminClientIntegrationTest > testElectUncleanLeadersForUnknownPartitions STARTED
kafka.api.SaslSslAdminClientIntegrationTest > testElectUncleanLeadersForUnknownPartitions PASSED
kafka.api.SaslSslAdminClientIntegrationTest > testCreatePartitions STARTED
kafka.api.SaslSslAdminClientIntegrationTest > testCreatePartitions PASSED
kafka.api.SaslSslAdminClientIntegrationTest > testDescribeNonExistingTopic STARTED
kafka.api.SaslSslAdminClientIntegrationTest > testDescribeNonExistingTopic PASSED
kafka.api.SaslSslAdminClientIntegrationTest > testMetadataRefresh STARTED
kafka.api.SaslSslAdminClientIntegrationTest > testMetadataRefresh PASSED
kafka.api.SaslSslAdminClientIntegrationTest > testDescribeAndAlterConfigs STARTED
kafka.api.SaslSslAdminClientIntegrationTest > testDescribeAndAlterConfigs PASSED
kafka.api.SaslSslAdminClientIntegrationTest > testElectUncleanLeadersForAllPartitions STARTED
kafka.api.SaslSslAdminClientIntegrationTest > testElectUncleanLeadersForAllPartitions PASSED
kafka.api.SaslSslAdminClientIntegrationTest > testLogStartOffsetAfterDeleteRecords STARTED
FATAL: command execution failed
java.io.EOFException
at java.io.ObjectInputStream$PeekInputStream.readFully(ObjectInputStream.java:2681)
at java.io.ObjectInputStream$BlockDataInputStream.readShort(ObjectInputStream.java:3156)
at java.io.ObjectInputStream.readStreamHeader(ObjectInputStream.java:862)
at java.io.ObjectInputStream.<init>(ObjectInputStream.java:358)
at hudson.remoting.ObjectInputStreamEx.<init>(ObjectInputStreamEx.java:49)
at hudson.remoting.Command.readFrom(Command.java:140)
at hudson.remoting.Command.readFrom(Command.java:126)
at hudson.remoting.AbstractSynchronousByteArrayCommandTransport.read(AbstractSynchronousByteArrayCommandTransport.java:36)
at hudson.remoting.SynchronousCommandTransport$ReaderThread.run(SynchronousCommandTransport.java:63)
Caused: java.io.IOException: Unexpected termination of the channel
at hudson.remoting.SynchronousCommandTransport$ReaderThread.run(SynchronousCommandTransport.java:77)
Caused: java.io.IOException: Backing channel 'H22' is disconnected.
at hudson.remoting.RemoteInvocationHandler.channelOrFail(RemoteInvocationHandler.java:214)
at hudson.remoting.RemoteInvocationHandler.invoke(RemoteInvocationHandler.java:283)
at com.sun.proxy.$Proxy141.isAlive(Unknown Source)
at hudson.Launcher$RemoteLauncher$ProcImpl.isAlive(Launcher.java:1150)
at hudson.Launcher$RemoteLauncher$ProcImpl.join(Launcher.java:1142)
at hudson.tasks.CommandInterpreter.join(CommandInterpreter.java:155)
at hudson.tasks.CommandInterpreter.perform(CommandInterpreter.java:109)
at hudson.tasks.CommandInterpreter.perform(CommandInterpreter.java:66)
at hudson.tasks.BuildStepMonitor$1.perform(BuildStepMonitor.java:20)
at hudson.model.AbstractBuild$AbstractBuildExecution.perform(AbstractBuild.java:741)
at hudson.model.Build$BuildExecution.build(Build.java:206)
at hudson.model.Build$BuildExecution.doRun(Build.java:163)
at hudson.model.AbstractBuild$AbstractBuildExecution.run(AbstractBuild.java:504)
at hudson.model.Run.execute(Run.java:1815)
at hudson.model.FreeStyleBuild.run(FreeStyleBuild.java:43)
at hudson.model.ResourceController.execute(ResourceController.java:97)
at hudson.model.Executor.run(Executor.java:429)
FATAL: Unable to delete script file /tmp/jenkins8723916400502606172.sh
java.io.EOFException
at java.io.ObjectInputStream$PeekInputStream.readFully(ObjectInputStream.java:2681)
at java.io.ObjectInputStream$BlockDataInputStream.readShort(ObjectInputStream.java:3156)
at java.io.ObjectInputStream.readStreamHeader(ObjectInputStream.java:862)
at java.io.ObjectInputStream.<init>(ObjectInputStream.java:358)
at hudson.remoting.ObjectInputStreamEx.<init>(ObjectInputStreamEx.java:49)
at hudson.remoting.Command.readFrom(Command.java:140)
at hudson.remoting.Command.readFrom(Command.java:126)
at hudson.remoting.AbstractSynchronousByteArrayCommandTransport.read(AbstractSynchronousByteArrayCommandTransport.java:36)
at hudson.remoting.SynchronousCommandTransport$ReaderThread.run(SynchronousCommandTransport.java:63)
Caused: java.io.IOException: Unexpected termination of the channel
at hudson.remoting.SynchronousCommandTransport$ReaderThread.run(SynchronousCommandTransport.java:77)
Caused: hudson.remoting.ChannelClosedException: Channel "unknown": Remote call on H22 failed. The channel is closing down or has closed down
at hudson.remoting.Channel.call(Channel.java:950)
at hudson.FilePath.act(FilePath.java:1072)
at hudson.FilePath.act(FilePath.java:1061)
at hudson.FilePath.delete(FilePath.java:1542)
at hudson.tasks.CommandInterpreter.perform(CommandInterpreter.java:123)
at hudson.tasks.CommandInterpreter.perform(CommandInterpreter.java:66)
at hudson.tasks.BuildStepMonitor$1.perform(BuildStepMonitor.java:20)
at hudson.model.AbstractBuild$AbstractBuildExecution.perform(AbstractBuild.java:741)
at hudson.model.Build$BuildExecution.build(Build.java:206)
at hudson.model.Build$BuildExecution.doRun(Build.java:163)
at hudson.model.AbstractBuild$AbstractBuildExecution.run(AbstractBuild.java:504)
at hudson.model.Run.execute(Run.java:1815)
at hudson.model.FreeStyleBuild.run(FreeStyleBuild.java:43)
at hudson.model.ResourceController.execute(ResourceController.java:97)
at hudson.model.Executor.run(Executor.java:429)
Build step 'Execute shell' marked build as failure
ERROR: Step ?[Deprecated] Publish FindBugs analysis results? failed: no workspace for kafka-2.4-jdk8 #213
ERROR: Step ?Publish JUnit test result report? failed: no workspace for kafka-2.4-jdk8 #213
ERROR: H22 is offline; cannot locate JDK 1.8 (latest)
ERROR: H22 is offline; cannot locate Gradle 4.10.3
Setting GRADLE_4_10_3_HOME=/home/jenkins/tools/gradle/4.10.3
Not sending mail to unregistered user konstantine@confluent.io
Jenkins build is back to normal : kafka-2.4-jdk8 #214
Posted by Apache Jenkins Server <je...@builds.apache.org>.
See <https://builds.apache.org/job/kafka-2.4-jdk8/214/display/redirect?page=changes>