You are viewing a plain text version of this content. The canonical link for it is here.
Posted to builds@cassandra.apache.org by Apache Jenkins Server <je...@builds.apache.org> on 2026/06/22 21:00:05 UTC

Build complete: Cassandra-6.0 #57 [UNSTABLE] 105694f625e53785e774c82e713623adef6a21a4

-------------------------------------------------------------------------------
  Build Cassandra-6.0 #57 Still Unstable
  URL: https://ci-cassandra.apache.org/job/Cassandra-6.0/57/
  -------------------------------------------------------------------------------
  Changes:
  No changes

  -------------------------------------------------------------------------------
  Failed Tests:
  69 tests failed.
FAILED:  cqlshlib.python3.10.jdk11.cython.x86_64.test.test_unicode.TestCqlshUnicode.Tests / cqlsh-test jdk11 python3.11 cython / test_unicode_multiline_input
FAILED:  cqlshlib.python3.10.jdk11.no_cython.x86_64.test.test_unicode.TestCqlshUnicode.Tests / cqlsh-test jdk11 python3.11 / test_unicode_multiline_input
FAILED:  dtest-latest.disk_balance_test.TestDiskBalance.Tests / dtest-latest jdk11 48/64 / test_disk_balance_after_boundary_change_stcs
FAILED:  dtest-latest.disk_balance_test.TestDiskBalance.Tests / dtest-latest jdk11 48/64 / test_disk_balance_after_boundary_change_stcs
FAILED:  dtest-latest.disk_balance_test.TestDiskBalance.Tests / dtest-latest jdk21 45/64 / test_disk_balance_decommission
FAILED:  dtest-latest.disk_balance_test.TestDiskBalance.Tests / dtest-latest jdk11 45/64 / test_disk_balance_decommission
FAILED:  dtest-latest.disk_balance_test.TestDiskBalance.Tests / dtest-latest jdk11 45/64 / test_disk_balance_decommission
FAILED:  dtest-latest.disk_balance_test.TestDiskBalance.Tests / dtest-latest jdk21 45/64 / test_disk_balance_decommission
FAILED:  dtest-latest.disk_balance_test.TestDiskBalance.Tests / dtest-latest jdk21 44/64 / test_disk_balance_replace_different_address
FAILED:  dtest-latest.materialized_views_test.TestMaterializedViews.Tests / dtest-latest jdk21 17/64 / test_complex_mv_select_statements
FAILED:  dtest-latest.materialized_views_test.TestMaterializedViews.Tests / dtest-latest jdk17 17/64 / test_complex_mv_select_statements
FAILED:  dtest-latest.replace_address_test.TestReplaceAddress.Tests / dtest-latest jdk11 18/64 / test_fail_without_replace
FAILED:  dtest-latest.secondary_indexes_test.TestSecondaryIndexes.Tests / dtest-latest jdk21 61/64 / test_data_created_before_index_not_returned_in_where_query
FAILED:  dtest-novnode.materialized_views_test.TestMaterializedViews.Tests / dtest-novnode jdk17 5/64 / test_drop_with_stopped_build
FAILED:  dtest-novnode.repair_tests.repair_test.TestRepair.Tests / dtest-novnode jdk11 8/64 / test_failure_during_validation
FAILED:  dtest-novnode.replace_address_test.TestReplaceAddress.Tests / dtest-novnode jdk21 31/64 / test_fail_without_replace
FAILED:  dtest-novnode.secondary_indexes_test.TestSecondaryIndexes.Tests / dtest-novnode jdk21 14/64 / test_6924_dropping_cf
FAILED:  dtest-upgrade-large-novnode.upgrade_tests.upgrade_through_versions_test.TestUpgrade_current_5_0_x_To_indev_6_0_x.Tests / dtest-upgrade-large-novnode jdk11 1/40 / test_bootstrap
FAILED:  dtest-upgrade-large.upgrade_tests.upgrade_through_versions_test.TestUpgrade_current_5_0_x_To_indev_6_0_x.Tests / dtest-upgrade-large jdk11 6/40 / test_rolling_upgrade_with_internode_ssl
FAILED:  dtest-upgrade-large.upgrade_tests.upgrade_through_versions_test.TestUpgrade_current_6_0_x_To_indev_6_0_x.Tests / dtest-upgrade-large jdk11 8/40 / test_bootstrap_multidc
FAILED:  dtest-upgrade-novnode.upgrade_tests.cql_tests.TestCQLNodes3RF3_Upgrade_current_5_0_x_To_indev_6_0_x.Tests / dtest-upgrade-novnode jdk11 74/160 / test_end_of_component_as_end_key
FAILED:  dtest-upgrade-novnode.upgrade_tests.cql_tests.TestCQLNodes3RF3_Upgrade_current_6_0_x_To_indev_6_0_x.Tests / dtest-upgrade-novnode jdk11 93/160 / test_nan_infinity
FAILED:  dtest-upgrade-novnode.upgrade_tests.cql_tests.TestCQLNodes3RF3_Upgrade_current_6_0_x_To_indev_6_0_x.Tests / dtest-upgrade-novnode jdk11 15/160 / test_range_tombstones
FAILED:  dtest-upgrade-novnode.upgrade_tests.cql_tests.TestCQLNodes3RF3_Upgrade_current_6_0_x_To_indev_6_0_x.Tests / dtest-upgrade-novnode jdk11 114/160 / test_static_with_empty_clustering
FAILED:  dtest-upgrade.upgrade_tests.cql_tests.TestCQLNodes2RF1_Upgrade_current_6_0_x_To_indev_6_0_x.Tests / dtest-upgrade jdk11 88/160 / test_dynamic_cf
FAILED:  dtest-upgrade.upgrade_tests.cql_tests.TestCQLNodes2RF1_Upgrade_current_6_0_x_To_indev_6_0_x.Tests / dtest-upgrade jdk11 102/160 / test_order_by_with_in
FAILED:  dtest-upgrade.upgrade_tests.cql_tests.TestCQLNodes3RF3_Upgrade_current_5_0_x_To_indev_6_0_x.Tests / dtest-upgrade jdk11 66/160 / test_cas_and_ttl
FAILED:  dtest-upgrade.upgrade_tests.cql_tests.TestCQLNodes3RF3_Upgrade_current_5_0_x_To_indev_6_0_x.Tests / dtest-upgrade jdk11 25/160 / test_timeuuid
FAILED:  dtest-upgrade.upgrade_tests.cql_tests.TestCQLNodes3RF3_Upgrade_current_6_0_x_To_indev_6_0_x.Tests / dtest-upgrade jdk11 65/160 / test_SIM_assertion_error
FAILED:  dtest-upgrade.upgrade_tests.cql_tests.TestCQLNodes3RF3_Upgrade_current_6_0_x_To_indev_6_0_x.Tests / dtest-upgrade jdk11 22/160 / test_nonpure_function_collection
FAILED:  dtest.materialized_views_test.TestMaterializedViews.Tests / dtest jdk11 46/64 / test_drop_mv
FAILED:  dtest.replace_address_test.TestReplaceAddress.Tests / dtest jdk17 18/64 / test_fail_without_replace
FAILED:  dtest.replace_address_test.TestReplaceAddress.Tests / dtest jdk11 18/64 / test_fail_without_replace
FAILED:  org.apache.cassandra.distributed.test.SinglePartitionReadCommandTest.Tests / jvm-dtest jdk21 6/16 / testNonCompactTableWithOnlyUpdatedColumnOnOneNodeAndColumnDeletionOnTheOther-_jdk21_x86_64
FAILED:  org.apache.cassandra.distributed.test.accord.InteropAccordCQLTest.Tests / jvm-dtest jdk17 16/16 / testCASSimulatorLite-_jdk17_x86_64
FAILED:  org.apache.cassandra.distributed.test.accord.NewSchemaTest.Tests / jvm-dtest jdk11 11/16 / test-_jdk11_x86_64
FAILED:  org.apache.cassandra.distributed.test.cql3.PaxosV2MultiNodeTableWalkTest.Tests / jvm-dtest jdk21 5/16 / test-_jdk21_x86_64
FAILED:  org.apache.cassandra.service.accord.journal.AccordJournalBurnTest.Tests / jvm-dtest jdk21 13/16 / testOne-_jdk21_x86_64
FAILED:  cqlshlib.python3.10.jdk11.cython.x86_64.test.test_unicode.TestCqlshUnicode.Tests / cqlsh-test jdk11 python3.11 cython / test_unicode_value_round_trip
FAILED:  org.apache.cassandra.distributed.test.accord.InteropAccordCQLTest.Tests / jvm-dtest jdk11 16/16 / testCASSimulatorLite-_jdk11_x86_64
FAILED:  org.apache.cassandra.simulator.test.TrivialSimulationTest.Tests / simulator-dtest jdk11 1/2 / trivialTest-_jdk11_x86_64
FAILED:  cqlshlib.python3.10.jdk11.cython.x86_64.test.test_unicode.TestCqlshUnicode.Tests / cqlsh-test jdk11 python3.8 cython / test_unicode_desc
FAILED:  cqlshlib.python3.10.jdk11.cython.x86_64.test.test_unicode.TestCqlshUnicode.Tests / cqlsh-test jdk11 python3.11 cython / test_unicode_desc
FAILED:  dtest.materialized_views_test.TestMaterializedViews.Tests / dtest jdk21 63/64 / test_drop_with_stopped_build
FAILED:  dtest.secondary_indexes_test.TestSecondaryIndexes.Tests / dtest jdk21 63/64 / test_6924_dropping_ks
FAILED:  cqlshlib.python3.10.jdk11.no_cython.x86_64.test.test_unicode.TestCqlshUnicode.Tests / cqlsh-test jdk11 python3.8 / test_unicode_value_round_trip
FAILED:  cqlshlib.python3.10.jdk11.no_cython.x86_64.test.test_unicode.TestCqlshUnicode.Tests / cqlsh-test jdk11 python3.11 / test_unicode_value_round_trip
FAILED:  cqlshlib.python3.10.jdk11.cython.x86_64.test.test_unicode.TestCqlshUnicode.Tests / cqlsh-test jdk11 python3.11 cython / test_unicode_identifier
FAILED:  cqlshlib.python3.10.jdk11.cython.x86_64.test.test_unicode.TestCqlshUnicode.Tests / cqlsh-test jdk11 python3.8 cython / test_unicode_identifier
FAILED:  org.apache.cassandra.simulator.test.ShortAccordSimulationTest.Tests / simulator-dtest jdk11 2/2 / simulationTest-_jdk11_x86_64
FAILED:  cqlshlib.python3.10.jdk11.no_cython.x86_64.test.test_unicode.TestCqlshUnicode.Tests / cqlsh-test jdk11 python3.11 / test_unicode_desc
FAILED:  cqlshlib.python3.10.jdk11.no_cython.x86_64.test.test_unicode.TestCqlshUnicode.Tests / cqlsh-test jdk11 python3.8 / test_unicode_desc
FAILED:  cqlshlib.python3.10.jdk11.no_cython.x86_64.test.test_unicode.TestCqlshUnicode.Tests / cqlsh-test jdk11 python3.8 / test_unicode_identifier
FAILED:  cqlshlib.python3.10.jdk11.no_cython.x86_64.test.test_unicode.TestCqlshUnicode.Tests / cqlsh-test jdk11 python3.11 / test_unicode_identifier
FAILED:  junit.framework.TestSuite.Tests / jvm-dtest jdk11 3/16 / org.apache.cassandra.distributed.test.QueriesTableTest-_jdk11_x86_64
FAILED:  junit.framework.TestSuite.Tests / jvm-dtest jdk17 3/16 / org.apache.cassandra.distributed.test.QueriesTableTest-_jdk17_x86_64
FAILED:  junit.framework.TestSuite.Tests / jvm-dtest jdk21 3/16 / org.apache.cassandra.distributed.test.QueriesTableTest-_jdk21_x86_64
FAILED:  org.apache.cassandra.distributed.test.QueriesTableTest.Tests / jvm-dtest jdk11 3/16 / shouldExposeCAS-_jdk11_x86_64
FAILED:  org.apache.cassandra.distributed.test.QueriesTableTest.Tests / jvm-dtest jdk17 3/16 / shouldExposeCAS-_jdk17_x86_64
FAILED:  org.apache.cassandra.distributed.test.QueriesTableTest.Tests / jvm-dtest jdk21 3/16 / shouldExposeCAS-_jdk21_x86_64
FAILED:  org.apache.cassandra.distributed.test.QueriesTableTest.Tests / jvm-dtest jdk11 3/16 / shouldExposeReadsAndWrites-_jdk11_x86_64
FAILED:  org.apache.cassandra.distributed.test.QueriesTableTest.Tests / jvm-dtest jdk17 3/16 / shouldExposeReadsAndWrites-_jdk17_x86_64
FAILED:  org.apache.cassandra.distributed.test.QueriesTableTest.Tests / jvm-dtest jdk21 3/16 / shouldExposeReadsAndWrites-_jdk21_x86_64
FAILED:  org.apache.cassandra.simulator.test.EpochStressTest.Tests / simulator-dtest jdk11 2/2 / manyEpochsAndAccordConverges-_jdk11_x86_64
FAILED:  org.apache.cassandra.simulator.test.SingleNodeSingleTableASTTest.Tests / simulator-dtest jdk11 2/2 / accordFull-_jdk11_x86_64
FAILED:  org.apache.cassandra.simulator.test.SingleNodeSingleTableASTTest.Tests / simulator-dtest jdk11 2/2 / accordMixedReads-_jdk11_x86_64
FAILED:  org.apache.cassandra.simulator.test.AccordHarrySimulationTest.Tests / simulator-dtest jdk11 2/2 / test-_jdk11_x86_64
FAILED:  org.apache.cassandra.simulator.test.ShortPaxosSimulationTest.Tests / simulator-dtest jdk11 1/2 / selfReconcileTest-cassandra.testtag_IS_UNDEFINED
FAILED:  org.apache.cassandra.distributed.upgrade.ClusterMetadataUpgradeHarryTest.Tests / jvm-dtest-upgrade jdk11 4/6 / simpleUpgradeTest-cassandra.testtag_IS_UNDEFINED

  -------------------------------------------------------------------------------
  For complete test report and logs see https://nightlies.apache.org/cassandra/Cassandra-6.0/57/