You are viewing a plain text version of this content. The canonical link for it is here.
Posted to yarn-dev@hadoop.apache.org by Apache Jenkins Server <je...@builds.apache.org> on 2015/02/08 16:21:17 UTC

Hadoop-Yarn-trunk - Build # 832 - Still Failing

See https://builds.apache.org/job/Hadoop-Yarn-trunk/832/

###################################################################################
########################## LAST 60 LINES OF THE CONSOLE ###########################
[...truncated 8517 lines...]
[INFO] Reactor Summary:
[INFO] 
[INFO] hadoop-yarn ....................................... SUCCESS [  3.032 s]
[INFO] hadoop-yarn-api ................................... SUCCESS [03:00 min]
[INFO] hadoop-yarn-common ................................ SUCCESS [02:38 min]
[INFO] hadoop-yarn-server ................................ SUCCESS [  0.096 s]
[INFO] hadoop-yarn-server-common ......................... SUCCESS [ 41.163 s]
[INFO] hadoop-yarn-server-nodemanager .................... SUCCESS [06:17 min]
[INFO] hadoop-yarn-server-web-proxy ...................... SUCCESS [ 21.896 s]
[INFO] hadoop-yarn-server-applicationhistoryservice ...... SUCCESS [03:00 min]
[INFO] hadoop-yarn-server-resourcemanager ................ FAILURE [47:20 min]
[INFO] hadoop-yarn-server-tests .......................... SKIPPED
[INFO] hadoop-yarn-client ................................ SKIPPED
[INFO] hadoop-yarn-server-sharedcachemanager ............. SKIPPED
[INFO] hadoop-yarn-applications .......................... SKIPPED
[INFO] hadoop-yarn-applications-distributedshell ......... SKIPPED
[INFO] hadoop-yarn-applications-unmanaged-am-launcher .... SKIPPED
[INFO] hadoop-yarn-site .................................. SKIPPED
[INFO] hadoop-yarn-registry .............................. SKIPPED
[INFO] hadoop-yarn-project ............................... SKIPPED
[INFO] ------------------------------------------------------------------------
[INFO] BUILD FAILURE
[INFO] ------------------------------------------------------------------------
[INFO] Total time: 01:03 h
[INFO] Finished at: 2015-02-08T15:20:56+00:00
[INFO] Final Memory: 60M/709M
[INFO] ------------------------------------------------------------------------
[ERROR] Failed to execute goal org.apache.maven.plugins:maven-surefire-plugin:2.17:test (default-test) on project hadoop-yarn-server-resourcemanager: There are test failures.
[ERROR] 
[ERROR] Please refer to /home/jenkins/jenkins-slave/workspace/Hadoop-Yarn-trunk/hadoop-yarn-project/hadoop-yarn/hadoop-yarn-server/hadoop-yarn-server-resourcemanager/target/surefire-reports for the individual test results.
[ERROR] -> [Help 1]
[ERROR] 
[ERROR] To see the full stack trace of the errors, re-run Maven with the -e switch.
[ERROR] Re-run Maven using the -X switch to enable full debug logging.
[ERROR] 
[ERROR] For more information about the errors and possible solutions, please read the following articles:
[ERROR] [Help 1] http://cwiki.apache.org/confluence/display/MAVEN/MojoFailureException
[ERROR] 
[ERROR] After correcting the problems, you can resume the build with the command
[ERROR]   mvn <goals> -rf :hadoop-yarn-server-resourcemanager
Build step 'Execute shell' marked build as failure
Archiving artifacts
Recording test results
Updating YARN-3089
Updating HDFS-7732
Updating HADOOP-11485
Updating HDFS-7710
Updating HADOOP-11520
Updating HDFS-7720
Updating HDFS-7751
Updating MAPREDUCE-6227
Updating HDFS-7738
Updating HADOOP-11535
Updating YARN-2694
Updating YARN-3144
Updating YARN-3143
Sending e-mails to: yarn-dev@hadoop.apache.org
Email was triggered for: Failure
Sending email for trigger: Failure



###################################################################################
############################## FAILED TESTS (if any) ##############################
1 tests failed.
FAILED:  org.apache.hadoop.yarn.server.resourcemanager.recovery.TestFSRMStateStore.testFSRMStateStoreClientRetry

Error Message:
null

Stack Trace:
java.lang.AssertionError: null
	at org.junit.Assert.fail(Assert.java:86)
	at org.junit.Assert.assertTrue(Assert.java:41)
	at org.junit.Assert.assertFalse(Assert.java:64)
	at org.junit.Assert.assertFalse(Assert.java:74)
	at org.apache.hadoop.yarn.server.resourcemanager.recovery.TestFSRMStateStore.testFSRMStateStoreClientRetry(TestFSRMStateStore.java:289)