You are viewing a plain text version of this content. The canonical link for it is here.
Posted to builds@beam.apache.org by Apache Jenkins Server <je...@builds.apache.org> on 2023/12/02 08:29:25 UTC

beam_PostCommit_Java_Sickbay - Build # 1559 - Aborted!

beam_PostCommit_Java_Sickbay - Build # 1559 - Aborted:

Check console output at https://ci-beam.apache.org/job/beam_PostCommit_Java_Sickbay/1559/ to view the results.

Build failed in Jenkins: beam_PostCommit_Java_Sickbay #1563

Posted by Apache Jenkins Server <je...@builds.apache.org>.
See <https://ci-beam.apache.org/job/beam_PostCommit_Java_Sickbay/1563/display/redirect>

Changes:


------------------------------------------
[...truncated 51.67 KB...]

> Task :runners:direct-java:validatesRunnerSickbay FAILED

org.apache.beam.sdk.io.BoundedReadFromUnboundedSourceTest > testTimeBound FAILED
    org.junit.runners.model.TestTimedOutException at BoundedReadFromUnboundedSourceTest.java:145

1 test completed, 1 failed

> Task :runners:samza:validatesRunnerSickbay

org.apache.beam.sdk.coders.PCollectionCustomCoderTest > testDecodingNPException FAILED
    java.lang.AssertionError at Assert.java:89

org.apache.beam.sdk.coders.PCollectionCustomCoderTest > testDecodingIOException FAILED
    java.lang.AssertionError at Assert.java:89

[TransientBlobCache shutdown hook] INFO org.apache.flink.runtime.blob.TransientBlobCache - Shutting down BLOB cache
[PermanentBlobCache shutdown hook] INFO org.apache.flink.runtime.blob.PermanentBlobCache - Shutting down BLOB cache
[BlobServer shutdown hook] INFO org.apache.flink.runtime.blob.BlobServer - Stopped BLOB server at 0.0.0.0:44933

> Task :runners:flink:1.16:validatesRunnerSickbay

org.apache.beam.sdk.transforms.ParDoTest$TimestampTests > testOnWindowTimestampSkew FAILED
    java.lang.AssertionError at ParDoTest.java:2238
        Caused by: java.lang.AssertionError at MatcherAssert.java:18

1 test completed, 1 failed

> Task :runners:flink:1.16:validatesRunnerSickbay FAILED
> Task :runners:spark:3:job-server:validatesRunnerSickbay

> Task :runners:samza:validatesRunnerSickbay

org.apache.beam.sdk.io.BoundedReadFromUnboundedSourceTest > testTimeBound FAILED
    org.junit.runners.model.TestTimedOutException at BoundedReadFromUnboundedSourceTest.java:145

[shutdown-hook-0] INFO org.apache.spark.util.ShutdownHookManager - Shutdown hook called
[shutdown-hook-0] INFO org.apache.spark.util.ShutdownHookManager - Deleting directory /tmp/spark-dca00cdf-142e-4925-971a-f2c4308449fa

> Task :runners:flink:1.15:compileJava
Note: Some input files use or override a deprecated API.
Note: Recompile with -Xlint:deprecation for details.
Note: Some input files use unchecked or unsafe operations.
Note: Recompile with -Xlint:unchecked for details.

> Task :runners:flink:1.13:compileJava
Note: Some input files use or override a deprecated API.
Note: Recompile with -Xlint:deprecation for details.
Note: Some input files use unchecked or unsafe operations.
Note: Recompile with -Xlint:unchecked for details.

> Task :runners:flink:1.12:compileJava
Note: Some input files use or override a deprecated API.
Note: Recompile with -Xlint:deprecation for details.
Note: Some input files use unchecked or unsafe operations.
Note: Recompile with -Xlint:unchecked for details.

> Task :runners:flink:1.14:compileJava
Note: Some input files use or override a deprecated API.
Note: Recompile with -Xlint:deprecation for details.
Note: Some input files use unchecked or unsafe operations.
Note: Recompile with -Xlint:unchecked for details.

> Task :runners:flink:1.15:classes
> Task :runners:flink:1.13:classes
> Task :runners:flink:1.15:jar
> Task :runners:flink:1.14:classes
> Task :runners:flink:1.12:classes
> Task :runners:flink:1.14:jar
> Task :runners:flink:1.13:jar
> Task :runners:flink:1.12:jar
> Task :runners:flink:1.15:validatesRunnerSickbay
> Task :runners:flink:1.14:validatesRunnerSickbay
> Task :runners:flink:1.13:validatesRunnerSickbay
> Task :runners:flink:1.12:validatesRunnerSickbay

[PermanentBlobCache shutdown hook] INFO org.apache.flink.runtime.blob.PermanentBlobCache - Shutting down BLOB cache
[TransientBlobCache shutdown hook] INFO org.apache.flink.runtime.blob.TransientBlobCache - Shutting down BLOB cache
[BlobServer shutdown hook] INFO org.apache.flink.runtime.blob.BlobServer - Stopped BLOB server at 0.0.0.0:42965

> Task :runners:flink:1.15:validatesRunnerSickbay

org.apache.beam.sdk.transforms.ParDoTest$TimestampTests > testOnWindowTimestampSkew FAILED
    java.lang.AssertionError at ParDoTest.java:2238
        Caused by: java.lang.AssertionError at MatcherAssert.java:18

1 test completed, 1 failed

> Task :runners:flink:1.15:validatesRunnerSickbay FAILED

> Task :runners:flink:1.14:validatesRunnerSickbay

org.apache.beam.sdk.transforms.ParDoTest$TimestampTests > testOnWindowTimestampSkew FAILED
    java.lang.AssertionError at ParDoTest.java:2238
        Caused by: java.lang.AssertionError at MatcherAssert.java:18

[PermanentBlobCache shutdown hook] INFO org.apache.flink.runtime.blob.PermanentBlobCache - Shutting down BLOB cache
[TransientBlobCache shutdown hook] INFO org.apache.flink.runtime.blob.TransientBlobCache - Shutting down BLOB cache
[BlobServer shutdown hook] INFO org.apache.flink.runtime.blob.BlobServer - Stopped BLOB server at 0.0.0.0:34727

> Task :runners:flink:1.13:validatesRunnerSickbay

org.apache.beam.sdk.transforms.ParDoTest$TimestampTests > testOnWindowTimestampSkew FAILED
    java.lang.AssertionError at ParDoTest.java:2238
        Caused by: java.lang.AssertionError at MatcherAssert.java:18

[TransientBlobCache shutdown hook] INFO org.apache.flink.runtime.blob.TransientBlobCache - Shutting down BLOB cache
[PermanentBlobCache shutdown hook] INFO org.apache.flink.runtime.blob.PermanentBlobCache - Shutting down BLOB cache
[BlobServer shutdown hook] INFO org.apache.flink.runtime.blob.BlobServer - Stopped BLOB server at 0.0.0.0:44489
[ForkJoinPool.commonPool-worker-9] INFO org.apache.flink.runtime.dispatcher.DispatcherRestEndpoint - Removing cache directory /tmp/flink-web-ui
[TransientBlobCache shutdown hook] INFO org.apache.flink.runtime.blob.TransientBlobCache - Shutting down BLOB cache

> Task :runners:flink:1.12:validatesRunnerSickbay

org.apache.beam.sdk.transforms.ParDoTest$TimestampTests > testOnWindowTimestampSkew FAILED
    java.lang.AssertionError at ParDoTest.java:2238
        Caused by: java.lang.AssertionError at MatcherAssert.java:18

[PermanentBlobCache shutdown hook] INFO org.apache.flink.runtime.blob.PermanentBlobCache - Shutting down BLOB cache
[ForkJoinPool.commonPool-worker-9] INFO org.apache.flink.runtime.dispatcher.DispatcherRestEndpoint - Shut down complete.
[BlobServer shutdown hook] INFO org.apache.flink.runtime.blob.BlobServer - Stopped BLOB server at 0.0.0.0:41023

> Task :runners:flink:1.14:validatesRunnerSickbay FAILED

1 test completed, 1 failed

> Task :runners:flink:1.12:validatesRunnerSickbay FAILED

1 test completed, 1 failed

> Task :runners:flink:1.13:validatesRunnerSickbay FAILED

1 test completed, 1 failed

> Task :runners:samza:validatesRunnerSickbay

org.apache.beam.sdk.io.FileIOTest > testMatchWatchForNewFiles FAILED
    org.apache.samza.config.ConfigException at FileIOTest.java:363
        Caused by: java.lang.reflect.InvocationTargetException at FileIOTest.java:363
            Caused by: java.lang.OutOfMemoryError at UTF8.java:36

org.apache.beam.sdk.io.FileIOTest > testMatchDisallowEmptyNonWildcard FAILED
    java.lang.OutOfMemoryError

org.apache.beam.sdk.io.FileIOTest > testMatchAllDisallowEmptyNonWildcard FAILED
    java.lang.AssertionError at MatcherAssert.java:18

org.apache.beam.sdk.io.FileIOTest > testMatchAllDisallowEmptyExplicit FAILED
    java.lang.AssertionError at MatcherAssert.java:18

org.apache.beam.sdk.io.FileIOTest > testFileIoDynamicNaming FAILED
    java.lang.IllegalArgumentException at FileIOTest.java:545

org.apache.beam.sdk.io.FileIOTest > testMatchDisallowEmptyDefault FAILED
    java.lang.AssertionError at MatcherAssert.java:18

org.apache.beam.sdk.io.FileIOTest > testMatchAndMatchAll FAILED
    java.lang.AssertionError at FileIOTest.java:121
        Caused by: java.lang.AssertionError at MatcherAssert.java:18

org.apache.beam.sdk.io.FileIOTest > testMatchDisallowEmptyExplicit FAILED
    java.lang.AssertionError at MatcherAssert.java:18

org.apache.beam.sdk.transforms.GroupIntoBatchesTest > testInGlobalWindowBatchSizeByteSizeFn FAILED
    java.lang.AssertionError at GroupIntoBatchesTest.java:208
        Caused by: java.lang.AssertionError at GroupIntoBatchesTest.java:214

org.apache.beam.sdk.transforms.WithTimestampsTest > withTimestampsWithNullTimestampShouldThrow FAILED
    java.lang.AssertionError at MatcherAssert.java:18

org.apache.beam.sdk.transforms.WithTimestampsTest > withTimestampsBackwardsInTimeShouldThrow FAILED
    java.lang.AssertionError at MatcherAssert.java:18

24 tests completed, 17 failed

> Task :runners:samza:validatesRunnerSickbay FAILED

FAILURE: Build completed with 8 failures.

1: Task failed with an exception.
-----------
* What went wrong:
Execution failed for task ':runners:portability:java:validatesRunnerSickbay'.
> There were failing tests. See the report at: file://<https://ci-beam.apache.org/job/beam_PostCommit_Java_Sickbay/ws/src/runners/portability/java/build/reports/tests/validatesRunnerSickbay/index.html>
==============================================================================

2: Task failed with an exception.
-----------
* What went wrong:
Execution failed for task ':runners:direct-java:validatesRunnerSickbay'.
> There were failing tests. See the report at: file://<https://ci-beam.apache.org/job/beam_PostCommit_Java_Sickbay/ws/src/runners/direct-java/build/reports/tests/validatesRunnerSickbay/index.html>
==============================================================================

3: Task failed with an exception.
-----------
* What went wrong:
Execution failed for task ':runners:flink:1.16:validatesRunnerSickbay'.
> There were failing tests. See the report at: file://<https://ci-beam.apache.org/job/beam_PostCommit_Java_Sickbay/ws/src/runners/flink/1.16/build/reports/tests/validatesRunnerSickbay/index.html>
==============================================================================

4: Task failed with an exception.
-----------
* What went wrong:
Execution failed for task ':runners:flink:1.15:validatesRunnerSickbay'.
> There were failing tests. See the report at: file://<https://ci-beam.apache.org/job/beam_PostCommit_Java_Sickbay/ws/src/runners/flink/1.15/build/reports/tests/validatesRunnerSickbay/index.html>
==============================================================================

5: Task failed with an exception.
-----------
* What went wrong:
Execution failed for task ':runners:flink:1.14:validatesRunnerSickbay'.
> There were failing tests. See the report at: file://<https://ci-beam.apache.org/job/beam_PostCommit_Java_Sickbay/ws/src/runners/flink/1.14/build/reports/tests/validatesRunnerSickbay/index.html>
==============================================================================

6: Task failed with an exception.
-----------
* What went wrong:
Execution failed for task ':runners:flink:1.12:validatesRunnerSickbay'.
> There were failing tests. See the report at: file://<https://ci-beam.apache.org/job/beam_PostCommit_Java_Sickbay/ws/src/runners/flink/1.12/build/reports/tests/validatesRunnerSickbay/index.html>
==============================================================================

7: Task failed with an exception.
-----------
* What went wrong:
Execution failed for task ':runners:flink:1.13:validatesRunnerSickbay'.
> There were failing tests. See the report at: file://<https://ci-beam.apache.org/job/beam_PostCommit_Java_Sickbay/ws/src/runners/flink/1.13/build/reports/tests/validatesRunnerSickbay/index.html>
==============================================================================

8: Task failed with an exception.
-----------
* What went wrong:
Execution failed for task ':runners:samza:validatesRunnerSickbay'.
> There were failing tests. See the report at: file://<https://ci-beam.apache.org/job/beam_PostCommit_Java_Sickbay/ws/src/runners/samza/build/reports/tests/validatesRunnerSickbay/index.html>
==============================================================================

Deprecated Gradle features were used in this build, making it incompatible with Gradle 9.0.

You can use '--warning-mode all' to show the individual deprecation warnings and determine if they come from your own scripts or plugins.

For more on this, please refer to https://docs.gradle.org/8.4/userguide/command_line_interface.html#sec:command_line_warnings in the Gradle documentation.

BUILD FAILED in 15m 51s
145 actionable tasks: 100 executed, 45 from cache

Publishing build scan...
https://ge.apache.org/s/q356p2jri3mki

Build step 'Invoke Gradle script' changed build result to FAILURE
Build step 'Invoke Gradle script' marked build as failure

---------------------------------------------------------------------
To unsubscribe, e-mail: builds-unsubscribe@beam.apache.org
For additional commands, e-mail: builds-help@beam.apache.org


Build failed in Jenkins: beam_PostCommit_Java_Sickbay #1562

Posted by Apache Jenkins Server <je...@builds.apache.org>.
See <https://ci-beam.apache.org/job/beam_PostCommit_Java_Sickbay/1562/display/redirect>

Changes:


------------------------------------------
[...truncated 52.43 KB...]

org.apache.beam.sdk.coders.PCollectionCustomCoderTest > testDecodingNPException FAILED
    java.lang.AssertionError at Assert.java:89

org.apache.beam.sdk.coders.PCollectionCustomCoderTest > testDecodingIOException FAILED
    java.lang.AssertionError at Assert.java:89

[PermanentBlobCache shutdown hook] INFO org.apache.flink.runtime.blob.PermanentBlobCache - Shutting down BLOB cache

> Task :runners:flink:1.16:validatesRunnerSickbay

org.apache.beam.sdk.transforms.ParDoTest$TimestampTests > testOnWindowTimestampSkew FAILED
    java.lang.AssertionError at ParDoTest.java:2238
        Caused by: java.lang.AssertionError at MatcherAssert.java:18

[TransientBlobCache shutdown hook] INFO org.apache.flink.runtime.blob.TransientBlobCache - Shutting down BLOB cache
[BlobServer shutdown hook] INFO org.apache.flink.runtime.blob.BlobServer - Stopped BLOB server at 0.0.0.0:35461

> Task :runners:flink:1.16:validatesRunnerSickbay FAILED

1 test completed, 1 failed

> Task :runners:samza:validatesRunnerSickbay

org.apache.beam.sdk.io.BoundedReadFromUnboundedSourceTest > testTimeBound FAILED
    org.junit.runners.model.TestTimedOutException at BoundedReadFromUnboundedSourceTest.java:145

> Task :runners:flink:1.15:compileJava
Note: Some input files use or override a deprecated API.
Note: Recompile with -Xlint:deprecation for details.
Note: Some input files use unchecked or unsafe operations.
Note: Recompile with -Xlint:unchecked for details.

> Task :runners:flink:1.13:compileJava
Note: Some input files use or override a deprecated API.
Note: Recompile with -Xlint:deprecation for details.
Note: Some input files use unchecked or unsafe operations.
Note: Recompile with -Xlint:unchecked for details.

> Task :runners:flink:1.14:compileJava
Note: Some input files use or override a deprecated API.
Note: Recompile with -Xlint:deprecation for details.
Note: Some input files use unchecked or unsafe operations.
Note: Recompile with -Xlint:unchecked for details.

> Task :runners:flink:1.14:classes
> Task :runners:flink:1.15:classes
> Task :runners:flink:1.13:classes

> Task :runners:flink:1.12:compileJava
Note: Some input files use or override a deprecated API.
Note: Recompile with -Xlint:deprecation for details.
Note: Some input files use unchecked or unsafe operations.
Note: Recompile with -Xlint:unchecked for details.

> Task :runners:flink:1.15:jar
> Task :runners:flink:1.14:jar
> Task :runners:flink:1.13:jar
> Task :runners:flink:1.12:classes
> Task :runners:flink:1.12:jar
> Task :runners:flink:1.15:validatesRunnerSickbay
> Task :runners:flink:1.14:validatesRunnerSickbay
> Task :runners:flink:1.13:validatesRunnerSickbay
> Task :runners:flink:1.12:validatesRunnerSickbay

[flink-akka.actor.default-dispatcher-9] INFO org.apache.flink.runtime.resourcemanager.StandaloneResourceManager - Shut down cluster because application is in CANCELED, diagnostics DispatcherResourceManagerComponent has been closed..
[flink-akka.actor.default-dispatcher-9] INFO org.apache.flink.runtime.entrypoint.component.DispatcherResourceManagerComponent - Closing components.
[flink-akka.actor.default-dispatcher-9] INFO org.apache.flink.runtime.dispatcher.runner.SessionDispatcherLeaderProcess - Stopping SessionDispatcherLeaderProcess.
[flink-akka.actor.default-dispatcher-9] INFO org.apache.flink.runtime.resourcemanager.ResourceManagerServiceImpl - Stopping resource manager service.
[flink-akka.actor.default-dispatcher-6] INFO org.apache.flink.runtime.dispatcher.StandaloneDispatcher - Stopping dispatcher akka://flink/user/rpc/dispatcher_1.
[flink-akka.actor.default-dispatcher-6] INFO org.apache.flink.runtime.dispatcher.StandaloneDispatcher - Stopping all currently running jobs of dispatcher akka://flink/user/rpc/dispatcher_1.
[flink-akka.actor.default-dispatcher-8] INFO org.apache.flink.runtime.resourcemanager.slotmanager.DeclarativeSlotManager - Closing the slot manager.
[flink-akka.actor.default-dispatcher-8] INFO org.apache.flink.runtime.resourcemanager.slotmanager.DeclarativeSlotManager - Suspending the slot manager.
[TransientBlobCache shutdown hook] INFO org.apache.flink.runtime.blob.TransientBlobCache - Shutting down BLOB cache
[PermanentBlobCache shutdown hook] INFO org.apache.flink.runtime.blob.PermanentBlobCache - Shutting down BLOB cache
[BlobServer shutdown hook] INFO org.apache.flink.runtime.blob.BlobServer - Stopped BLOB server at 0.0.0.0:35427
[flink-akka.actor.default-dispatcher-6] INFO org.apache.flink.runtime.dispatcher.StandaloneDispatcher - Stopped dispatcher akka://flink/user/rpc/dispatcher_1.

> Task :runners:flink:1.15:validatesRunnerSickbay

org.apache.beam.sdk.transforms.ParDoTest$TimestampTests > testOnWindowTimestampSkew FAILED
    java.lang.AssertionError at ParDoTest.java:2238
        Caused by: java.lang.AssertionError at MatcherAssert.java:18

1 test completed, 1 failed

> Task :runners:flink:1.15:validatesRunnerSickbay FAILED

> Task :runners:flink:1.14:validatesRunnerSickbay

org.apache.beam.sdk.transforms.ParDoTest$TimestampTests > testOnWindowTimestampSkew FAILED
    java.lang.AssertionError at ParDoTest.java:2238
        Caused by: java.lang.AssertionError at MatcherAssert.java:18

[TransientBlobCache shutdown hook] INFO org.apache.flink.runtime.blob.TransientBlobCache - Shutting down BLOB cache
[PermanentBlobCache shutdown hook] INFO org.apache.flink.runtime.blob.PermanentBlobCache - Shutting down BLOB cache
[ForkJoinPool.commonPool-worker-11] INFO org.apache.flink.runtime.dispatcher.DispatcherRestEndpoint - Removing cache directory /tmp/flink-web-ui
[BlobServer shutdown hook] INFO org.apache.flink.runtime.blob.BlobServer - Stopped BLOB server at 0.0.0.0:35581
[ForkJoinPool.commonPool-worker-11] INFO org.apache.flink.runtime.dispatcher.DispatcherRestEndpoint - Shut down complete.

> Task :runners:flink:1.13:validatesRunnerSickbay

org.apache.beam.sdk.transforms.ParDoTest$TimestampTests > testOnWindowTimestampSkew FAILED
    java.lang.AssertionError at ParDoTest.java:2238
        Caused by: java.lang.AssertionError at MatcherAssert.java:18

[PermanentBlobCache shutdown hook] INFO org.apache.flink.runtime.blob.PermanentBlobCache - Shutting down BLOB cache
[TransientBlobCache shutdown hook] INFO org.apache.flink.runtime.blob.TransientBlobCache - Shutting down BLOB cache
[BlobServer shutdown hook] INFO org.apache.flink.runtime.blob.BlobServer - Stopped BLOB server at 0.0.0.0:44745
[mini-cluster-io-thread-23] INFO org.apache.flink.runtime.rpc.akka.AkkaRpcService - Stopping Akka RPC service.

> Task :runners:flink:1.12:validatesRunnerSickbay

org.apache.beam.sdk.transforms.ParDoTest$TimestampTests > testOnWindowTimestampSkew FAILED
    java.lang.AssertionError at ParDoTest.java:2238
        Caused by: java.lang.AssertionError at MatcherAssert.java:18

[TransientBlobCache shutdown hook] INFO org.apache.flink.runtime.blob.TransientBlobCache - Shutting down BLOB cache
[PermanentBlobCache shutdown hook] INFO org.apache.flink.runtime.blob.PermanentBlobCache - Shutting down BLOB cache
[BlobServer shutdown hook] INFO org.apache.flink.runtime.blob.BlobServer - Stopped BLOB server at 0.0.0.0:41361
[ForkJoinPool.commonPool-worker-9] INFO org.apache.flink.runtime.dispatcher.DispatcherRestEndpoint - Removing cache directory /tmp/flink-web-ui
[ForkJoinPool.commonPool-worker-9] INFO org.apache.flink.runtime.dispatcher.DispatcherRestEndpoint - Shut down complete.
[flink-akka.actor.default-dispatcher-4] INFO org.apache.flink.runtime.resourcemanager.StandaloneResourceManager - Shut down cluster because application is in CANCELED, diagnostics DispatcherResourceManagerComponent has been closed..

> Task :runners:flink:1.12:validatesRunnerSickbay FAILED

1 test completed, 1 failed

> Task :runners:flink:1.14:validatesRunnerSickbay FAILED

1 test completed, 1 failed

> Task :runners:flink:1.13:validatesRunnerSickbay FAILED

1 test completed, 1 failed

> Task :runners:samza:validatesRunnerSickbay

org.apache.beam.sdk.io.FileIOTest > testMatchWatchForNewFiles FAILED
    org.junit.runners.model.TestTimedOutException at FileIOTest.java:363

org.apache.beam.sdk.io.FileIOTest > testMatchDisallowEmptyNonWildcard FAILED
    java.lang.AssertionError at MatcherAssert.java:18

org.apache.beam.sdk.io.FileIOTest > testMatchAllDisallowEmptyNonWildcard FAILED
    java.lang.AssertionError at MatcherAssert.java:18

org.apache.beam.sdk.io.FileIOTest > testMatchAllDisallowEmptyExplicit FAILED
    java.lang.AssertionError at MatcherAssert.java:18

org.apache.beam.sdk.io.FileIOTest > testFileIoDynamicNaming FAILED
    java.lang.IllegalArgumentException at FileIOTest.java:545

org.apache.beam.sdk.io.FileIOTest > testMatchDisallowEmptyDefault FAILED
    java.lang.AssertionError at MatcherAssert.java:18

org.apache.beam.sdk.io.FileIOTest > testMatchAndMatchAll FAILED
    java.lang.AssertionError at FileIOTest.java:121
        Caused by: java.lang.AssertionError at MatcherAssert.java:18

org.apache.beam.sdk.io.FileIOTest > testMatchDisallowEmptyExplicit FAILED
    java.lang.AssertionError at MatcherAssert.java:18

org.apache.beam.sdk.transforms.GroupIntoBatchesTest > testInGlobalWindowBatchSizeByteSizeFn FAILED
    java.lang.AssertionError at GroupIntoBatchesTest.java:208
        Caused by: java.lang.AssertionError at GroupIntoBatchesTest.java:214

org.apache.beam.sdk.transforms.WithTimestampsTest > withTimestampsWithNullTimestampShouldThrow FAILED
    java.lang.AssertionError at MatcherAssert.java:18

org.apache.beam.sdk.transforms.WithTimestampsTest > withTimestampsBackwardsInTimeShouldThrow FAILED
    java.lang.AssertionError at MatcherAssert.java:18

24 tests completed, 17 failed

> Task :runners:samza:validatesRunnerSickbay FAILED

FAILURE: Build completed with 8 failures.

1: Task failed with an exception.
-----------
* What went wrong:
Execution failed for task ':runners:portability:java:validatesRunnerSickbay'.
> There were failing tests. See the report at: file://<https://ci-beam.apache.org/job/beam_PostCommit_Java_Sickbay/ws/src/runners/portability/java/build/reports/tests/validatesRunnerSickbay/index.html>
==============================================================================

2: Task failed with an exception.
-----------
* What went wrong:
Execution failed for task ':runners:direct-java:validatesRunnerSickbay'.
> There were failing tests. See the report at: file://<https://ci-beam.apache.org/job/beam_PostCommit_Java_Sickbay/ws/src/runners/direct-java/build/reports/tests/validatesRunnerSickbay/index.html>
==============================================================================

3: Task failed with an exception.
-----------
* What went wrong:
Execution failed for task ':runners:flink:1.16:validatesRunnerSickbay'.
> There were failing tests. See the report at: file://<https://ci-beam.apache.org/job/beam_PostCommit_Java_Sickbay/ws/src/runners/flink/1.16/build/reports/tests/validatesRunnerSickbay/index.html>
==============================================================================

4: Task failed with an exception.
-----------
* What went wrong:
Execution failed for task ':runners:flink:1.15:validatesRunnerSickbay'.
> There were failing tests. See the report at: file://<https://ci-beam.apache.org/job/beam_PostCommit_Java_Sickbay/ws/src/runners/flink/1.15/build/reports/tests/validatesRunnerSickbay/index.html>
==============================================================================

5: Task failed with an exception.
-----------
* What went wrong:
Execution failed for task ':runners:flink:1.12:validatesRunnerSickbay'.
> There were failing tests. See the report at: file://<https://ci-beam.apache.org/job/beam_PostCommit_Java_Sickbay/ws/src/runners/flink/1.12/build/reports/tests/validatesRunnerSickbay/index.html>
==============================================================================

6: Task failed with an exception.
-----------
* What went wrong:
Execution failed for task ':runners:flink:1.14:validatesRunnerSickbay'.
> There were failing tests. See the report at: file://<https://ci-beam.apache.org/job/beam_PostCommit_Java_Sickbay/ws/src/runners/flink/1.14/build/reports/tests/validatesRunnerSickbay/index.html>
==============================================================================

7: Task failed with an exception.
-----------
* What went wrong:
Execution failed for task ':runners:flink:1.13:validatesRunnerSickbay'.
> There were failing tests. See the report at: file://<https://ci-beam.apache.org/job/beam_PostCommit_Java_Sickbay/ws/src/runners/flink/1.13/build/reports/tests/validatesRunnerSickbay/index.html>
==============================================================================

8: Task failed with an exception.
-----------
* What went wrong:
Execution failed for task ':runners:samza:validatesRunnerSickbay'.
> There were failing tests. See the report at: file://<https://ci-beam.apache.org/job/beam_PostCommit_Java_Sickbay/ws/src/runners/samza/build/reports/tests/validatesRunnerSickbay/index.html>
==============================================================================

Deprecated Gradle features were used in this build, making it incompatible with Gradle 9.0.

You can use '--warning-mode all' to show the individual deprecation warnings and determine if they come from your own scripts or plugins.

For more on this, please refer to https://docs.gradle.org/8.4/userguide/command_line_interface.html#sec:command_line_warnings in the Gradle documentation.

BUILD FAILED in 21m 56s
145 actionable tasks: 99 executed, 46 from cache

Publishing build scan...
https://ge.apache.org/s/qrtf6qticwbg4

Build step 'Invoke Gradle script' changed build result to FAILURE
Build step 'Invoke Gradle script' marked build as failure

---------------------------------------------------------------------
To unsubscribe, e-mail: builds-unsubscribe@beam.apache.org
For additional commands, e-mail: builds-help@beam.apache.org


beam_PostCommit_Java_Sickbay - Build # 1561 - Aborted!

Posted by Apache Jenkins Server <je...@builds.apache.org>.
beam_PostCommit_Java_Sickbay - Build # 1561 - Aborted:

Check console output at https://ci-beam.apache.org/job/beam_PostCommit_Java_Sickbay/1561/ to view the results.

beam_PostCommit_Java_Sickbay - Build # 1560 - Aborted!

Posted by Apache Jenkins Server <je...@builds.apache.org>.
beam_PostCommit_Java_Sickbay - Build # 1560 - Aborted:

Check console output at https://ci-beam.apache.org/job/beam_PostCommit_Java_Sickbay/1560/ to view the results.