You are viewing a plain text version of this content. The canonical link for it is here.
Posted to dev@tez.apache.org by Apache Jenkins Server <je...@builds.apache.org> on 2015/06/10 18:50:52 UTC

Build failed in Jenkins: Tez-Build-branch-0.7 #25

See <https://builds.apache.org/job/Tez-Build-branch-0.7/25/changes>

Changes:

[zjffdu] TEZ-2534. Error handling summary event when shutting down AM (zjffdu)

[somarajapuram] TEZ-2513. Tez UI: Allow filtering by DAG ID on All dags table.

[sree] TEZ-2546. Tez UI: Fetch hive query text from timeline if dagInfo is not set. (sree)

------------------------------------------
[...truncated 2623 lines...]
[WARNING] The following patterns were never triggered in this artifact exclusion filter:
o  '*:*:test-jar'

[WARNING] The following patterns were never triggered in this artifact exclusion filter:
o  '*:*:test-jar'

[WARNING] The following patterns were never triggered in this artifact exclusion filter:
o  '*:*:test-jar'

[WARNING] The following patterns were never triggered in this artifact exclusion filter:
o  '*:*:test-jar'

[INFO] Building tar: <https://builds.apache.org/job/Tez-Build-branch-0.7/25/artifact/tez-dist/target/tez-0.7.0-SNAPSHOT-minimal.tar.gz>
[INFO] 
[INFO] --- maven-jar-plugin:2.4:test-jar (default) @ tez-dist ---
[WARNING] JAR will be empty - no content was marked for inclusion!
[INFO] Building jar: <https://builds.apache.org/job/Tez-Build-branch-0.7/ws/tez-dist/target/tez-dist-0.7.0-SNAPSHOT-tests.jar>
[INFO] 
[INFO] --- maven-install-plugin:2.4:install (default-install) @ tez-dist ---
[INFO] Installing <https://builds.apache.org/job/Tez-Build-branch-0.7/ws/tez-dist/pom.xml> to /home/jenkins/.m2/repository/org/apache/tez/tez-dist/0.7.0-SNAPSHOT/tez-dist-0.7.0-SNAPSHOT.pom
[INFO] Installing <https://builds.apache.org/job/Tez-Build-branch-0.7/ws/tez-dist/target/tez-dist-0.7.0-SNAPSHOT-tests.jar> to /home/jenkins/.m2/repository/org/apache/tez/tez-dist/0.7.0-SNAPSHOT/tez-dist-0.7.0-SNAPSHOT-tests.jar
[INFO] 
[INFO] --- maven-deploy-plugin:2.8.1:deploy (default-deploy) @ tez-dist ---
[INFO] Skipping artifact deployment
[INFO] 
[INFO] --- buildnumber-maven-plugin:1.1:create (default) @ tez-dist ---
[INFO] Checking for local modifications: skipped.
[INFO] Updating project files from SCM: skipped.
[INFO] Executing: /bin/sh -c cd <https://builds.apache.org/job/Tez-Build-branch-0.7/ws/tez-dist> && git rev-parse --verify HEAD
[INFO] Working directory: <https://builds.apache.org/job/Tez-Build-branch-0.7/ws/tez-dist>
[INFO] Storing buildNumber: 6bdb5718445be70e168fc8e7988a05a74808e554 at timestamp: 1433955005132
[INFO] Executing: /bin/sh -c cd <https://builds.apache.org/job/Tez-Build-branch-0.7/ws/tez-dist> && git rev-parse --verify HEAD
[INFO] Working directory: <https://builds.apache.org/job/Tez-Build-branch-0.7/ws/tez-dist>
[INFO] Storing buildScmBranch: UNKNOWN
[INFO] 
[INFO] --- build-helper-maven-plugin:1.8:maven-version (maven-version) @ tez-dist ---
[INFO] 
[INFO] --- maven-assembly-plugin:2.4:single (package-tez) @ tez-dist ---
[INFO] Reading assembly descriptor: src/main/assembly/tez-dist.xml
[WARNING] NOTE: Currently, inclusion of module dependencies may produce unpredictable results if a version conflict occurs.
[WARNING] The following patterns were never triggered in this artifact exclusion filter:
o  '*:*:test-jar'

[WARNING] The following patterns were never triggered in this artifact exclusion filter:
o  '*:*:test-jar'

[WARNING] The following patterns were never triggered in this artifact exclusion filter:
o  '*:*:test-jar'

[WARNING] The following patterns were never triggered in this artifact exclusion filter:
o  '*:*:test-jar'

[WARNING] The following patterns were never triggered in this artifact exclusion filter:
o  '*:*:test-jar'

[WARNING] The following patterns were never triggered in this artifact exclusion filter:
o  '*:*:test-jar'

[WARNING] The following patterns were never triggered in this artifact exclusion filter:
o  '*:*:test-jar'

[WARNING] The following patterns were never triggered in this artifact exclusion filter:
o  '*:*:test-jar'

[WARNING] The following patterns were never triggered in this artifact exclusion filter:
o  '*:*:test-jar'

[WARNING] The following patterns were never triggered in this artifact exclusion filter:
o  '*:*:test-jar'

[WARNING] The following patterns were never triggered in this artifact exclusion filter:
o  '*:*:test-jar'

[WARNING] The following patterns were never triggered in this artifact exclusion filter:
o  '*:*:test-jar'

[INFO] Copying files to <https://builds.apache.org/job/Tez-Build-branch-0.7/ws/tez-dist/target/tez-0.7.0-SNAPSHOT>
[WARNING] NOTE: Currently, inclusion of module dependencies may produce unpredictable results if a version conflict occurs.
[WARNING] The following patterns were never triggered in this artifact exclusion filter:
o  '*:*:test-jar'

[WARNING] The following patterns were never triggered in this artifact exclusion filter:
o  '*:*:test-jar'

[WARNING] The following patterns were never triggered in this artifact exclusion filter:
o  '*:*:test-jar'

[WARNING] The following patterns were never triggered in this artifact exclusion filter:
o  '*:*:test-jar'

[WARNING] The following patterns were never triggered in this artifact exclusion filter:
o  '*:*:test-jar'

[WARNING] The following patterns were never triggered in this artifact exclusion filter:
o  '*:*:test-jar'

[WARNING] The following patterns were never triggered in this artifact exclusion filter:
o  '*:*:test-jar'

[WARNING] The following patterns were never triggered in this artifact exclusion filter:
o  '*:*:test-jar'

[WARNING] The following patterns were never triggered in this artifact exclusion filter:
o  '*:*:test-jar'

[WARNING] The following patterns were never triggered in this artifact exclusion filter:
o  '*:*:test-jar'

[WARNING] The following patterns were never triggered in this artifact exclusion filter:
o  '*:*:test-jar'

[WARNING] The following patterns were never triggered in this artifact exclusion filter:
o  '*:*:test-jar'

[INFO] Building tar: <https://builds.apache.org/job/Tez-Build-branch-0.7/25/artifact/tez-dist/target/tez-0.7.0-SNAPSHOT.tar.gz>
[INFO] 
[INFO] --- maven-assembly-plugin:2.4:single (package-tez-minimal) @ tez-dist ---
[INFO] Reading assembly descriptor: src/main/assembly/tez-dist-minimal.xml
[WARNING] NOTE: Currently, inclusion of module dependencies may produce unpredictable results if a version conflict occurs.
[WARNING] The following patterns were never triggered in this artifact exclusion filter:
o  '*:*:test-jar'

[WARNING] The following patterns were never triggered in this artifact exclusion filter:
o  '*:*:test-jar'

[WARNING] The following patterns were never triggered in this artifact exclusion filter:
o  '*:*:test-jar'

[WARNING] The following patterns were never triggered in this artifact exclusion filter:
o  '*:*:test-jar'

[WARNING] The following patterns were never triggered in this artifact exclusion filter:
o  '*:*:test-jar'

[WARNING] The following patterns were never triggered in this artifact exclusion filter:
o  '*:*:test-jar'

[WARNING] The following patterns were never triggered in this artifact exclusion filter:
o  '*:*:test-jar'

[WARNING] The following patterns were never triggered in this artifact exclusion filter:
o  '*:*:test-jar'

[WARNING] The following patterns were never triggered in this artifact exclusion filter:
o  '*:*:test-jar'

[WARNING] The following patterns were never triggered in this artifact exclusion filter:
o  '*:*:test-jar'

[WARNING] The following patterns were never triggered in this artifact exclusion filter:
o  '*:*:test-jar'

[WARNING] The following patterns were never triggered in this artifact exclusion filter:
o  '*:*:test-jar'

[INFO] Building tar: <https://builds.apache.org/job/Tez-Build-branch-0.7/25/artifact/tez-dist/target/tez-0.7.0-SNAPSHOT-minimal.tar.gz>
[INFO] 
[INFO] --- maven-jar-plugin:2.4:test-jar (default) @ tez-dist ---
[WARNING] JAR will be empty - no content was marked for inclusion!
[INFO]                                                                         
[INFO] ------------------------------------------------------------------------
[INFO] Building Tez 0.7.0-SNAPSHOT
[INFO] ------------------------------------------------------------------------
[INFO] 
[INFO] --- maven-clean-plugin:2.5:clean (default-clean) @ tez-docs ---
[INFO] Deleting <https://builds.apache.org/job/Tez-Build-branch-0.7/ws/docs/target>
[INFO] 
[INFO] --- buildnumber-maven-plugin:1.1:create (default) @ tez-docs ---
[INFO] Checking for local modifications: skipped.
[INFO] Updating project files from SCM: skipped.
[INFO] Executing: /bin/sh -c cd <https://builds.apache.org/job/Tez-Build-branch-0.7/ws/docs> && git rev-parse --verify HEAD
[INFO] Working directory: <https://builds.apache.org/job/Tez-Build-branch-0.7/ws/docs>
[INFO] Storing buildNumber: 6bdb5718445be70e168fc8e7988a05a74808e554 at timestamp: 1433955028748
[INFO] Executing: /bin/sh -c cd <https://builds.apache.org/job/Tez-Build-branch-0.7/ws/docs> && git rev-parse --verify HEAD
[INFO] Working directory: <https://builds.apache.org/job/Tez-Build-branch-0.7/ws/docs>
[INFO] Storing buildScmBranch: UNKNOWN
[INFO] 
[INFO] --- build-helper-maven-plugin:1.8:maven-version (maven-version) @ tez-docs ---
[INFO] 
[INFO] --- buildnumber-maven-plugin:1.1:create (default) @ tez-docs ---
[INFO] Checking for local modifications: skipped.
[INFO] Updating project files from SCM: skipped.
[INFO] Executing: /bin/sh -c cd <https://builds.apache.org/job/Tez-Build-branch-0.7/ws/docs> && git rev-parse --verify HEAD
[INFO] Working directory: <https://builds.apache.org/job/Tez-Build-branch-0.7/ws/docs>
[INFO] Storing buildNumber: 6bdb5718445be70e168fc8e7988a05a74808e554 at timestamp: 1433955028759
[INFO] Executing: /bin/sh -c cd <https://builds.apache.org/job/Tez-Build-branch-0.7/ws/docs> && git rev-parse --verify HEAD
[INFO] Working directory: <https://builds.apache.org/job/Tez-Build-branch-0.7/ws/docs>
[INFO] Storing buildScmBranch: UNKNOWN
[INFO] 
[INFO] --- build-helper-maven-plugin:1.8:maven-version (maven-version) @ tez-docs ---
[INFO] 
[INFO] --- maven-jar-plugin:2.4:test-jar (default) @ tez-docs ---
[WARNING] JAR will be empty - no content was marked for inclusion!
[INFO] Building jar: <https://builds.apache.org/job/Tez-Build-branch-0.7/ws/docs/target/tez-docs-0.7.0-SNAPSHOT-tests.jar>
[INFO] 
[INFO] --- maven-install-plugin:2.4:install (default-install) @ tez-docs ---
[INFO] Installing <https://builds.apache.org/job/Tez-Build-branch-0.7/ws/docs/pom.xml> to /home/jenkins/.m2/repository/org/apache/tez/tez-docs/0.7.0-SNAPSHOT/tez-docs-0.7.0-SNAPSHOT.pom
[INFO] Installing <https://builds.apache.org/job/Tez-Build-branch-0.7/ws/docs/target/tez-docs-0.7.0-SNAPSHOT-tests.jar> to /home/jenkins/.m2/repository/org/apache/tez/tez-docs/0.7.0-SNAPSHOT/tez-docs-0.7.0-SNAPSHOT-tests.jar
[INFO] 
[INFO] --- maven-deploy-plugin:2.8.1:deploy (default-deploy) @ tez-docs ---
[INFO] Skipping artifact deployment
Downloading: https://repository.apache.org/content/repositories/snapshots/org/apache/tez/tez/0.7.0-SNAPSHOT/maven-metadata.xml

[WARNING] Could not transfer metadata org.apache.tez:tez:0.7.0-SNAPSHOT/maven-metadata.xml from/to apache.snapshots.https (https://repository.apache.org/content/repositories/snapshots): java.lang.RuntimeException: Could not generate DH keypair
[INFO] ------------------------------------------------------------------------
[INFO] Reactor Summary:
[INFO] 
[INFO] tez ............................................... SUCCESS [  1.612 s]
[INFO] tez-api ........................................... SUCCESS [ 17.659 s]
[INFO] tez-common ........................................ SUCCESS [  0.952 s]
[INFO] tez-runtime-internals ............................. SUCCESS [  1.234 s]
[INFO] tez-runtime-library ............................... SUCCESS [  2.899 s]
[INFO] tez-mapreduce ..................................... SUCCESS [  1.377 s]
[INFO] tez-examples ...................................... SUCCESS [  0.393 s]
[INFO] tez-dag ........................................... SUCCESS [  8.807 s]
[INFO] tez-tests ......................................... SUCCESS [  0.982 s]
[INFO] tez-ui ............................................ SUCCESS [ 39.746 s]
[INFO] tez-plugins ....................................... SUCCESS [  0.119 s]
[INFO] tez-yarn-timeline-history ......................... SUCCESS [  0.730 s]
[INFO] tez-yarn-timeline-history-with-acls ............... SUCCESS [  0.578 s]
[INFO] tez-mbeans-resource-calculator .................... SUCCESS [  0.333 s]
[INFO] tez-tools ......................................... SUCCESS [  0.137 s]
[INFO] tez-dist .......................................... SUCCESS [ 50.994 s]
[INFO] Tez ............................................... FAILURE [  1.308 s]
[INFO] ------------------------------------------------------------------------
[INFO] BUILD FAILURE
[INFO] ------------------------------------------------------------------------
[INFO] Total time: 02:10 min
[INFO] Finished at: 2015-06-10T16:50:30+00:00
[INFO] Final Memory: 68M/1184M
[INFO] ------------------------------------------------------------------------
[ERROR] Failed to execute goal org.apache.maven.plugins:maven-deploy-plugin:2.8.1:deploy (default-deploy) on project tez-docs: Failed to retrieve remote metadata org.apache.tez:tez:0.7.0-SNAPSHOT/maven-metadata.xml: Could not transfer metadata org.apache.tez:tez:0.7.0-SNAPSHOT/maven-metadata.xml from/to apache.snapshots.https (https://repository.apache.org/content/repositories/snapshots): java.lang.RuntimeException: Could not generate DH keypair: Prime size must be multiple of 64, and can only range from 512 to 1024 (inclusive) -> [Help 1]
[ERROR] 
[ERROR] To see the full stack trace of the errors, re-run Maven with the -e switch.
[ERROR] Re-run Maven using the -X switch to enable full debug logging.
[ERROR] 
[ERROR] For more information about the errors and possible solutions, please read the following articles:
[ERROR] [Help 1] http://cwiki.apache.org/confluence/display/MAVEN/MojoExecutionException
[ERROR] 
[ERROR] After correcting the problems, you can resume the build with the command
[ERROR]   mvn <goals> -rf :tez-docs
Build step 'Execute shell' marked build as failure
Archiving artifacts
Sending artifact delta relative to Tez-Build-branch-0.7 #24
Archived 2 artifacts
Archive block size is 32768
Received 0 blocks and 51830839 bytes
Compression is 0.0%
Took 21 sec

Build failed in Jenkins: Tez-Build-branch-0.7 #32

Posted by Apache Jenkins Server <je...@builds.apache.org>.
See <https://builds.apache.org/job/Tez-Build-branch-0.7/32/changes>

Changes:

[sree] TEZ-2291. TEZ UI: Improper vertex name in tables. (sree)

------------------------------------------
[...truncated 2622 lines...]
[WARNING] The following patterns were never triggered in this artifact exclusion filter:
o  '*:*:test-jar'

[WARNING] The following patterns were never triggered in this artifact exclusion filter:
o  '*:*:test-jar'

[WARNING] The following patterns were never triggered in this artifact exclusion filter:
o  '*:*:test-jar'

[WARNING] The following patterns were never triggered in this artifact exclusion filter:
o  '*:*:test-jar'

[INFO] Building tar: <https://builds.apache.org/job/Tez-Build-branch-0.7/32/artifact/tez-dist/target/tez-0.7.1-SNAPSHOT-minimal.tar.gz>
[INFO] 
[INFO] --- maven-jar-plugin:2.4:test-jar (default) @ tez-dist ---
[WARNING] JAR will be empty - no content was marked for inclusion!
[INFO] Building jar: <https://builds.apache.org/job/Tez-Build-branch-0.7/ws/tez-dist/target/tez-dist-0.7.1-SNAPSHOT-tests.jar>
[INFO] 
[INFO] --- maven-install-plugin:2.4:install (default-install) @ tez-dist ---
[INFO] Installing <https://builds.apache.org/job/Tez-Build-branch-0.7/ws/tez-dist/pom.xml> to /home/jenkins/.m2/repository/org/apache/tez/tez-dist/0.7.1-SNAPSHOT/tez-dist-0.7.1-SNAPSHOT.pom
[INFO] Installing <https://builds.apache.org/job/Tez-Build-branch-0.7/ws/tez-dist/target/tez-dist-0.7.1-SNAPSHOT-tests.jar> to /home/jenkins/.m2/repository/org/apache/tez/tez-dist/0.7.1-SNAPSHOT/tez-dist-0.7.1-SNAPSHOT-tests.jar
[INFO] 
[INFO] --- maven-deploy-plugin:2.8.1:deploy (default-deploy) @ tez-dist ---
[INFO] Skipping artifact deployment
[INFO] 
[INFO] --- buildnumber-maven-plugin:1.1:create (default) @ tez-dist ---
[INFO] Checking for local modifications: skipped.
[INFO] Updating project files from SCM: skipped.
[INFO] Executing: /bin/sh -c cd <https://builds.apache.org/job/Tez-Build-branch-0.7/ws/tez-dist> && git rev-parse --verify HEAD
[INFO] Working directory: <https://builds.apache.org/job/Tez-Build-branch-0.7/ws/tez-dist>
[INFO] Storing buildNumber: ddeb60d4cdfeafb065e467c717ffddb854c65ee0 at timestamp: 1434828230348
[INFO] Executing: /bin/sh -c cd <https://builds.apache.org/job/Tez-Build-branch-0.7/ws/tez-dist> && git rev-parse --verify HEAD
[INFO] Working directory: <https://builds.apache.org/job/Tez-Build-branch-0.7/ws/tez-dist>
[INFO] Storing buildScmBranch: UNKNOWN
[INFO] 
[INFO] --- build-helper-maven-plugin:1.8:maven-version (maven-version) @ tez-dist ---
[INFO] 
[INFO] --- maven-assembly-plugin:2.4:single (package-tez) @ tez-dist ---
[INFO] Reading assembly descriptor: src/main/assembly/tez-dist.xml
[WARNING] NOTE: Currently, inclusion of module dependencies may produce unpredictable results if a version conflict occurs.
[WARNING] The following patterns were never triggered in this artifact exclusion filter:
o  '*:*:test-jar'

[WARNING] The following patterns were never triggered in this artifact exclusion filter:
o  '*:*:test-jar'

[WARNING] The following patterns were never triggered in this artifact exclusion filter:
o  '*:*:test-jar'

[WARNING] The following patterns were never triggered in this artifact exclusion filter:
o  '*:*:test-jar'

[WARNING] The following patterns were never triggered in this artifact exclusion filter:
o  '*:*:test-jar'

[WARNING] The following patterns were never triggered in this artifact exclusion filter:
o  '*:*:test-jar'

[WARNING] The following patterns were never triggered in this artifact exclusion filter:
o  '*:*:test-jar'

[WARNING] The following patterns were never triggered in this artifact exclusion filter:
o  '*:*:test-jar'

[WARNING] The following patterns were never triggered in this artifact exclusion filter:
o  '*:*:test-jar'

[WARNING] The following patterns were never triggered in this artifact exclusion filter:
o  '*:*:test-jar'

[WARNING] The following patterns were never triggered in this artifact exclusion filter:
o  '*:*:test-jar'

[WARNING] The following patterns were never triggered in this artifact exclusion filter:
o  '*:*:test-jar'

[INFO] Copying files to <https://builds.apache.org/job/Tez-Build-branch-0.7/ws/tez-dist/target/tez-0.7.1-SNAPSHOT>
[WARNING] NOTE: Currently, inclusion of module dependencies may produce unpredictable results if a version conflict occurs.
[WARNING] The following patterns were never triggered in this artifact exclusion filter:
o  '*:*:test-jar'

[WARNING] The following patterns were never triggered in this artifact exclusion filter:
o  '*:*:test-jar'

[WARNING] The following patterns were never triggered in this artifact exclusion filter:
o  '*:*:test-jar'

[WARNING] The following patterns were never triggered in this artifact exclusion filter:
o  '*:*:test-jar'

[WARNING] The following patterns were never triggered in this artifact exclusion filter:
o  '*:*:test-jar'

[WARNING] The following patterns were never triggered in this artifact exclusion filter:
o  '*:*:test-jar'

[WARNING] The following patterns were never triggered in this artifact exclusion filter:
o  '*:*:test-jar'

[WARNING] The following patterns were never triggered in this artifact exclusion filter:
o  '*:*:test-jar'

[WARNING] The following patterns were never triggered in this artifact exclusion filter:
o  '*:*:test-jar'

[WARNING] The following patterns were never triggered in this artifact exclusion filter:
o  '*:*:test-jar'

[WARNING] The following patterns were never triggered in this artifact exclusion filter:
o  '*:*:test-jar'

[WARNING] The following patterns were never triggered in this artifact exclusion filter:
o  '*:*:test-jar'

[INFO] Building tar: <https://builds.apache.org/job/Tez-Build-branch-0.7/32/artifact/tez-dist/target/tez-0.7.1-SNAPSHOT.tar.gz>
[INFO] 
[INFO] --- maven-assembly-plugin:2.4:single (package-tez-minimal) @ tez-dist ---
[INFO] Reading assembly descriptor: src/main/assembly/tez-dist-minimal.xml
[WARNING] NOTE: Currently, inclusion of module dependencies may produce unpredictable results if a version conflict occurs.
[WARNING] The following patterns were never triggered in this artifact exclusion filter:
o  '*:*:test-jar'

[WARNING] The following patterns were never triggered in this artifact exclusion filter:
o  '*:*:test-jar'

[WARNING] The following patterns were never triggered in this artifact exclusion filter:
o  '*:*:test-jar'

[WARNING] The following patterns were never triggered in this artifact exclusion filter:
o  '*:*:test-jar'

[WARNING] The following patterns were never triggered in this artifact exclusion filter:
o  '*:*:test-jar'

[WARNING] The following patterns were never triggered in this artifact exclusion filter:
o  '*:*:test-jar'

[WARNING] The following patterns were never triggered in this artifact exclusion filter:
o  '*:*:test-jar'

[WARNING] The following patterns were never triggered in this artifact exclusion filter:
o  '*:*:test-jar'

[WARNING] The following patterns were never triggered in this artifact exclusion filter:
o  '*:*:test-jar'

[WARNING] The following patterns were never triggered in this artifact exclusion filter:
o  '*:*:test-jar'

[WARNING] The following patterns were never triggered in this artifact exclusion filter:
o  '*:*:test-jar'

[WARNING] The following patterns were never triggered in this artifact exclusion filter:
o  '*:*:test-jar'

[INFO] Building tar: <https://builds.apache.org/job/Tez-Build-branch-0.7/32/artifact/tez-dist/target/tez-0.7.1-SNAPSHOT-minimal.tar.gz>
[INFO] 
[INFO] --- maven-jar-plugin:2.4:test-jar (default) @ tez-dist ---
[WARNING] JAR will be empty - no content was marked for inclusion!
[INFO]                                                                         
[INFO] ------------------------------------------------------------------------
[INFO] Building Tez 0.7.1-SNAPSHOT
[INFO] ------------------------------------------------------------------------
[INFO] 
[INFO] --- maven-clean-plugin:2.5:clean (default-clean) @ tez-docs ---
[INFO] Deleting <https://builds.apache.org/job/Tez-Build-branch-0.7/ws/docs/target>
[INFO] 
[INFO] --- buildnumber-maven-plugin:1.1:create (default) @ tez-docs ---
[INFO] Checking for local modifications: skipped.
[INFO] Updating project files from SCM: skipped.
[INFO] Executing: /bin/sh -c cd <https://builds.apache.org/job/Tez-Build-branch-0.7/ws/docs> && git rev-parse --verify HEAD
[INFO] Working directory: <https://builds.apache.org/job/Tez-Build-branch-0.7/ws/docs>
[INFO] Storing buildNumber: ddeb60d4cdfeafb065e467c717ffddb854c65ee0 at timestamp: 1434828254628
[INFO] Executing: /bin/sh -c cd <https://builds.apache.org/job/Tez-Build-branch-0.7/ws/docs> && git rev-parse --verify HEAD
[INFO] Working directory: <https://builds.apache.org/job/Tez-Build-branch-0.7/ws/docs>
[INFO] Storing buildScmBranch: UNKNOWN
[INFO] 
[INFO] --- build-helper-maven-plugin:1.8:maven-version (maven-version) @ tez-docs ---
[INFO] 
[INFO] --- buildnumber-maven-plugin:1.1:create (default) @ tez-docs ---
[INFO] Checking for local modifications: skipped.
[INFO] Updating project files from SCM: skipped.
[INFO] Executing: /bin/sh -c cd <https://builds.apache.org/job/Tez-Build-branch-0.7/ws/docs> && git rev-parse --verify HEAD
[INFO] Working directory: <https://builds.apache.org/job/Tez-Build-branch-0.7/ws/docs>
[INFO] Storing buildNumber: ddeb60d4cdfeafb065e467c717ffddb854c65ee0 at timestamp: 1434828254638
[INFO] Executing: /bin/sh -c cd <https://builds.apache.org/job/Tez-Build-branch-0.7/ws/docs> && git rev-parse --verify HEAD
[INFO] Working directory: <https://builds.apache.org/job/Tez-Build-branch-0.7/ws/docs>
[INFO] Storing buildScmBranch: UNKNOWN
[INFO] 
[INFO] --- build-helper-maven-plugin:1.8:maven-version (maven-version) @ tez-docs ---
[INFO] 
[INFO] --- maven-jar-plugin:2.4:test-jar (default) @ tez-docs ---
[WARNING] JAR will be empty - no content was marked for inclusion!
[INFO] Building jar: <https://builds.apache.org/job/Tez-Build-branch-0.7/ws/docs/target/tez-docs-0.7.1-SNAPSHOT-tests.jar>
[INFO] 
[INFO] --- maven-install-plugin:2.4:install (default-install) @ tez-docs ---
[INFO] Installing <https://builds.apache.org/job/Tez-Build-branch-0.7/ws/docs/pom.xml> to /home/jenkins/.m2/repository/org/apache/tez/tez-docs/0.7.1-SNAPSHOT/tez-docs-0.7.1-SNAPSHOT.pom
[INFO] Installing <https://builds.apache.org/job/Tez-Build-branch-0.7/ws/docs/target/tez-docs-0.7.1-SNAPSHOT-tests.jar> to /home/jenkins/.m2/repository/org/apache/tez/tez-docs/0.7.1-SNAPSHOT/tez-docs-0.7.1-SNAPSHOT-tests.jar
[INFO] 
[INFO] --- maven-deploy-plugin:2.8.1:deploy (default-deploy) @ tez-docs ---
[INFO] Skipping artifact deployment
Downloading: https://repository.apache.org/content/repositories/snapshots/org/apache/tez/tez/0.7.1-SNAPSHOT/maven-metadata.xml

[WARNING] Could not transfer metadata org.apache.tez:tez:0.7.1-SNAPSHOT/maven-metadata.xml from/to apache.snapshots.https (https://repository.apache.org/content/repositories/snapshots): java.lang.RuntimeException: Could not generate DH keypair
[INFO] ------------------------------------------------------------------------
[INFO] Reactor Summary:
[INFO] 
[INFO] tez ............................................... SUCCESS [  1.367 s]
[INFO] tez-api ........................................... SUCCESS [ 16.639 s]
[INFO] tez-common ........................................ SUCCESS [  0.733 s]
[INFO] tez-runtime-internals ............................. SUCCESS [  0.996 s]
[INFO] tez-runtime-library ............................... SUCCESS [  2.917 s]
[INFO] tez-mapreduce ..................................... SUCCESS [  1.275 s]
[INFO] tez-examples ...................................... SUCCESS [  0.453 s]
[INFO] tez-dag ........................................... SUCCESS [  8.336 s]
[INFO] tez-tests ......................................... SUCCESS [  0.934 s]
[INFO] tez-ui ............................................ SUCCESS [ 39.620 s]
[INFO] tez-plugins ....................................... SUCCESS [  0.095 s]
[INFO] tez-yarn-timeline-history ......................... SUCCESS [  0.785 s]
[INFO] tez-yarn-timeline-history-with-acls ............... SUCCESS [  0.538 s]
[INFO] tez-mbeans-resource-calculator .................... SUCCESS [  0.319 s]
[INFO] tez-tools ......................................... SUCCESS [  0.086 s]
[INFO] tez-dist .......................................... SUCCESS [ 51.686 s]
[INFO] Tez ............................................... FAILURE [  1.014 s]
[INFO] ------------------------------------------------------------------------
[INFO] BUILD FAILURE
[INFO] ------------------------------------------------------------------------
[INFO] Total time: 02:08 min
[INFO] Finished at: 2015-06-20T19:24:15+00:00
[INFO] Final Memory: 68M/1184M
[INFO] ------------------------------------------------------------------------
[ERROR] Failed to execute goal org.apache.maven.plugins:maven-deploy-plugin:2.8.1:deploy (default-deploy) on project tez-docs: Failed to retrieve remote metadata org.apache.tez:tez:0.7.1-SNAPSHOT/maven-metadata.xml: Could not transfer metadata org.apache.tez:tez:0.7.1-SNAPSHOT/maven-metadata.xml from/to apache.snapshots.https (https://repository.apache.org/content/repositories/snapshots): java.lang.RuntimeException: Could not generate DH keypair: Prime size must be multiple of 64, and can only range from 512 to 1024 (inclusive) -> [Help 1]
[ERROR] 
[ERROR] To see the full stack trace of the errors, re-run Maven with the -e switch.
[ERROR] Re-run Maven using the -X switch to enable full debug logging.
[ERROR] 
[ERROR] For more information about the errors and possible solutions, please read the following articles:
[ERROR] [Help 1] http://cwiki.apache.org/confluence/display/MAVEN/MojoExecutionException
[ERROR] 
[ERROR] After correcting the problems, you can resume the build with the command
[ERROR]   mvn <goals> -rf :tez-docs
Build step 'Execute shell' marked build as failure
Archiving artifacts
Sending artifact delta relative to Tez-Build-branch-0.7 #24
Archived 2 artifacts
Archive block size is 32768
Received 0 blocks and 51834557 bytes
Compression is 0.0%
Took 19 sec

Build failed in Jenkins: Tez-Build-branch-0.7 #31

Posted by Apache Jenkins Server <je...@builds.apache.org>.
See <https://builds.apache.org/job/Tez-Build-branch-0.7/31/changes>

Changes:

[sseth] TEZ-2475 addendum. Fix Throwable handling for Java 6.

[zjffdu] TEZ-2566. Allow TaskAttemptFinishedEvent without TaskAttemptStartedEvent when it is KILLED/FAILED (zjffdu)

[pramachandran] TEZ-2567. Tez UI: download dag data does not work within ambari (pramachandran)

[jeagles] TEZ-2549. Reduce Counter Load on the Timeline Server (jlowe via jeagles)

------------------------------------------
[...truncated 2639 lines...]
[WARNING] The following patterns were never triggered in this artifact exclusion filter:
o  '*:*:test-jar'

[WARNING] The following patterns were never triggered in this artifact exclusion filter:
o  '*:*:test-jar'

[WARNING] The following patterns were never triggered in this artifact exclusion filter:
o  '*:*:test-jar'

[WARNING] The following patterns were never triggered in this artifact exclusion filter:
o  '*:*:test-jar'

[INFO] Building tar: <https://builds.apache.org/job/Tez-Build-branch-0.7/31/artifact/tez-dist/target/tez-0.7.1-SNAPSHOT-minimal.tar.gz>
[INFO] 
[INFO] --- maven-jar-plugin:2.4:test-jar (default) @ tez-dist ---
[WARNING] JAR will be empty - no content was marked for inclusion!
[INFO] Building jar: <https://builds.apache.org/job/Tez-Build-branch-0.7/ws/tez-dist/target/tez-dist-0.7.1-SNAPSHOT-tests.jar>
[INFO] 
[INFO] --- maven-install-plugin:2.4:install (default-install) @ tez-dist ---
[INFO] Installing <https://builds.apache.org/job/Tez-Build-branch-0.7/ws/tez-dist/pom.xml> to /home/jenkins/.m2/repository/org/apache/tez/tez-dist/0.7.1-SNAPSHOT/tez-dist-0.7.1-SNAPSHOT.pom
[INFO] Installing <https://builds.apache.org/job/Tez-Build-branch-0.7/ws/tez-dist/target/tez-dist-0.7.1-SNAPSHOT-tests.jar> to /home/jenkins/.m2/repository/org/apache/tez/tez-dist/0.7.1-SNAPSHOT/tez-dist-0.7.1-SNAPSHOT-tests.jar
[INFO] 
[INFO] --- maven-deploy-plugin:2.8.1:deploy (default-deploy) @ tez-dist ---
[INFO] Skipping artifact deployment
[INFO] 
[INFO] --- buildnumber-maven-plugin:1.1:create (default) @ tez-dist ---
[INFO] Checking for local modifications: skipped.
[INFO] Updating project files from SCM: skipped.
[INFO] Executing: /bin/sh -c cd <https://builds.apache.org/job/Tez-Build-branch-0.7/ws/tez-dist> && git rev-parse --verify HEAD
[INFO] Working directory: <https://builds.apache.org/job/Tez-Build-branch-0.7/ws/tez-dist>
[INFO] Storing buildNumber: 5e578f803930ed78291711212d96fbe3987d653c at timestamp: 1434663726353
[INFO] Executing: /bin/sh -c cd <https://builds.apache.org/job/Tez-Build-branch-0.7/ws/tez-dist> && git rev-parse --verify HEAD
[INFO] Working directory: <https://builds.apache.org/job/Tez-Build-branch-0.7/ws/tez-dist>
[INFO] Storing buildScmBranch: UNKNOWN
[INFO] 
[INFO] --- build-helper-maven-plugin:1.8:maven-version (maven-version) @ tez-dist ---
[INFO] 
[INFO] --- maven-assembly-plugin:2.4:single (package-tez) @ tez-dist ---
[INFO] Reading assembly descriptor: src/main/assembly/tez-dist.xml
[WARNING] NOTE: Currently, inclusion of module dependencies may produce unpredictable results if a version conflict occurs.
[WARNING] The following patterns were never triggered in this artifact exclusion filter:
o  '*:*:test-jar'

[WARNING] The following patterns were never triggered in this artifact exclusion filter:
o  '*:*:test-jar'

[WARNING] The following patterns were never triggered in this artifact exclusion filter:
o  '*:*:test-jar'

[WARNING] The following patterns were never triggered in this artifact exclusion filter:
o  '*:*:test-jar'

[WARNING] The following patterns were never triggered in this artifact exclusion filter:
o  '*:*:test-jar'

[WARNING] The following patterns were never triggered in this artifact exclusion filter:
o  '*:*:test-jar'

[WARNING] The following patterns were never triggered in this artifact exclusion filter:
o  '*:*:test-jar'

[WARNING] The following patterns were never triggered in this artifact exclusion filter:
o  '*:*:test-jar'

[WARNING] The following patterns were never triggered in this artifact exclusion filter:
o  '*:*:test-jar'

[WARNING] The following patterns were never triggered in this artifact exclusion filter:
o  '*:*:test-jar'

[WARNING] The following patterns were never triggered in this artifact exclusion filter:
o  '*:*:test-jar'

[WARNING] The following patterns were never triggered in this artifact exclusion filter:
o  '*:*:test-jar'

[INFO] Copying files to <https://builds.apache.org/job/Tez-Build-branch-0.7/ws/tez-dist/target/tez-0.7.1-SNAPSHOT>
[WARNING] NOTE: Currently, inclusion of module dependencies may produce unpredictable results if a version conflict occurs.
[WARNING] The following patterns were never triggered in this artifact exclusion filter:
o  '*:*:test-jar'

[WARNING] The following patterns were never triggered in this artifact exclusion filter:
o  '*:*:test-jar'

[WARNING] The following patterns were never triggered in this artifact exclusion filter:
o  '*:*:test-jar'

[WARNING] The following patterns were never triggered in this artifact exclusion filter:
o  '*:*:test-jar'

[WARNING] The following patterns were never triggered in this artifact exclusion filter:
o  '*:*:test-jar'

[WARNING] The following patterns were never triggered in this artifact exclusion filter:
o  '*:*:test-jar'

[WARNING] The following patterns were never triggered in this artifact exclusion filter:
o  '*:*:test-jar'

[WARNING] The following patterns were never triggered in this artifact exclusion filter:
o  '*:*:test-jar'

[WARNING] The following patterns were never triggered in this artifact exclusion filter:
o  '*:*:test-jar'

[WARNING] The following patterns were never triggered in this artifact exclusion filter:
o  '*:*:test-jar'

[WARNING] The following patterns were never triggered in this artifact exclusion filter:
o  '*:*:test-jar'

[WARNING] The following patterns were never triggered in this artifact exclusion filter:
o  '*:*:test-jar'

[INFO] Building tar: <https://builds.apache.org/job/Tez-Build-branch-0.7/31/artifact/tez-dist/target/tez-0.7.1-SNAPSHOT.tar.gz>
[INFO] 
[INFO] --- maven-assembly-plugin:2.4:single (package-tez-minimal) @ tez-dist ---
[INFO] Reading assembly descriptor: src/main/assembly/tez-dist-minimal.xml
[WARNING] NOTE: Currently, inclusion of module dependencies may produce unpredictable results if a version conflict occurs.
[WARNING] The following patterns were never triggered in this artifact exclusion filter:
o  '*:*:test-jar'

[WARNING] The following patterns were never triggered in this artifact exclusion filter:
o  '*:*:test-jar'

[WARNING] The following patterns were never triggered in this artifact exclusion filter:
o  '*:*:test-jar'

[WARNING] The following patterns were never triggered in this artifact exclusion filter:
o  '*:*:test-jar'

[WARNING] The following patterns were never triggered in this artifact exclusion filter:
o  '*:*:test-jar'

[WARNING] The following patterns were never triggered in this artifact exclusion filter:
o  '*:*:test-jar'

[WARNING] The following patterns were never triggered in this artifact exclusion filter:
o  '*:*:test-jar'

[WARNING] The following patterns were never triggered in this artifact exclusion filter:
o  '*:*:test-jar'

[WARNING] The following patterns were never triggered in this artifact exclusion filter:
o  '*:*:test-jar'

[WARNING] The following patterns were never triggered in this artifact exclusion filter:
o  '*:*:test-jar'

[WARNING] The following patterns were never triggered in this artifact exclusion filter:
o  '*:*:test-jar'

[WARNING] The following patterns were never triggered in this artifact exclusion filter:
o  '*:*:test-jar'

[INFO] Building tar: <https://builds.apache.org/job/Tez-Build-branch-0.7/31/artifact/tez-dist/target/tez-0.7.1-SNAPSHOT-minimal.tar.gz>
[INFO] 
[INFO] --- maven-jar-plugin:2.4:test-jar (default) @ tez-dist ---
[WARNING] JAR will be empty - no content was marked for inclusion!
[INFO]                                                                         
[INFO] ------------------------------------------------------------------------
[INFO] Building Tez 0.7.1-SNAPSHOT
[INFO] ------------------------------------------------------------------------
[INFO] 
[INFO] --- maven-clean-plugin:2.5:clean (default-clean) @ tez-docs ---
[INFO] Deleting <https://builds.apache.org/job/Tez-Build-branch-0.7/ws/docs/target>
[INFO] 
[INFO] --- buildnumber-maven-plugin:1.1:create (default) @ tez-docs ---
[INFO] Checking for local modifications: skipped.
[INFO] Updating project files from SCM: skipped.
[INFO] Executing: /bin/sh -c cd <https://builds.apache.org/job/Tez-Build-branch-0.7/ws/docs> && git rev-parse --verify HEAD
[INFO] Working directory: <https://builds.apache.org/job/Tez-Build-branch-0.7/ws/docs>
[INFO] Storing buildNumber: 5e578f803930ed78291711212d96fbe3987d653c at timestamp: 1434663750503
[INFO] Executing: /bin/sh -c cd <https://builds.apache.org/job/Tez-Build-branch-0.7/ws/docs> && git rev-parse --verify HEAD
[INFO] Working directory: <https://builds.apache.org/job/Tez-Build-branch-0.7/ws/docs>
[INFO] Storing buildScmBranch: UNKNOWN
[INFO] 
[INFO] --- build-helper-maven-plugin:1.8:maven-version (maven-version) @ tez-docs ---
[INFO] 
[INFO] --- buildnumber-maven-plugin:1.1:create (default) @ tez-docs ---
[INFO] Checking for local modifications: skipped.
[INFO] Updating project files from SCM: skipped.
[INFO] Executing: /bin/sh -c cd <https://builds.apache.org/job/Tez-Build-branch-0.7/ws/docs> && git rev-parse --verify HEAD
[INFO] Working directory: <https://builds.apache.org/job/Tez-Build-branch-0.7/ws/docs>
[INFO] Storing buildNumber: 5e578f803930ed78291711212d96fbe3987d653c at timestamp: 1434663750513
[INFO] Executing: /bin/sh -c cd <https://builds.apache.org/job/Tez-Build-branch-0.7/ws/docs> && git rev-parse --verify HEAD
[INFO] Working directory: <https://builds.apache.org/job/Tez-Build-branch-0.7/ws/docs>
[INFO] Storing buildScmBranch: UNKNOWN
[INFO] 
[INFO] --- build-helper-maven-plugin:1.8:maven-version (maven-version) @ tez-docs ---
[INFO] 
[INFO] --- maven-jar-plugin:2.4:test-jar (default) @ tez-docs ---
[WARNING] JAR will be empty - no content was marked for inclusion!
[INFO] Building jar: <https://builds.apache.org/job/Tez-Build-branch-0.7/ws/docs/target/tez-docs-0.7.1-SNAPSHOT-tests.jar>
[INFO] 
[INFO] --- maven-install-plugin:2.4:install (default-install) @ tez-docs ---
[INFO] Installing <https://builds.apache.org/job/Tez-Build-branch-0.7/ws/docs/pom.xml> to /home/jenkins/.m2/repository/org/apache/tez/tez-docs/0.7.1-SNAPSHOT/tez-docs-0.7.1-SNAPSHOT.pom
[INFO] Installing <https://builds.apache.org/job/Tez-Build-branch-0.7/ws/docs/target/tez-docs-0.7.1-SNAPSHOT-tests.jar> to /home/jenkins/.m2/repository/org/apache/tez/tez-docs/0.7.1-SNAPSHOT/tez-docs-0.7.1-SNAPSHOT-tests.jar
[INFO] 
[INFO] --- maven-deploy-plugin:2.8.1:deploy (default-deploy) @ tez-docs ---
[INFO] Skipping artifact deployment
Downloading: https://repository.apache.org/content/repositories/snapshots/org/apache/tez/tez/0.7.1-SNAPSHOT/maven-metadata.xml

[WARNING] Could not transfer metadata org.apache.tez:tez:0.7.1-SNAPSHOT/maven-metadata.xml from/to apache.snapshots.https (https://repository.apache.org/content/repositories/snapshots): java.lang.RuntimeException: Could not generate DH keypair
[INFO] ------------------------------------------------------------------------
[INFO] Reactor Summary:
[INFO] 
[INFO] tez ............................................... SUCCESS [  1.330 s]
[INFO] tez-api ........................................... SUCCESS [ 17.289 s]
[INFO] tez-common ........................................ SUCCESS [  0.920 s]
[INFO] tez-runtime-internals ............................. SUCCESS [  1.071 s]
[INFO] tez-runtime-library ............................... SUCCESS [  3.453 s]
[INFO] tez-mapreduce ..................................... SUCCESS [  2.291 s]
[INFO] tez-examples ...................................... SUCCESS [  0.409 s]
[INFO] tez-dag ........................................... SUCCESS [  8.746 s]
[INFO] tez-tests ......................................... SUCCESS [  0.884 s]
[INFO] tez-ui ............................................ SUCCESS [ 44.450 s]
[INFO] tez-plugins ....................................... SUCCESS [  0.170 s]
[INFO] tez-yarn-timeline-history ......................... SUCCESS [  0.822 s]
[INFO] tez-yarn-timeline-history-with-acls ............... SUCCESS [  0.584 s]
[INFO] tez-mbeans-resource-calculator .................... SUCCESS [  0.331 s]
[INFO] tez-tools ......................................... SUCCESS [  0.117 s]
[INFO] tez-dist .......................................... SUCCESS [ 51.194 s]
[INFO] Tez ............................................... FAILURE [  1.061 s]
[INFO] ------------------------------------------------------------------------
[INFO] BUILD FAILURE
[INFO] ------------------------------------------------------------------------
[INFO] Total time: 02:15 min
[INFO] Finished at: 2015-06-18T21:42:31+00:00
[INFO] Final Memory: 62M/1185M
[INFO] ------------------------------------------------------------------------
[ERROR] Failed to execute goal org.apache.maven.plugins:maven-deploy-plugin:2.8.1:deploy (default-deploy) on project tez-docs: Failed to retrieve remote metadata org.apache.tez:tez:0.7.1-SNAPSHOT/maven-metadata.xml: Could not transfer metadata org.apache.tez:tez:0.7.1-SNAPSHOT/maven-metadata.xml from/to apache.snapshots.https (https://repository.apache.org/content/repositories/snapshots): java.lang.RuntimeException: Could not generate DH keypair: Prime size must be multiple of 64, and can only range from 512 to 1024 (inclusive) -> [Help 1]
[ERROR] 
[ERROR] To see the full stack trace of the errors, re-run Maven with the -e switch.
[ERROR] Re-run Maven using the -X switch to enable full debug logging.
[ERROR] 
[ERROR] For more information about the errors and possible solutions, please read the following articles:
[ERROR] [Help 1] http://cwiki.apache.org/confluence/display/MAVEN/MojoExecutionException
[ERROR] 
[ERROR] After correcting the problems, you can resume the build with the command
[ERROR]   mvn <goals> -rf :tez-docs
Build step 'Execute shell' marked build as failure
Archiving artifacts
Sending artifact delta relative to Tez-Build-branch-0.7 #24
Archived 2 artifacts
Archive block size is 32768
Received 0 blocks and 51833949 bytes
Compression is 0.0%
Took 21 sec

Build failed in Jenkins: Tez-Build-branch-0.7 #30

Posted by Apache Jenkins Server <je...@builds.apache.org>.
See <https://builds.apache.org/job/Tez-Build-branch-0.7/30/changes>

Changes:

[sseth] TEZ-2475. Fix a potential hang in Tez local mode caused by incorrectly

[sseth] Move TEZ-2475 to 0.5.4 release version in CHANGES.txt

[zjffdu] TEZ-2545. It is not necessary to start the vertex group commit when DAG is in TERMINATING (zjffdu)

------------------------------------------
[...truncated 3215 lines...]
[INFO] --- maven-compiler-plugin:3.1:testCompile (default-testCompile) @ tez-ui ---
[INFO] No sources to compile
[INFO] 
[INFO] --- maven-surefire-plugin:2.14.1:test (default-test) @ tez-ui ---
[INFO] Tests are skipped.
[INFO] 
[INFO] --- maven-war-plugin:2.5:war (default-war) @ tez-ui ---
[INFO] Packaging webapp
[INFO] Assembling webapp [tez-ui] in [<https://builds.apache.org/job/Tez-Build-branch-0.7/ws/tez-ui/target/tez-ui-0.7.1-SNAPSHOT]>
[INFO] Processing war project
[INFO] Copying webapp webResources [<https://builds.apache.org/job/Tez-Build-branch-0.7/ws/tez-ui/src/main/resources/]> to [<https://builds.apache.org/job/Tez-Build-branch-0.7/ws/tez-ui/target/tez-ui-0.7.1-SNAPSHOT]>
[INFO] Copying webapp webResources [<https://builds.apache.org/job/Tez-Build-branch-0.7/ws/tez-ui/src/main/webapp/dist]> to [<https://builds.apache.org/job/Tez-Build-branch-0.7/ws/tez-ui/target/tez-ui-0.7.1-SNAPSHOT]>
[INFO] Copying webapp webResources [<https://builds.apache.org/job/Tez-Build-branch-0.7/ws/tez-ui/src/main/webapp/dist]> to [<https://builds.apache.org/job/Tez-Build-branch-0.7/ws/tez-ui/target/tez-ui-0.7.1-SNAPSHOT]>
[INFO] Copying webapp resources [<https://builds.apache.org/job/Tez-Build-branch-0.7/ws/tez-ui/src/main/webapp/dist]>
[INFO] Webapp assembled in [33 msecs]
[INFO] Building war: <https://builds.apache.org/job/Tez-Build-branch-0.7/ws/tez-ui/target/tez-ui-0.7.1-SNAPSHOT.war>
[INFO] 
[INFO] --- maven-jar-plugin:2.4:test-jar (default) @ tez-ui ---
[WARNING] JAR will be empty - no content was marked for inclusion!
[INFO] Building jar: <https://builds.apache.org/job/Tez-Build-branch-0.7/ws/tez-ui/target/tez-ui-0.7.1-SNAPSHOT-tests.jar>
[INFO]                                                                         
[INFO] ------------------------------------------------------------------------
[INFO] Building tez-plugins 0.7.1-SNAPSHOT
[INFO] ------------------------------------------------------------------------
[INFO] 
[INFO] --- maven-clean-plugin:2.5:clean (default-clean) @ tez-plugins ---
[INFO] 
[INFO] --- buildnumber-maven-plugin:1.1:create (default) @ tez-plugins ---
[INFO] Checking for local modifications: skipped.
[INFO] Updating project files from SCM: skipped.
[INFO] Executing: /bin/sh -c cd <https://builds.apache.org/job/Tez-Build-branch-0.7/ws/tez-plugins> && git rev-parse --verify HEAD
[INFO] Working directory: <https://builds.apache.org/job/Tez-Build-branch-0.7/ws/tez-plugins>
[INFO] Storing buildNumber: 411c9ed6670f298417df91d1fd7ad6b48e25c4ad at timestamp: 1434567902177
[INFO] Executing: /bin/sh -c cd <https://builds.apache.org/job/Tez-Build-branch-0.7/ws/tez-plugins> && git rev-parse --verify HEAD
[INFO] Working directory: <https://builds.apache.org/job/Tez-Build-branch-0.7/ws/tez-plugins>
[INFO] Storing buildScmBranch: UNKNOWN
[INFO] 
[INFO] --- build-helper-maven-plugin:1.8:maven-version (maven-version) @ tez-plugins ---
[INFO] 
[INFO] --- buildnumber-maven-plugin:1.1:create (default) @ tez-plugins ---
[INFO] Checking for local modifications: skipped.
[INFO] Updating project files from SCM: skipped.
[INFO] Executing: /bin/sh -c cd <https://builds.apache.org/job/Tez-Build-branch-0.7/ws/tez-plugins> && git rev-parse --verify HEAD
[INFO] Working directory: <https://builds.apache.org/job/Tez-Build-branch-0.7/ws/tez-plugins>
[INFO] Storing buildNumber: 411c9ed6670f298417df91d1fd7ad6b48e25c4ad at timestamp: 1434567902188
[INFO] Executing: /bin/sh -c cd <https://builds.apache.org/job/Tez-Build-branch-0.7/ws/tez-plugins> && git rev-parse --verify HEAD
[INFO] Working directory: <https://builds.apache.org/job/Tez-Build-branch-0.7/ws/tez-plugins>
[INFO] Storing buildScmBranch: UNKNOWN
[INFO] 
[INFO] --- build-helper-maven-plugin:1.8:maven-version (maven-version) @ tez-plugins ---
[INFO] 
[INFO] --- maven-jar-plugin:2.4:test-jar (default) @ tez-plugins ---
[WARNING] JAR will be empty - no content was marked for inclusion!
[INFO] Building jar: <https://builds.apache.org/job/Tez-Build-branch-0.7/ws/tez-plugins/target/tez-plugins-0.7.1-SNAPSHOT-tests.jar>
[INFO] 
[INFO] --- maven-install-plugin:2.4:install (default-install) @ tez-plugins ---
[INFO] Installing <https://builds.apache.org/job/Tez-Build-branch-0.7/ws/tez-plugins/pom.xml> to /home/jenkins/.m2/repository/org/apache/tez/tez-plugins/0.7.1-SNAPSHOT/tez-plugins-0.7.1-SNAPSHOT.pom
[INFO] Installing <https://builds.apache.org/job/Tez-Build-branch-0.7/ws/tez-plugins/target/tez-plugins-0.7.1-SNAPSHOT-tests.jar> to /home/jenkins/.m2/repository/org/apache/tez/tez-plugins/0.7.1-SNAPSHOT/tez-plugins-0.7.1-SNAPSHOT-tests.jar
[INFO] 
[INFO] --- maven-deploy-plugin:2.8.1:deploy (default-deploy) @ tez-plugins ---
[INFO] Deploying org.apache.tez:tez-plugins:0.7.1-SNAPSHOT at end
[INFO] 
[INFO] --- buildnumber-maven-plugin:1.1:create (default) @ tez-plugins ---
[INFO] Checking for local modifications: skipped.
[INFO] Updating project files from SCM: skipped.
[INFO] Executing: /bin/sh -c cd <https://builds.apache.org/job/Tez-Build-branch-0.7/ws/tez-plugins> && git rev-parse --verify HEAD
[INFO] Working directory: <https://builds.apache.org/job/Tez-Build-branch-0.7/ws/tez-plugins>
[INFO] Storing buildNumber: 411c9ed6670f298417df91d1fd7ad6b48e25c4ad at timestamp: 1434567902228
[INFO] Executing: /bin/sh -c cd <https://builds.apache.org/job/Tez-Build-branch-0.7/ws/tez-plugins> && git rev-parse --verify HEAD
[INFO] Working directory: <https://builds.apache.org/job/Tez-Build-branch-0.7/ws/tez-plugins>
[INFO] Storing buildScmBranch: UNKNOWN
[INFO] 
[INFO] --- build-helper-maven-plugin:1.8:maven-version (maven-version) @ tez-plugins ---
[INFO] 
[INFO] --- maven-jar-plugin:2.4:test-jar (default) @ tez-plugins ---
[WARNING] JAR will be empty - no content was marked for inclusion!
[INFO]                                                                         
[INFO] ------------------------------------------------------------------------
[INFO] Skipping tez-yarn-timeline-history
[INFO] This project has been banned from the build due to previous failures.
[INFO] ------------------------------------------------------------------------
[INFO]                                                                         
[INFO] ------------------------------------------------------------------------
[INFO] Skipping tez-yarn-timeline-history-with-acls
[INFO] This project has been banned from the build due to previous failures.
[INFO] ------------------------------------------------------------------------
[INFO]                                                                         
[INFO] ------------------------------------------------------------------------
[INFO] Skipping tez-mbeans-resource-calculator
[INFO] This project has been banned from the build due to previous failures.
[INFO] ------------------------------------------------------------------------
[INFO]                                                                         
[INFO] ------------------------------------------------------------------------
[INFO] Building tez-tools 0.7.1-SNAPSHOT
[INFO] ------------------------------------------------------------------------
[INFO] 
[INFO] --- maven-clean-plugin:2.5:clean (default-clean) @ tez-tools ---
[INFO] 
[INFO] --- buildnumber-maven-plugin:1.1:create (default) @ tez-tools ---
[INFO] Checking for local modifications: skipped.
[INFO] Updating project files from SCM: skipped.
[INFO] Executing: /bin/sh -c cd <https://builds.apache.org/job/Tez-Build-branch-0.7/ws/tez-tools> && git rev-parse --verify HEAD
[INFO] Working directory: <https://builds.apache.org/job/Tez-Build-branch-0.7/ws/tez-tools>
[INFO] Storing buildNumber: 411c9ed6670f298417df91d1fd7ad6b48e25c4ad at timestamp: 1434567902258
[INFO] Executing: /bin/sh -c cd <https://builds.apache.org/job/Tez-Build-branch-0.7/ws/tez-tools> && git rev-parse --verify HEAD
[INFO] Working directory: <https://builds.apache.org/job/Tez-Build-branch-0.7/ws/tez-tools>
[INFO] Storing buildScmBranch: UNKNOWN
[INFO] 
[INFO] --- build-helper-maven-plugin:1.8:maven-version (maven-version) @ tez-tools ---
[INFO] 
[INFO] --- buildnumber-maven-plugin:1.1:create (default) @ tez-tools ---
[INFO] Checking for local modifications: skipped.
[INFO] Updating project files from SCM: skipped.
[INFO] Executing: /bin/sh -c cd <https://builds.apache.org/job/Tez-Build-branch-0.7/ws/tez-tools> && git rev-parse --verify HEAD
[INFO] Working directory: <https://builds.apache.org/job/Tez-Build-branch-0.7/ws/tez-tools>
[INFO] Storing buildNumber: 411c9ed6670f298417df91d1fd7ad6b48e25c4ad at timestamp: 1434567902269
[INFO] Executing: /bin/sh -c cd <https://builds.apache.org/job/Tez-Build-branch-0.7/ws/tez-tools> && git rev-parse --verify HEAD
[INFO] Working directory: <https://builds.apache.org/job/Tez-Build-branch-0.7/ws/tez-tools>
[INFO] Storing buildScmBranch: UNKNOWN
[INFO] 
[INFO] --- build-helper-maven-plugin:1.8:maven-version (maven-version) @ tez-tools ---
[INFO] 
[INFO] --- maven-jar-plugin:2.4:test-jar (default) @ tez-tools ---
[WARNING] JAR will be empty - no content was marked for inclusion!
[INFO] Building jar: <https://builds.apache.org/job/Tez-Build-branch-0.7/ws/tez-tools/target/tez-tools-0.7.1-SNAPSHOT-tests.jar>
[INFO] 
[INFO] --- maven-install-plugin:2.4:install (default-install) @ tez-tools ---
[INFO] Installing <https://builds.apache.org/job/Tez-Build-branch-0.7/ws/tez-tools/pom.xml> to /home/jenkins/.m2/repository/org/apache/tez/tez-tools/0.7.1-SNAPSHOT/tez-tools-0.7.1-SNAPSHOT.pom
[INFO] Installing <https://builds.apache.org/job/Tez-Build-branch-0.7/ws/tez-tools/target/tez-tools-0.7.1-SNAPSHOT-tests.jar> to /home/jenkins/.m2/repository/org/apache/tez/tez-tools/0.7.1-SNAPSHOT/tez-tools-0.7.1-SNAPSHOT-tests.jar
[INFO] 
[INFO] --- maven-deploy-plugin:2.8.1:deploy (default-deploy) @ tez-tools ---
[INFO] Deploying org.apache.tez:tez-tools:0.7.1-SNAPSHOT at end
[INFO] 
[INFO] --- buildnumber-maven-plugin:1.1:create (default) @ tez-tools ---
[INFO] Checking for local modifications: skipped.
[INFO] Updating project files from SCM: skipped.
[INFO] Executing: /bin/sh -c cd <https://builds.apache.org/job/Tez-Build-branch-0.7/ws/tez-tools> && git rev-parse --verify HEAD
[INFO] Working directory: <https://builds.apache.org/job/Tez-Build-branch-0.7/ws/tez-tools>
[INFO] Storing buildNumber: 411c9ed6670f298417df91d1fd7ad6b48e25c4ad at timestamp: 1434567902306
[INFO] Executing: /bin/sh -c cd <https://builds.apache.org/job/Tez-Build-branch-0.7/ws/tez-tools> && git rev-parse --verify HEAD
[INFO] Working directory: <https://builds.apache.org/job/Tez-Build-branch-0.7/ws/tez-tools>
[INFO] Storing buildScmBranch: UNKNOWN
[INFO] 
[INFO] --- build-helper-maven-plugin:1.8:maven-version (maven-version) @ tez-tools ---
[INFO] 
[INFO] --- maven-jar-plugin:2.4:test-jar (default) @ tez-tools ---
[WARNING] JAR will be empty - no content was marked for inclusion!
[INFO]                                                                         
[INFO] ------------------------------------------------------------------------
[INFO] Skipping tez-dist
[INFO] This project has been banned from the build due to previous failures.
[INFO] ------------------------------------------------------------------------
[INFO]                                                                         
[INFO] ------------------------------------------------------------------------
[INFO] Building Tez 0.7.1-SNAPSHOT
[INFO] ------------------------------------------------------------------------
[INFO] 
[INFO] --- maven-clean-plugin:2.5:clean (default-clean) @ tez-docs ---
[INFO] 
[INFO] --- buildnumber-maven-plugin:1.1:create (default) @ tez-docs ---
[INFO] Checking for local modifications: skipped.
[INFO] Updating project files from SCM: skipped.
[INFO] Executing: /bin/sh -c cd <https://builds.apache.org/job/Tez-Build-branch-0.7/ws/docs> && git rev-parse --verify HEAD
[INFO] Working directory: <https://builds.apache.org/job/Tez-Build-branch-0.7/ws/docs>
[INFO] Storing buildNumber: 411c9ed6670f298417df91d1fd7ad6b48e25c4ad at timestamp: 1434567902335
[INFO] Executing: /bin/sh -c cd <https://builds.apache.org/job/Tez-Build-branch-0.7/ws/docs> && git rev-parse --verify HEAD
[INFO] Working directory: <https://builds.apache.org/job/Tez-Build-branch-0.7/ws/docs>
[INFO] Storing buildScmBranch: UNKNOWN
[INFO] 
[INFO] --- build-helper-maven-plugin:1.8:maven-version (maven-version) @ tez-docs ---
[INFO] 
[INFO] --- buildnumber-maven-plugin:1.1:create (default) @ tez-docs ---
[INFO] Checking for local modifications: skipped.
[INFO] Updating project files from SCM: skipped.
[INFO] Executing: /bin/sh -c cd <https://builds.apache.org/job/Tez-Build-branch-0.7/ws/docs> && git rev-parse --verify HEAD
[INFO] Working directory: <https://builds.apache.org/job/Tez-Build-branch-0.7/ws/docs>
[INFO] Storing buildNumber: 411c9ed6670f298417df91d1fd7ad6b48e25c4ad at timestamp: 1434567902344
[INFO] Executing: /bin/sh -c cd <https://builds.apache.org/job/Tez-Build-branch-0.7/ws/docs> && git rev-parse --verify HEAD
[INFO] Working directory: <https://builds.apache.org/job/Tez-Build-branch-0.7/ws/docs>
[INFO] Storing buildScmBranch: UNKNOWN
[INFO] 
[INFO] --- build-helper-maven-plugin:1.8:maven-version (maven-version) @ tez-docs ---
[INFO] 
[INFO] --- maven-jar-plugin:2.4:test-jar (default) @ tez-docs ---
[WARNING] JAR will be empty - no content was marked for inclusion!
[INFO] Building jar: <https://builds.apache.org/job/Tez-Build-branch-0.7/ws/docs/target/tez-docs-0.7.1-SNAPSHOT-tests.jar>
[INFO] 
[INFO] --- maven-install-plugin:2.4:install (default-install) @ tez-docs ---
[INFO] Installing <https://builds.apache.org/job/Tez-Build-branch-0.7/ws/docs/pom.xml> to /home/jenkins/.m2/repository/org/apache/tez/tez-docs/0.7.1-SNAPSHOT/tez-docs-0.7.1-SNAPSHOT.pom
[INFO] Installing <https://builds.apache.org/job/Tez-Build-branch-0.7/ws/docs/target/tez-docs-0.7.1-SNAPSHOT-tests.jar> to /home/jenkins/.m2/repository/org/apache/tez/tez-docs/0.7.1-SNAPSHOT/tez-docs-0.7.1-SNAPSHOT-tests.jar
[INFO] 
[INFO] --- maven-deploy-plugin:2.8.1:deploy (default-deploy) @ tez-docs ---
[INFO] Skipping artifact deployment
[INFO] 
[INFO] --- buildnumber-maven-plugin:1.1:create (default) @ tez-docs ---
[INFO] Checking for local modifications: skipped.
[INFO] Updating project files from SCM: skipped.
[INFO] Executing: /bin/sh -c cd <https://builds.apache.org/job/Tez-Build-branch-0.7/ws/docs> && git rev-parse --verify HEAD
[INFO] Working directory: <https://builds.apache.org/job/Tez-Build-branch-0.7/ws/docs>
[INFO] Storing buildNumber: 411c9ed6670f298417df91d1fd7ad6b48e25c4ad at timestamp: 1434567902381
[INFO] Executing: /bin/sh -c cd <https://builds.apache.org/job/Tez-Build-branch-0.7/ws/docs> && git rev-parse --verify HEAD
[INFO] Working directory: <https://builds.apache.org/job/Tez-Build-branch-0.7/ws/docs>
[INFO] Storing buildScmBranch: UNKNOWN
[INFO] 
[INFO] --- build-helper-maven-plugin:1.8:maven-version (maven-version) @ tez-docs ---
[INFO] 
[INFO] --- maven-jar-plugin:2.4:test-jar (default) @ tez-docs ---
[WARNING] JAR will be empty - no content was marked for inclusion!
[INFO] ------------------------------------------------------------------------
[INFO] Reactor Summary:
[INFO] 
[INFO] tez ............................................... SUCCESS [  1.260 s]
[INFO] tez-api ........................................... SUCCESS [ 17.420 s]
[INFO] tez-common ........................................ SUCCESS [  0.623 s]
[INFO] tez-runtime-internals ............................. SUCCESS [  0.861 s]
[INFO] tez-runtime-library ............................... SUCCESS [  3.432 s]
[INFO] tez-mapreduce ..................................... SUCCESS [  1.169 s]
[INFO] tez-examples ...................................... SUCCESS [  0.358 s]
[INFO] tez-dag ........................................... FAILURE [  2.294 s]
[INFO] tez-tests ......................................... SKIPPED
[INFO] tez-ui ............................................ SUCCESS [01:30 min]
[INFO] tez-plugins ....................................... SUCCESS [  0.084 s]
[INFO] tez-yarn-timeline-history ......................... SKIPPED
[INFO] tez-yarn-timeline-history-with-acls ............... SKIPPED
[INFO] tez-mbeans-resource-calculator .................... SKIPPED
[INFO] tez-tools ......................................... SUCCESS [  0.077 s]
[INFO] tez-dist .......................................... SKIPPED
[INFO] Tez ............................................... SUCCESS [  0.087 s]
[INFO] ------------------------------------------------------------------------
[INFO] BUILD FAILURE
[INFO] ------------------------------------------------------------------------
[INFO] Total time: 01:59 min
[INFO] Finished at: 2015-06-17T19:05:02+00:00
[INFO] Final Memory: 61M/1053M
[INFO] ------------------------------------------------------------------------
[ERROR] Failed to execute goal org.apache.maven.plugins:maven-compiler-plugin:3.1:compile (default-compile) on project tez-dag: Compilation failure
[ERROR] <https://builds.apache.org/job/Tez-Build-branch-0.7/ws/tez-dag/src/main/java/org/apache/tez/dag/app/launcher/LocalContainerLauncher.java>:[190,11] unreported exception java.lang.Throwable; must be caught or declared to be thrown
[ERROR] -> [Help 1]
[ERROR] 
[ERROR] To see the full stack trace of the errors, re-run Maven with the -e switch.
[ERROR] Re-run Maven using the -X switch to enable full debug logging.
[ERROR] 
[ERROR] For more information about the errors and possible solutions, please read the following articles:
[ERROR] [Help 1] http://cwiki.apache.org/confluence/display/MAVEN/MojoFailureException
[ERROR] 
[ERROR] After correcting the problems, you can resume the build with the command
[ERROR]   mvn <goals> -rf :tez-dag
Build step 'Execute shell' marked build as failure
Archiving artifacts

Build failed in Jenkins: Tez-Build-branch-0.7 #29

Posted by Apache Jenkins Server <je...@builds.apache.org>.
See <https://builds.apache.org/job/Tez-Build-branch-0.7/29/changes>

Changes:

[pramachandran] TEZ-2554. Tez UI: View log link does not correctly propagate login crendential to read log from yarn web. (sree via prakash)

------------------------------------------
[...truncated 2635 lines...]
[WARNING] The following patterns were never triggered in this artifact exclusion filter:
o  '*:*:test-jar'

[WARNING] The following patterns were never triggered in this artifact exclusion filter:
o  '*:*:test-jar'

[WARNING] The following patterns were never triggered in this artifact exclusion filter:
o  '*:*:test-jar'

[WARNING] The following patterns were never triggered in this artifact exclusion filter:
o  '*:*:test-jar'

[INFO] Building tar: <https://builds.apache.org/job/Tez-Build-branch-0.7/29/artifact/tez-dist/target/tez-0.7.1-SNAPSHOT-minimal.tar.gz>
[INFO] 
[INFO] --- maven-jar-plugin:2.4:test-jar (default) @ tez-dist ---
[WARNING] JAR will be empty - no content was marked for inclusion!
[INFO] Building jar: <https://builds.apache.org/job/Tez-Build-branch-0.7/ws/tez-dist/target/tez-dist-0.7.1-SNAPSHOT-tests.jar>
[INFO] 
[INFO] --- maven-install-plugin:2.4:install (default-install) @ tez-dist ---
[INFO] Installing <https://builds.apache.org/job/Tez-Build-branch-0.7/ws/tez-dist/pom.xml> to /home/jenkins/.m2/repository/org/apache/tez/tez-dist/0.7.1-SNAPSHOT/tez-dist-0.7.1-SNAPSHOT.pom
[INFO] Installing <https://builds.apache.org/job/Tez-Build-branch-0.7/ws/tez-dist/target/tez-dist-0.7.1-SNAPSHOT-tests.jar> to /home/jenkins/.m2/repository/org/apache/tez/tez-dist/0.7.1-SNAPSHOT/tez-dist-0.7.1-SNAPSHOT-tests.jar
[INFO] 
[INFO] --- maven-deploy-plugin:2.8.1:deploy (default-deploy) @ tez-dist ---
[INFO] Skipping artifact deployment
[INFO] 
[INFO] --- buildnumber-maven-plugin:1.1:create (default) @ tez-dist ---
[INFO] Checking for local modifications: skipped.
[INFO] Updating project files from SCM: skipped.
[INFO] Executing: /bin/sh -c cd <https://builds.apache.org/job/Tez-Build-branch-0.7/ws/tez-dist> && git rev-parse --verify HEAD
[INFO] Working directory: <https://builds.apache.org/job/Tez-Build-branch-0.7/ws/tez-dist>
[INFO] Storing buildNumber: f3619dc5298589590f95f3c9b29ed88b6a3eecf5 at timestamp: 1434473415702
[INFO] Executing: /bin/sh -c cd <https://builds.apache.org/job/Tez-Build-branch-0.7/ws/tez-dist> && git rev-parse --verify HEAD
[INFO] Working directory: <https://builds.apache.org/job/Tez-Build-branch-0.7/ws/tez-dist>
[INFO] Storing buildScmBranch: UNKNOWN
[INFO] 
[INFO] --- build-helper-maven-plugin:1.8:maven-version (maven-version) @ tez-dist ---
[INFO] 
[INFO] --- maven-assembly-plugin:2.4:single (package-tez) @ tez-dist ---
[INFO] Reading assembly descriptor: src/main/assembly/tez-dist.xml
[WARNING] NOTE: Currently, inclusion of module dependencies may produce unpredictable results if a version conflict occurs.
[WARNING] The following patterns were never triggered in this artifact exclusion filter:
o  '*:*:test-jar'

[WARNING] The following patterns were never triggered in this artifact exclusion filter:
o  '*:*:test-jar'

[WARNING] The following patterns were never triggered in this artifact exclusion filter:
o  '*:*:test-jar'

[WARNING] The following patterns were never triggered in this artifact exclusion filter:
o  '*:*:test-jar'

[WARNING] The following patterns were never triggered in this artifact exclusion filter:
o  '*:*:test-jar'

[WARNING] The following patterns were never triggered in this artifact exclusion filter:
o  '*:*:test-jar'

[WARNING] The following patterns were never triggered in this artifact exclusion filter:
o  '*:*:test-jar'

[WARNING] The following patterns were never triggered in this artifact exclusion filter:
o  '*:*:test-jar'

[WARNING] The following patterns were never triggered in this artifact exclusion filter:
o  '*:*:test-jar'

[WARNING] The following patterns were never triggered in this artifact exclusion filter:
o  '*:*:test-jar'

[WARNING] The following patterns were never triggered in this artifact exclusion filter:
o  '*:*:test-jar'

[WARNING] The following patterns were never triggered in this artifact exclusion filter:
o  '*:*:test-jar'

[INFO] Copying files to <https://builds.apache.org/job/Tez-Build-branch-0.7/ws/tez-dist/target/tez-0.7.1-SNAPSHOT>
[WARNING] NOTE: Currently, inclusion of module dependencies may produce unpredictable results if a version conflict occurs.
[WARNING] The following patterns were never triggered in this artifact exclusion filter:
o  '*:*:test-jar'

[WARNING] The following patterns were never triggered in this artifact exclusion filter:
o  '*:*:test-jar'

[WARNING] The following patterns were never triggered in this artifact exclusion filter:
o  '*:*:test-jar'

[WARNING] The following patterns were never triggered in this artifact exclusion filter:
o  '*:*:test-jar'

[WARNING] The following patterns were never triggered in this artifact exclusion filter:
o  '*:*:test-jar'

[WARNING] The following patterns were never triggered in this artifact exclusion filter:
o  '*:*:test-jar'

[WARNING] The following patterns were never triggered in this artifact exclusion filter:
o  '*:*:test-jar'

[WARNING] The following patterns were never triggered in this artifact exclusion filter:
o  '*:*:test-jar'

[WARNING] The following patterns were never triggered in this artifact exclusion filter:
o  '*:*:test-jar'

[WARNING] The following patterns were never triggered in this artifact exclusion filter:
o  '*:*:test-jar'

[WARNING] The following patterns were never triggered in this artifact exclusion filter:
o  '*:*:test-jar'

[WARNING] The following patterns were never triggered in this artifact exclusion filter:
o  '*:*:test-jar'

[INFO] Building tar: <https://builds.apache.org/job/Tez-Build-branch-0.7/29/artifact/tez-dist/target/tez-0.7.1-SNAPSHOT.tar.gz>
[INFO] 
[INFO] --- maven-assembly-plugin:2.4:single (package-tez-minimal) @ tez-dist ---
[INFO] Reading assembly descriptor: src/main/assembly/tez-dist-minimal.xml
[WARNING] NOTE: Currently, inclusion of module dependencies may produce unpredictable results if a version conflict occurs.
[WARNING] The following patterns were never triggered in this artifact exclusion filter:
o  '*:*:test-jar'

[WARNING] The following patterns were never triggered in this artifact exclusion filter:
o  '*:*:test-jar'

[WARNING] The following patterns were never triggered in this artifact exclusion filter:
o  '*:*:test-jar'

[WARNING] The following patterns were never triggered in this artifact exclusion filter:
o  '*:*:test-jar'

[WARNING] The following patterns were never triggered in this artifact exclusion filter:
o  '*:*:test-jar'

[WARNING] The following patterns were never triggered in this artifact exclusion filter:
o  '*:*:test-jar'

[WARNING] The following patterns were never triggered in this artifact exclusion filter:
o  '*:*:test-jar'

[WARNING] The following patterns were never triggered in this artifact exclusion filter:
o  '*:*:test-jar'

[WARNING] The following patterns were never triggered in this artifact exclusion filter:
o  '*:*:test-jar'

[WARNING] The following patterns were never triggered in this artifact exclusion filter:
o  '*:*:test-jar'

[WARNING] The following patterns were never triggered in this artifact exclusion filter:
o  '*:*:test-jar'

[WARNING] The following patterns were never triggered in this artifact exclusion filter:
o  '*:*:test-jar'

[INFO] Building tar: <https://builds.apache.org/job/Tez-Build-branch-0.7/29/artifact/tez-dist/target/tez-0.7.1-SNAPSHOT-minimal.tar.gz>
[INFO] 
[INFO] --- maven-jar-plugin:2.4:test-jar (default) @ tez-dist ---
[WARNING] JAR will be empty - no content was marked for inclusion!
[INFO]                                                                         
[INFO] ------------------------------------------------------------------------
[INFO] Building Tez 0.7.1-SNAPSHOT
[INFO] ------------------------------------------------------------------------
[INFO] 
[INFO] --- maven-clean-plugin:2.5:clean (default-clean) @ tez-docs ---
[INFO] Deleting <https://builds.apache.org/job/Tez-Build-branch-0.7/ws/docs/target>
[INFO] 
[INFO] --- buildnumber-maven-plugin:1.1:create (default) @ tez-docs ---
[INFO] Checking for local modifications: skipped.
[INFO] Updating project files from SCM: skipped.
[INFO] Executing: /bin/sh -c cd <https://builds.apache.org/job/Tez-Build-branch-0.7/ws/docs> && git rev-parse --verify HEAD
[INFO] Working directory: <https://builds.apache.org/job/Tez-Build-branch-0.7/ws/docs>
[INFO] Storing buildNumber: f3619dc5298589590f95f3c9b29ed88b6a3eecf5 at timestamp: 1434473441190
[INFO] Executing: /bin/sh -c cd <https://builds.apache.org/job/Tez-Build-branch-0.7/ws/docs> && git rev-parse --verify HEAD
[INFO] Working directory: <https://builds.apache.org/job/Tez-Build-branch-0.7/ws/docs>
[INFO] Storing buildScmBranch: UNKNOWN
[INFO] 
[INFO] --- build-helper-maven-plugin:1.8:maven-version (maven-version) @ tez-docs ---
[INFO] 
[INFO] --- buildnumber-maven-plugin:1.1:create (default) @ tez-docs ---
[INFO] Checking for local modifications: skipped.
[INFO] Updating project files from SCM: skipped.
[INFO] Executing: /bin/sh -c cd <https://builds.apache.org/job/Tez-Build-branch-0.7/ws/docs> && git rev-parse --verify HEAD
[INFO] Working directory: <https://builds.apache.org/job/Tez-Build-branch-0.7/ws/docs>
[INFO] Storing buildNumber: f3619dc5298589590f95f3c9b29ed88b6a3eecf5 at timestamp: 1434473441201
[INFO] Executing: /bin/sh -c cd <https://builds.apache.org/job/Tez-Build-branch-0.7/ws/docs> && git rev-parse --verify HEAD
[INFO] Working directory: <https://builds.apache.org/job/Tez-Build-branch-0.7/ws/docs>
[INFO] Storing buildScmBranch: UNKNOWN
[INFO] 
[INFO] --- build-helper-maven-plugin:1.8:maven-version (maven-version) @ tez-docs ---
[INFO] 
[INFO] --- maven-jar-plugin:2.4:test-jar (default) @ tez-docs ---
[WARNING] JAR will be empty - no content was marked for inclusion!
[INFO] Building jar: <https://builds.apache.org/job/Tez-Build-branch-0.7/ws/docs/target/tez-docs-0.7.1-SNAPSHOT-tests.jar>
[INFO] 
[INFO] --- maven-install-plugin:2.4:install (default-install) @ tez-docs ---
[INFO] Installing <https://builds.apache.org/job/Tez-Build-branch-0.7/ws/docs/pom.xml> to /home/jenkins/.m2/repository/org/apache/tez/tez-docs/0.7.1-SNAPSHOT/tez-docs-0.7.1-SNAPSHOT.pom
[INFO] Installing <https://builds.apache.org/job/Tez-Build-branch-0.7/ws/docs/target/tez-docs-0.7.1-SNAPSHOT-tests.jar> to /home/jenkins/.m2/repository/org/apache/tez/tez-docs/0.7.1-SNAPSHOT/tez-docs-0.7.1-SNAPSHOT-tests.jar
[INFO] 
[INFO] --- maven-deploy-plugin:2.8.1:deploy (default-deploy) @ tez-docs ---
[INFO] Skipping artifact deployment
Downloading: https://repository.apache.org/content/repositories/snapshots/org/apache/tez/tez/0.7.1-SNAPSHOT/maven-metadata.xml

[WARNING] Could not transfer metadata org.apache.tez:tez:0.7.1-SNAPSHOT/maven-metadata.xml from/to apache.snapshots.https (https://repository.apache.org/content/repositories/snapshots): java.lang.RuntimeException: Could not generate DH keypair
[INFO] ------------------------------------------------------------------------
[INFO] Reactor Summary:
[INFO] 
[INFO] tez ............................................... SUCCESS [  1.305 s]
[INFO] tez-api ........................................... SUCCESS [ 18.785 s]
[INFO] tez-common ........................................ SUCCESS [  0.825 s]
[INFO] tez-runtime-internals ............................. SUCCESS [  1.055 s]
[INFO] tez-runtime-library ............................... SUCCESS [  3.391 s]
[INFO] tez-mapreduce ..................................... SUCCESS [  1.810 s]
[INFO] tez-examples ...................................... SUCCESS [  0.452 s]
[INFO] tez-dag ........................................... SUCCESS [  8.666 s]
[INFO] tez-tests ......................................... SUCCESS [  0.884 s]
[INFO] tez-ui ............................................ SUCCESS [ 42.403 s]
[INFO] tez-plugins ....................................... SUCCESS [  0.123 s]
[INFO] tez-yarn-timeline-history ......................... SUCCESS [  0.792 s]
[INFO] tez-yarn-timeline-history-with-acls ............... SUCCESS [  0.530 s]
[INFO] tez-mbeans-resource-calculator .................... SUCCESS [  0.344 s]
[INFO] tez-tools ......................................... SUCCESS [  0.101 s]
[INFO] tez-dist .......................................... SUCCESS [ 53.966 s]
[INFO] Tez ............................................... FAILURE [  1.245 s]
[INFO] ------------------------------------------------------------------------
[INFO] BUILD FAILURE
[INFO] ------------------------------------------------------------------------
[INFO] Total time: 02:17 min
[INFO] Finished at: 2015-06-16T16:50:42+00:00
[INFO] Final Memory: 68M/1184M
[INFO] ------------------------------------------------------------------------
[ERROR] Failed to execute goal org.apache.maven.plugins:maven-deploy-plugin:2.8.1:deploy (default-deploy) on project tez-docs: Failed to retrieve remote metadata org.apache.tez:tez:0.7.1-SNAPSHOT/maven-metadata.xml: Could not transfer metadata org.apache.tez:tez:0.7.1-SNAPSHOT/maven-metadata.xml from/to apache.snapshots.https (https://repository.apache.org/content/repositories/snapshots): java.lang.RuntimeException: Could not generate DH keypair: Prime size must be multiple of 64, and can only range from 512 to 1024 (inclusive) -> [Help 1]
[ERROR] 
[ERROR] To see the full stack trace of the errors, re-run Maven with the -e switch.
[ERROR] Re-run Maven using the -X switch to enable full debug logging.
[ERROR] 
[ERROR] For more information about the errors and possible solutions, please read the following articles:
[ERROR] [Help 1] http://cwiki.apache.org/confluence/display/MAVEN/MojoExecutionException
[ERROR] 
[ERROR] After correcting the problems, you can resume the build with the command
[ERROR]   mvn <goals> -rf :tez-docs
Build step 'Execute shell' marked build as failure
Archiving artifacts
Sending artifact delta relative to Tez-Build-branch-0.7 #24
Archived 2 artifacts
Archive block size is 32768
Received 0 blocks and 51833224 bytes
Compression is 0.0%
Took 23 sec

Build failed in Jenkins: Tez-Build-branch-0.7 #28

Posted by Apache Jenkins Server <je...@builds.apache.org>.
See <https://builds.apache.org/job/Tez-Build-branch-0.7/28/changes>

Changes:

[jeagles] TEZ-2547. Tez UI: Download Data fails on secure, cross-origin clusters (jeagles)

[hitesh] TEZ-2548. TezClient submitDAG can hang if the AM is in the process of shutting down. (hitesh)

------------------------------------------
[...truncated 2629 lines...]
[WARNING] The following patterns were never triggered in this artifact exclusion filter:
o  '*:*:test-jar'

[WARNING] The following patterns were never triggered in this artifact exclusion filter:
o  '*:*:test-jar'

[WARNING] The following patterns were never triggered in this artifact exclusion filter:
o  '*:*:test-jar'

[WARNING] The following patterns were never triggered in this artifact exclusion filter:
o  '*:*:test-jar'

[INFO] Building tar: <https://builds.apache.org/job/Tez-Build-branch-0.7/28/artifact/tez-dist/target/tez-0.7.1-SNAPSHOT-minimal.tar.gz>
[INFO] 
[INFO] --- maven-jar-plugin:2.4:test-jar (default) @ tez-dist ---
[WARNING] JAR will be empty - no content was marked for inclusion!
[INFO] Building jar: <https://builds.apache.org/job/Tez-Build-branch-0.7/ws/tez-dist/target/tez-dist-0.7.1-SNAPSHOT-tests.jar>
[INFO] 
[INFO] --- maven-install-plugin:2.4:install (default-install) @ tez-dist ---
[INFO] Installing <https://builds.apache.org/job/Tez-Build-branch-0.7/ws/tez-dist/pom.xml> to /home/jenkins/.m2/repository/org/apache/tez/tez-dist/0.7.1-SNAPSHOT/tez-dist-0.7.1-SNAPSHOT.pom
[INFO] Installing <https://builds.apache.org/job/Tez-Build-branch-0.7/ws/tez-dist/target/tez-dist-0.7.1-SNAPSHOT-tests.jar> to /home/jenkins/.m2/repository/org/apache/tez/tez-dist/0.7.1-SNAPSHOT/tez-dist-0.7.1-SNAPSHOT-tests.jar
[INFO] 
[INFO] --- maven-deploy-plugin:2.8.1:deploy (default-deploy) @ tez-dist ---
[INFO] Skipping artifact deployment
[INFO] 
[INFO] --- buildnumber-maven-plugin:1.1:create (default) @ tez-dist ---
[INFO] Checking for local modifications: skipped.
[INFO] Updating project files from SCM: skipped.
[INFO] Executing: /bin/sh -c cd <https://builds.apache.org/job/Tez-Build-branch-0.7/ws/tez-dist> && git rev-parse --verify HEAD
[INFO] Working directory: <https://builds.apache.org/job/Tez-Build-branch-0.7/ws/tez-dist>
[INFO] Storing buildNumber: cd5101b68793e7f7feb3e6af0485d53011657b7b at timestamp: 1434127802515
[INFO] Executing: /bin/sh -c cd <https://builds.apache.org/job/Tez-Build-branch-0.7/ws/tez-dist> && git rev-parse --verify HEAD
[INFO] Working directory: <https://builds.apache.org/job/Tez-Build-branch-0.7/ws/tez-dist>
[INFO] Storing buildScmBranch: UNKNOWN
[INFO] 
[INFO] --- build-helper-maven-plugin:1.8:maven-version (maven-version) @ tez-dist ---
[INFO] 
[INFO] --- maven-assembly-plugin:2.4:single (package-tez) @ tez-dist ---
[INFO] Reading assembly descriptor: src/main/assembly/tez-dist.xml
[WARNING] NOTE: Currently, inclusion of module dependencies may produce unpredictable results if a version conflict occurs.
[WARNING] The following patterns were never triggered in this artifact exclusion filter:
o  '*:*:test-jar'

[WARNING] The following patterns were never triggered in this artifact exclusion filter:
o  '*:*:test-jar'

[WARNING] The following patterns were never triggered in this artifact exclusion filter:
o  '*:*:test-jar'

[WARNING] The following patterns were never triggered in this artifact exclusion filter:
o  '*:*:test-jar'

[WARNING] The following patterns were never triggered in this artifact exclusion filter:
o  '*:*:test-jar'

[WARNING] The following patterns were never triggered in this artifact exclusion filter:
o  '*:*:test-jar'

[WARNING] The following patterns were never triggered in this artifact exclusion filter:
o  '*:*:test-jar'

[WARNING] The following patterns were never triggered in this artifact exclusion filter:
o  '*:*:test-jar'

[WARNING] The following patterns were never triggered in this artifact exclusion filter:
o  '*:*:test-jar'

[WARNING] The following patterns were never triggered in this artifact exclusion filter:
o  '*:*:test-jar'

[WARNING] The following patterns were never triggered in this artifact exclusion filter:
o  '*:*:test-jar'

[WARNING] The following patterns were never triggered in this artifact exclusion filter:
o  '*:*:test-jar'

[INFO] Copying files to <https://builds.apache.org/job/Tez-Build-branch-0.7/ws/tez-dist/target/tez-0.7.1-SNAPSHOT>
[WARNING] NOTE: Currently, inclusion of module dependencies may produce unpredictable results if a version conflict occurs.
[WARNING] The following patterns were never triggered in this artifact exclusion filter:
o  '*:*:test-jar'

[WARNING] The following patterns were never triggered in this artifact exclusion filter:
o  '*:*:test-jar'

[WARNING] The following patterns were never triggered in this artifact exclusion filter:
o  '*:*:test-jar'

[WARNING] The following patterns were never triggered in this artifact exclusion filter:
o  '*:*:test-jar'

[WARNING] The following patterns were never triggered in this artifact exclusion filter:
o  '*:*:test-jar'

[WARNING] The following patterns were never triggered in this artifact exclusion filter:
o  '*:*:test-jar'

[WARNING] The following patterns were never triggered in this artifact exclusion filter:
o  '*:*:test-jar'

[WARNING] The following patterns were never triggered in this artifact exclusion filter:
o  '*:*:test-jar'

[WARNING] The following patterns were never triggered in this artifact exclusion filter:
o  '*:*:test-jar'

[WARNING] The following patterns were never triggered in this artifact exclusion filter:
o  '*:*:test-jar'

[WARNING] The following patterns were never triggered in this artifact exclusion filter:
o  '*:*:test-jar'

[WARNING] The following patterns were never triggered in this artifact exclusion filter:
o  '*:*:test-jar'

[INFO] Building tar: <https://builds.apache.org/job/Tez-Build-branch-0.7/28/artifact/tez-dist/target/tez-0.7.1-SNAPSHOT.tar.gz>
[INFO] 
[INFO] --- maven-assembly-plugin:2.4:single (package-tez-minimal) @ tez-dist ---
[INFO] Reading assembly descriptor: src/main/assembly/tez-dist-minimal.xml
[WARNING] NOTE: Currently, inclusion of module dependencies may produce unpredictable results if a version conflict occurs.
[WARNING] The following patterns were never triggered in this artifact exclusion filter:
o  '*:*:test-jar'

[WARNING] The following patterns were never triggered in this artifact exclusion filter:
o  '*:*:test-jar'

[WARNING] The following patterns were never triggered in this artifact exclusion filter:
o  '*:*:test-jar'

[WARNING] The following patterns were never triggered in this artifact exclusion filter:
o  '*:*:test-jar'

[WARNING] The following patterns were never triggered in this artifact exclusion filter:
o  '*:*:test-jar'

[WARNING] The following patterns were never triggered in this artifact exclusion filter:
o  '*:*:test-jar'

[WARNING] The following patterns were never triggered in this artifact exclusion filter:
o  '*:*:test-jar'

[WARNING] The following patterns were never triggered in this artifact exclusion filter:
o  '*:*:test-jar'

[WARNING] The following patterns were never triggered in this artifact exclusion filter:
o  '*:*:test-jar'

[WARNING] The following patterns were never triggered in this artifact exclusion filter:
o  '*:*:test-jar'

[WARNING] The following patterns were never triggered in this artifact exclusion filter:
o  '*:*:test-jar'

[WARNING] The following patterns were never triggered in this artifact exclusion filter:
o  '*:*:test-jar'

[INFO] Building tar: <https://builds.apache.org/job/Tez-Build-branch-0.7/28/artifact/tez-dist/target/tez-0.7.1-SNAPSHOT-minimal.tar.gz>
[INFO] 
[INFO] --- maven-jar-plugin:2.4:test-jar (default) @ tez-dist ---
[WARNING] JAR will be empty - no content was marked for inclusion!
[INFO]                                                                         
[INFO] ------------------------------------------------------------------------
[INFO] Building Tez 0.7.1-SNAPSHOT
[INFO] ------------------------------------------------------------------------
[INFO] 
[INFO] --- maven-clean-plugin:2.5:clean (default-clean) @ tez-docs ---
[INFO] Deleting <https://builds.apache.org/job/Tez-Build-branch-0.7/ws/docs/target>
[INFO] 
[INFO] --- buildnumber-maven-plugin:1.1:create (default) @ tez-docs ---
[INFO] Checking for local modifications: skipped.
[INFO] Updating project files from SCM: skipped.
[INFO] Executing: /bin/sh -c cd <https://builds.apache.org/job/Tez-Build-branch-0.7/ws/docs> && git rev-parse --verify HEAD
[INFO] Working directory: <https://builds.apache.org/job/Tez-Build-branch-0.7/ws/docs>
[INFO] Storing buildNumber: cd5101b68793e7f7feb3e6af0485d53011657b7b at timestamp: 1434127827869
[INFO] Executing: /bin/sh -c cd <https://builds.apache.org/job/Tez-Build-branch-0.7/ws/docs> && git rev-parse --verify HEAD
[INFO] Working directory: <https://builds.apache.org/job/Tez-Build-branch-0.7/ws/docs>
[INFO] Storing buildScmBranch: UNKNOWN
[INFO] 
[INFO] --- build-helper-maven-plugin:1.8:maven-version (maven-version) @ tez-docs ---
[INFO] 
[INFO] --- buildnumber-maven-plugin:1.1:create (default) @ tez-docs ---
[INFO] Checking for local modifications: skipped.
[INFO] Updating project files from SCM: skipped.
[INFO] Executing: /bin/sh -c cd <https://builds.apache.org/job/Tez-Build-branch-0.7/ws/docs> && git rev-parse --verify HEAD
[INFO] Working directory: <https://builds.apache.org/job/Tez-Build-branch-0.7/ws/docs>
[INFO] Storing buildNumber: cd5101b68793e7f7feb3e6af0485d53011657b7b at timestamp: 1434127827879
[INFO] Executing: /bin/sh -c cd <https://builds.apache.org/job/Tez-Build-branch-0.7/ws/docs> && git rev-parse --verify HEAD
[INFO] Working directory: <https://builds.apache.org/job/Tez-Build-branch-0.7/ws/docs>
[INFO] Storing buildScmBranch: UNKNOWN
[INFO] 
[INFO] --- build-helper-maven-plugin:1.8:maven-version (maven-version) @ tez-docs ---
[INFO] 
[INFO] --- maven-jar-plugin:2.4:test-jar (default) @ tez-docs ---
[WARNING] JAR will be empty - no content was marked for inclusion!
[INFO] Building jar: <https://builds.apache.org/job/Tez-Build-branch-0.7/ws/docs/target/tez-docs-0.7.1-SNAPSHOT-tests.jar>
[INFO] 
[INFO] --- maven-install-plugin:2.4:install (default-install) @ tez-docs ---
[INFO] Installing <https://builds.apache.org/job/Tez-Build-branch-0.7/ws/docs/pom.xml> to /home/jenkins/.m2/repository/org/apache/tez/tez-docs/0.7.1-SNAPSHOT/tez-docs-0.7.1-SNAPSHOT.pom
[INFO] Installing <https://builds.apache.org/job/Tez-Build-branch-0.7/ws/docs/target/tez-docs-0.7.1-SNAPSHOT-tests.jar> to /home/jenkins/.m2/repository/org/apache/tez/tez-docs/0.7.1-SNAPSHOT/tez-docs-0.7.1-SNAPSHOT-tests.jar
[INFO] 
[INFO] --- maven-deploy-plugin:2.8.1:deploy (default-deploy) @ tez-docs ---
[INFO] Skipping artifact deployment
Downloading: https://repository.apache.org/content/repositories/snapshots/org/apache/tez/tez/0.7.1-SNAPSHOT/maven-metadata.xml

[WARNING] Could not transfer metadata org.apache.tez:tez:0.7.1-SNAPSHOT/maven-metadata.xml from/to apache.snapshots.https (https://repository.apache.org/content/repositories/snapshots): java.lang.RuntimeException: Could not generate DH keypair
[INFO] ------------------------------------------------------------------------
[INFO] Reactor Summary:
[INFO] 
[INFO] tez ............................................... SUCCESS [  1.254 s]
[INFO] tez-api ........................................... SUCCESS [ 16.816 s]
[INFO] tez-common ........................................ SUCCESS [  0.629 s]
[INFO] tez-runtime-internals ............................. SUCCESS [  0.899 s]
[INFO] tez-runtime-library ............................... SUCCESS [  2.736 s]
[INFO] tez-mapreduce ..................................... SUCCESS [  1.654 s]
[INFO] tez-examples ...................................... SUCCESS [  0.381 s]
[INFO] tez-dag ........................................... SUCCESS [  8.190 s]
[INFO] tez-tests ......................................... SUCCESS [  0.809 s]
[INFO] tez-ui ............................................ SUCCESS [ 38.926 s]
[INFO] tez-plugins ....................................... SUCCESS [  0.086 s]
[INFO] tez-yarn-timeline-history ......................... SUCCESS [  0.661 s]
[INFO] tez-yarn-timeline-history-with-acls ............... SUCCESS [  0.409 s]
[INFO] tez-mbeans-resource-calculator .................... SUCCESS [  0.282 s]
[INFO] tez-tools ......................................... SUCCESS [  0.079 s]
[INFO] tez-dist .......................................... SUCCESS [ 53.993 s]
[INFO] Tez ............................................... FAILURE [  0.730 s]
[INFO] ------------------------------------------------------------------------
[INFO] BUILD FAILURE
[INFO] ------------------------------------------------------------------------
[INFO] Total time: 02:09 min
[INFO] Finished at: 2015-06-12T16:50:28+00:00
[INFO] Final Memory: 67M/1185M
[INFO] ------------------------------------------------------------------------
[ERROR] Failed to execute goal org.apache.maven.plugins:maven-deploy-plugin:2.8.1:deploy (default-deploy) on project tez-docs: Failed to retrieve remote metadata org.apache.tez:tez:0.7.1-SNAPSHOT/maven-metadata.xml: Could not transfer metadata org.apache.tez:tez:0.7.1-SNAPSHOT/maven-metadata.xml from/to apache.snapshots.https (https://repository.apache.org/content/repositories/snapshots): java.lang.RuntimeException: Could not generate DH keypair: Prime size must be multiple of 64, and can only range from 512 to 1024 (inclusive) -> [Help 1]
[ERROR] 
[ERROR] To see the full stack trace of the errors, re-run Maven with the -e switch.
[ERROR] Re-run Maven using the -X switch to enable full debug logging.
[ERROR] 
[ERROR] For more information about the errors and possible solutions, please read the following articles:
[ERROR] [Help 1] http://cwiki.apache.org/confluence/display/MAVEN/MojoExecutionException
[ERROR] 
[ERROR] After correcting the problems, you can resume the build with the command
[ERROR]   mvn <goals> -rf :tez-docs
Build step 'Execute shell' marked build as failure
Archiving artifacts
Sending artifact delta relative to Tez-Build-branch-0.7 #24
Archived 2 artifacts
Archive block size is 32768
Received 0 blocks and 51832450 bytes
Compression is 0.0%
Took 29 sec

Build failed in Jenkins: Tez-Build-branch-0.7 #27

Posted by Apache Jenkins Server <je...@builds.apache.org>.
See <https://builds.apache.org/job/Tez-Build-branch-0.7/27/changes>

Changes:

[zjffdu] TEZ-1961. Remove misleading exception "No running dag" from AM logs (zjffdu)

------------------------------------------
[...truncated 2637 lines...]
[WARNING] The following patterns were never triggered in this artifact exclusion filter:
o  '*:*:test-jar'

[WARNING] The following patterns were never triggered in this artifact exclusion filter:
o  '*:*:test-jar'

[WARNING] The following patterns were never triggered in this artifact exclusion filter:
o  '*:*:test-jar'

[WARNING] The following patterns were never triggered in this artifact exclusion filter:
o  '*:*:test-jar'

[INFO] Building tar: <https://builds.apache.org/job/Tez-Build-branch-0.7/27/artifact/tez-dist/target/tez-0.7.1-SNAPSHOT-minimal.tar.gz>
[INFO] 
[INFO] --- maven-jar-plugin:2.4:test-jar (default) @ tez-dist ---
[WARNING] JAR will be empty - no content was marked for inclusion!
[INFO] Building jar: <https://builds.apache.org/job/Tez-Build-branch-0.7/ws/tez-dist/target/tez-dist-0.7.1-SNAPSHOT-tests.jar>
[INFO] 
[INFO] --- maven-install-plugin:2.4:install (default-install) @ tez-dist ---
[INFO] Installing <https://builds.apache.org/job/Tez-Build-branch-0.7/ws/tez-dist/pom.xml> to /home/jenkins/.m2/repository/org/apache/tez/tez-dist/0.7.1-SNAPSHOT/tez-dist-0.7.1-SNAPSHOT.pom
[INFO] Installing <https://builds.apache.org/job/Tez-Build-branch-0.7/ws/tez-dist/target/tez-dist-0.7.1-SNAPSHOT-tests.jar> to /home/jenkins/.m2/repository/org/apache/tez/tez-dist/0.7.1-SNAPSHOT/tez-dist-0.7.1-SNAPSHOT-tests.jar
[INFO] 
[INFO] --- maven-deploy-plugin:2.8.1:deploy (default-deploy) @ tez-dist ---
[INFO] Skipping artifact deployment
[INFO] 
[INFO] --- buildnumber-maven-plugin:1.1:create (default) @ tez-dist ---
[INFO] Checking for local modifications: skipped.
[INFO] Updating project files from SCM: skipped.
[INFO] Executing: /bin/sh -c cd <https://builds.apache.org/job/Tez-Build-branch-0.7/ws/tez-dist> && git rev-parse --verify HEAD
[INFO] Working directory: <https://builds.apache.org/job/Tez-Build-branch-0.7/ws/tez-dist>
[INFO] Storing buildNumber: 8389411f2ea7883b754b91f6653ce629e7cfc111 at timestamp: 1434041406257
[INFO] Executing: /bin/sh -c cd <https://builds.apache.org/job/Tez-Build-branch-0.7/ws/tez-dist> && git rev-parse --verify HEAD
[INFO] Working directory: <https://builds.apache.org/job/Tez-Build-branch-0.7/ws/tez-dist>
[INFO] Storing buildScmBranch: UNKNOWN
[INFO] 
[INFO] --- build-helper-maven-plugin:1.8:maven-version (maven-version) @ tez-dist ---
[INFO] 
[INFO] --- maven-assembly-plugin:2.4:single (package-tez) @ tez-dist ---
[INFO] Reading assembly descriptor: src/main/assembly/tez-dist.xml
[WARNING] NOTE: Currently, inclusion of module dependencies may produce unpredictable results if a version conflict occurs.
[WARNING] The following patterns were never triggered in this artifact exclusion filter:
o  '*:*:test-jar'

[WARNING] The following patterns were never triggered in this artifact exclusion filter:
o  '*:*:test-jar'

[WARNING] The following patterns were never triggered in this artifact exclusion filter:
o  '*:*:test-jar'

[WARNING] The following patterns were never triggered in this artifact exclusion filter:
o  '*:*:test-jar'

[WARNING] The following patterns were never triggered in this artifact exclusion filter:
o  '*:*:test-jar'

[WARNING] The following patterns were never triggered in this artifact exclusion filter:
o  '*:*:test-jar'

[WARNING] The following patterns were never triggered in this artifact exclusion filter:
o  '*:*:test-jar'

[WARNING] The following patterns were never triggered in this artifact exclusion filter:
o  '*:*:test-jar'

[WARNING] The following patterns were never triggered in this artifact exclusion filter:
o  '*:*:test-jar'

[WARNING] The following patterns were never triggered in this artifact exclusion filter:
o  '*:*:test-jar'

[WARNING] The following patterns were never triggered in this artifact exclusion filter:
o  '*:*:test-jar'

[WARNING] The following patterns were never triggered in this artifact exclusion filter:
o  '*:*:test-jar'

[INFO] Copying files to <https://builds.apache.org/job/Tez-Build-branch-0.7/ws/tez-dist/target/tez-0.7.1-SNAPSHOT>
[WARNING] NOTE: Currently, inclusion of module dependencies may produce unpredictable results if a version conflict occurs.
[WARNING] The following patterns were never triggered in this artifact exclusion filter:
o  '*:*:test-jar'

[WARNING] The following patterns were never triggered in this artifact exclusion filter:
o  '*:*:test-jar'

[WARNING] The following patterns were never triggered in this artifact exclusion filter:
o  '*:*:test-jar'

[WARNING] The following patterns were never triggered in this artifact exclusion filter:
o  '*:*:test-jar'

[WARNING] The following patterns were never triggered in this artifact exclusion filter:
o  '*:*:test-jar'

[WARNING] The following patterns were never triggered in this artifact exclusion filter:
o  '*:*:test-jar'

[WARNING] The following patterns were never triggered in this artifact exclusion filter:
o  '*:*:test-jar'

[WARNING] The following patterns were never triggered in this artifact exclusion filter:
o  '*:*:test-jar'

[WARNING] The following patterns were never triggered in this artifact exclusion filter:
o  '*:*:test-jar'

[WARNING] The following patterns were never triggered in this artifact exclusion filter:
o  '*:*:test-jar'

[WARNING] The following patterns were never triggered in this artifact exclusion filter:
o  '*:*:test-jar'

[WARNING] The following patterns were never triggered in this artifact exclusion filter:
o  '*:*:test-jar'

[INFO] Building tar: <https://builds.apache.org/job/Tez-Build-branch-0.7/27/artifact/tez-dist/target/tez-0.7.1-SNAPSHOT.tar.gz>
[INFO] 
[INFO] --- maven-assembly-plugin:2.4:single (package-tez-minimal) @ tez-dist ---
[INFO] Reading assembly descriptor: src/main/assembly/tez-dist-minimal.xml
[WARNING] NOTE: Currently, inclusion of module dependencies may produce unpredictable results if a version conflict occurs.
[WARNING] The following patterns were never triggered in this artifact exclusion filter:
o  '*:*:test-jar'

[WARNING] The following patterns were never triggered in this artifact exclusion filter:
o  '*:*:test-jar'

[WARNING] The following patterns were never triggered in this artifact exclusion filter:
o  '*:*:test-jar'

[WARNING] The following patterns were never triggered in this artifact exclusion filter:
o  '*:*:test-jar'

[WARNING] The following patterns were never triggered in this artifact exclusion filter:
o  '*:*:test-jar'

[WARNING] The following patterns were never triggered in this artifact exclusion filter:
o  '*:*:test-jar'

[WARNING] The following patterns were never triggered in this artifact exclusion filter:
o  '*:*:test-jar'

[WARNING] The following patterns were never triggered in this artifact exclusion filter:
o  '*:*:test-jar'

[WARNING] The following patterns were never triggered in this artifact exclusion filter:
o  '*:*:test-jar'

[WARNING] The following patterns were never triggered in this artifact exclusion filter:
o  '*:*:test-jar'

[WARNING] The following patterns were never triggered in this artifact exclusion filter:
o  '*:*:test-jar'

[WARNING] The following patterns were never triggered in this artifact exclusion filter:
o  '*:*:test-jar'

[INFO] Building tar: <https://builds.apache.org/job/Tez-Build-branch-0.7/27/artifact/tez-dist/target/tez-0.7.1-SNAPSHOT-minimal.tar.gz>
[INFO] 
[INFO] --- maven-jar-plugin:2.4:test-jar (default) @ tez-dist ---
[WARNING] JAR will be empty - no content was marked for inclusion!
[INFO]                                                                         
[INFO] ------------------------------------------------------------------------
[INFO] Building Tez 0.7.1-SNAPSHOT
[INFO] ------------------------------------------------------------------------
[INFO] 
[INFO] --- maven-clean-plugin:2.5:clean (default-clean) @ tez-docs ---
[INFO] Deleting <https://builds.apache.org/job/Tez-Build-branch-0.7/ws/docs/target>
[INFO] 
[INFO] --- buildnumber-maven-plugin:1.1:create (default) @ tez-docs ---
[INFO] Checking for local modifications: skipped.
[INFO] Updating project files from SCM: skipped.
[INFO] Executing: /bin/sh -c cd <https://builds.apache.org/job/Tez-Build-branch-0.7/ws/docs> && git rev-parse --verify HEAD
[INFO] Working directory: <https://builds.apache.org/job/Tez-Build-branch-0.7/ws/docs>
[INFO] Storing buildNumber: 8389411f2ea7883b754b91f6653ce629e7cfc111 at timestamp: 1434041431483
[INFO] Executing: /bin/sh -c cd <https://builds.apache.org/job/Tez-Build-branch-0.7/ws/docs> && git rev-parse --verify HEAD
[INFO] Working directory: <https://builds.apache.org/job/Tez-Build-branch-0.7/ws/docs>
[INFO] Storing buildScmBranch: UNKNOWN
[INFO] 
[INFO] --- build-helper-maven-plugin:1.8:maven-version (maven-version) @ tez-docs ---
[INFO] 
[INFO] --- buildnumber-maven-plugin:1.1:create (default) @ tez-docs ---
[INFO] Checking for local modifications: skipped.
[INFO] Updating project files from SCM: skipped.
[INFO] Executing: /bin/sh -c cd <https://builds.apache.org/job/Tez-Build-branch-0.7/ws/docs> && git rev-parse --verify HEAD
[INFO] Working directory: <https://builds.apache.org/job/Tez-Build-branch-0.7/ws/docs>
[INFO] Storing buildNumber: 8389411f2ea7883b754b91f6653ce629e7cfc111 at timestamp: 1434041431494
[INFO] Executing: /bin/sh -c cd <https://builds.apache.org/job/Tez-Build-branch-0.7/ws/docs> && git rev-parse --verify HEAD
[INFO] Working directory: <https://builds.apache.org/job/Tez-Build-branch-0.7/ws/docs>
[INFO] Storing buildScmBranch: UNKNOWN
[INFO] 
[INFO] --- build-helper-maven-plugin:1.8:maven-version (maven-version) @ tez-docs ---
[INFO] 
[INFO] --- maven-jar-plugin:2.4:test-jar (default) @ tez-docs ---
[WARNING] JAR will be empty - no content was marked for inclusion!
[INFO] Building jar: <https://builds.apache.org/job/Tez-Build-branch-0.7/ws/docs/target/tez-docs-0.7.1-SNAPSHOT-tests.jar>
[INFO] 
[INFO] --- maven-install-plugin:2.4:install (default-install) @ tez-docs ---
[INFO] Installing <https://builds.apache.org/job/Tez-Build-branch-0.7/ws/docs/pom.xml> to /home/jenkins/.m2/repository/org/apache/tez/tez-docs/0.7.1-SNAPSHOT/tez-docs-0.7.1-SNAPSHOT.pom
[INFO] Installing <https://builds.apache.org/job/Tez-Build-branch-0.7/ws/docs/target/tez-docs-0.7.1-SNAPSHOT-tests.jar> to /home/jenkins/.m2/repository/org/apache/tez/tez-docs/0.7.1-SNAPSHOT/tez-docs-0.7.1-SNAPSHOT-tests.jar
[INFO] 
[INFO] --- maven-deploy-plugin:2.8.1:deploy (default-deploy) @ tez-docs ---
[INFO] Skipping artifact deployment
Downloading: https://repository.apache.org/content/repositories/snapshots/org/apache/tez/tez/0.7.1-SNAPSHOT/maven-metadata.xml

[WARNING] Could not transfer metadata org.apache.tez:tez:0.7.1-SNAPSHOT/maven-metadata.xml from/to apache.snapshots.https (https://repository.apache.org/content/repositories/snapshots): java.lang.RuntimeException: Could not generate DH keypair
[INFO] ------------------------------------------------------------------------
[INFO] Reactor Summary:
[INFO] 
[INFO] tez ............................................... SUCCESS [  1.276 s]
[INFO] tez-api ........................................... SUCCESS [ 17.533 s]
[INFO] tez-common ........................................ SUCCESS [  0.649 s]
[INFO] tez-runtime-internals ............................. SUCCESS [  1.357 s]
[INFO] tez-runtime-library ............................... SUCCESS [  3.421 s]
[INFO] tez-mapreduce ..................................... SUCCESS [  1.730 s]
[INFO] tez-examples ...................................... SUCCESS [  0.395 s]
[INFO] tez-dag ........................................... SUCCESS [  8.825 s]
[INFO] tez-tests ......................................... SUCCESS [  0.907 s]
[INFO] tez-ui ............................................ SUCCESS [ 42.091 s]
[INFO] tez-plugins ....................................... SUCCESS [  0.104 s]
[INFO] tez-yarn-timeline-history ......................... SUCCESS [  0.767 s]
[INFO] tez-yarn-timeline-history-with-acls ............... SUCCESS [  0.448 s]
[INFO] tez-mbeans-resource-calculator .................... SUCCESS [  0.317 s]
[INFO] tez-tools ......................................... SUCCESS [  0.081 s]
[INFO] tez-dist .......................................... SUCCESS [ 53.752 s]
[INFO] Tez ............................................... FAILURE [  0.880 s]
[INFO] ------------------------------------------------------------------------
[INFO] BUILD FAILURE
[INFO] ------------------------------------------------------------------------
[INFO] Total time: 02:15 min
[INFO] Finished at: 2015-06-11T16:50:32+00:00
[INFO] Final Memory: 69M/1184M
[INFO] ------------------------------------------------------------------------
[ERROR] Failed to execute goal org.apache.maven.plugins:maven-deploy-plugin:2.8.1:deploy (default-deploy) on project tez-docs: Failed to retrieve remote metadata org.apache.tez:tez:0.7.1-SNAPSHOT/maven-metadata.xml: Could not transfer metadata org.apache.tez:tez:0.7.1-SNAPSHOT/maven-metadata.xml from/to apache.snapshots.https (https://repository.apache.org/content/repositories/snapshots): java.lang.RuntimeException: Could not generate DH keypair: Prime size must be multiple of 64, and can only range from 512 to 1024 (inclusive) -> [Help 1]
[ERROR] 
[ERROR] To see the full stack trace of the errors, re-run Maven with the -e switch.
[ERROR] Re-run Maven using the -X switch to enable full debug logging.
[ERROR] 
[ERROR] For more information about the errors and possible solutions, please read the following articles:
[ERROR] [Help 1] http://cwiki.apache.org/confluence/display/MAVEN/MojoExecutionException
[ERROR] 
[ERROR] After correcting the problems, you can resume the build with the command
[ERROR]   mvn <goals> -rf :tez-docs
Build step 'Execute shell' marked build as failure
Archiving artifacts
Sending artifact delta relative to Tez-Build-branch-0.7 #24
Archived 2 artifacts
Archive block size is 32768
Received 0 blocks and 51832000 bytes
Compression is 0.0%
Took 1 min 18 sec

Re: Build failed in Jenkins: Tez-Build-branch-0.7 #26

Posted by "Jianfeng (Jeff) Zhang" <jz...@hortonworks.com>.
The issue happens in branch-0.6 building too.  Maybe because master is
using jdk 1.7 and branch-0.6 & branch-0.7 is still using 1.6


Best Regard,
Jeff Zhang





On 6/11/15, 8:31 AM, "Jianfeng (Jeff) Zhang" <jz...@hortonworks.com>
wrote:

>-> Failed to execute goal
>org.apache.maven.plugins:maven-deploy-plugin:2.8.1:deploy (default-deploy)
>on project tez-docs: Failed to retrieve remote metadata
>org.apache.tez:tez:0.7.1-SNAPSHOT/maven-metadata.xml: Could not transfer
>metadata org.apache.tez:tez:0.7.1-SNAPSHOT/maven-metadata.xml from/to
>apache.snapshots.https
>(https://repository.apache.org/content/repositories/snapshots):
>java.lang.RuntimeException: Could not generate DH keypair: Prime size must
>be multiple of 64, and can only range from 512 to 1024 (inclusive) ->
>[Help 1]
>
>Probably due to a JDK bug, Trying to look for a solution for it.
>
>http://bugs.java.com/bugdatabase/view_bug.do?bug_id=6521495
>
>
>
>
>Best Regard,
>Jeff Zhang
>
>
>
>
>
>On 6/11/15, 7:49 AM, "Apache Jenkins Server" <je...@builds.apache.org>
>wrote:
>
>>See <https://builds.apache.org/job/Tez-Build-branch-0.7/26/changes>
>>
>>Changes:
>>
>>[zjffdu] Update version to 0.7.1-SNPASHOT (zjffdu)
>>
>>------------------------------------------
>>[...truncated 2634 lines...]
>>[WARNING] The following patterns were never triggered in this artifact
>>exclusion filter:
>>o  '*:*:test-jar'
>>
>>[WARNING] The following patterns were never triggered in this artifact
>>exclusion filter:
>>o  '*:*:test-jar'
>>
>>[WARNING] The following patterns were never triggered in this artifact
>>exclusion filter:
>>o  '*:*:test-jar'
>>
>>[WARNING] The following patterns were never triggered in this artifact
>>exclusion filter:
>>o  '*:*:test-jar'
>>
>>[INFO] Building tar:
>><https://builds.apache.org/job/Tez-Build-branch-0.7/26/artifact/tez-dist/
>>t
>>arget/tez-0.7.1-SNAPSHOT-minimal.tar.gz>
>>[INFO] 
>>[INFO] --- maven-jar-plugin:2.4:test-jar (default) @ tez-dist ---
>>[WARNING] JAR will be empty - no content was marked for inclusion!
>>[INFO] Building jar:
>><https://builds.apache.org/job/Tez-Build-branch-0.7/ws/tez-dist/target/te
>>z
>>-dist-0.7.1-SNAPSHOT-tests.jar>
>>[INFO] 
>>[INFO] --- maven-install-plugin:2.4:install (default-install) @ tez-dist
>>---
>>[INFO] Installing
>><https://builds.apache.org/job/Tez-Build-branch-0.7/ws/tez-dist/pom.xml>
>>to 
>>/home/jenkins/.m2/repository/org/apache/tez/tez-dist/0.7.1-SNAPSHOT/tez-d
>>i
>>st-0.7.1-SNAPSHOT.pom
>>[INFO] Installing
>><https://builds.apache.org/job/Tez-Build-branch-0.7/ws/tez-dist/target/te
>>z
>>-dist-0.7.1-SNAPSHOT-tests.jar> to
>>/home/jenkins/.m2/repository/org/apache/tez/tez-dist/0.7.1-SNAPSHOT/tez-d
>>i
>>st-0.7.1-SNAPSHOT-tests.jar
>>[INFO] 
>>[INFO] --- maven-deploy-plugin:2.8.1:deploy (default-deploy) @ tez-dist
>>---
>>[INFO] Skipping artifact deployment
>>[INFO] 
>>[INFO] --- buildnumber-maven-plugin:1.1:create (default) @ tez-dist ---
>>[INFO] Checking for local modifications: skipped.
>>[INFO] Updating project files from SCM: skipped.
>>[INFO] Executing: /bin/sh -c cd
>><https://builds.apache.org/job/Tez-Build-branch-0.7/ws/tez-dist> && git
>>rev-parse --verify HEAD
>>[INFO] Working directory:
>><https://builds.apache.org/job/Tez-Build-branch-0.7/ws/tez-dist>
>>[INFO] Storing buildNumber: a5a6794306d13341daf07314d62bebed5be2217a at
>>timestamp: 1433980132938
>>[INFO] Executing: /bin/sh -c cd
>><https://builds.apache.org/job/Tez-Build-branch-0.7/ws/tez-dist> && git
>>rev-parse --verify HEAD
>>[INFO] Working directory:
>><https://builds.apache.org/job/Tez-Build-branch-0.7/ws/tez-dist>
>>[INFO] Storing buildScmBranch: UNKNOWN
>>[INFO] 
>>[INFO] --- build-helper-maven-plugin:1.8:maven-version (maven-version) @
>>tez-dist ---
>>[INFO] 
>>[INFO] --- maven-assembly-plugin:2.4:single (package-tez) @ tez-dist ---
>>[INFO] Reading assembly descriptor: src/main/assembly/tez-dist.xml
>>[WARNING] NOTE: Currently, inclusion of module dependencies may produce
>>unpredictable results if a version conflict occurs.
>>[WARNING] The following patterns were never triggered in this artifact
>>exclusion filter:
>>o  '*:*:test-jar'
>>
>>[WARNING] The following patterns were never triggered in this artifact
>>exclusion filter:
>>o  '*:*:test-jar'
>>
>>[WARNING] The following patterns were never triggered in this artifact
>>exclusion filter:
>>o  '*:*:test-jar'
>>
>>[WARNING] The following patterns were never triggered in this artifact
>>exclusion filter:
>>o  '*:*:test-jar'
>>
>>[WARNING] The following patterns were never triggered in this artifact
>>exclusion filter:
>>o  '*:*:test-jar'
>>
>>[WARNING] The following patterns were never triggered in this artifact
>>exclusion filter:
>>o  '*:*:test-jar'
>>
>>[WARNING] The following patterns were never triggered in this artifact
>>exclusion filter:
>>o  '*:*:test-jar'
>>
>>[WARNING] The following patterns were never triggered in this artifact
>>exclusion filter:
>>o  '*:*:test-jar'
>>
>>[WARNING] The following patterns were never triggered in this artifact
>>exclusion filter:
>>o  '*:*:test-jar'
>>
>>[WARNING] The following patterns were never triggered in this artifact
>>exclusion filter:
>>o  '*:*:test-jar'
>>
>>[WARNING] The following patterns were never triggered in this artifact
>>exclusion filter:
>>o  '*:*:test-jar'
>>
>>[WARNING] The following patterns were never triggered in this artifact
>>exclusion filter:
>>o  '*:*:test-jar'
>>
>>[INFO] Copying files to
>><https://builds.apache.org/job/Tez-Build-branch-0.7/ws/tez-dist/target/te
>>z
>>-0.7.1-SNAPSHOT>
>>[WARNING] NOTE: Currently, inclusion of module dependencies may produce
>>unpredictable results if a version conflict occurs.
>>[WARNING] The following patterns were never triggered in this artifact
>>exclusion filter:
>>o  '*:*:test-jar'
>>
>>[WARNING] The following patterns were never triggered in this artifact
>>exclusion filter:
>>o  '*:*:test-jar'
>>
>>[WARNING] The following patterns were never triggered in this artifact
>>exclusion filter:
>>o  '*:*:test-jar'
>>
>>[WARNING] The following patterns were never triggered in this artifact
>>exclusion filter:
>>o  '*:*:test-jar'
>>
>>[WARNING] The following patterns were never triggered in this artifact
>>exclusion filter:
>>o  '*:*:test-jar'
>>
>>[WARNING] The following patterns were never triggered in this artifact
>>exclusion filter:
>>o  '*:*:test-jar'
>>
>>[WARNING] The following patterns were never triggered in this artifact
>>exclusion filter:
>>o  '*:*:test-jar'
>>
>>[WARNING] The following patterns were never triggered in this artifact
>>exclusion filter:
>>o  '*:*:test-jar'
>>
>>[WARNING] The following patterns were never triggered in this artifact
>>exclusion filter:
>>o  '*:*:test-jar'
>>
>>[WARNING] The following patterns were never triggered in this artifact
>>exclusion filter:
>>o  '*:*:test-jar'
>>
>>[WARNING] The following patterns were never triggered in this artifact
>>exclusion filter:
>>o  '*:*:test-jar'
>>
>>[WARNING] The following patterns were never triggered in this artifact
>>exclusion filter:
>>o  '*:*:test-jar'
>>
>>[INFO] Building tar:
>><https://builds.apache.org/job/Tez-Build-branch-0.7/26/artifact/tez-dist/
>>t
>>arget/tez-0.7.1-SNAPSHOT.tar.gz>
>>[INFO] 
>>[INFO] --- maven-assembly-plugin:2.4:single (package-tez-minimal) @
>>tez-dist ---
>>[INFO] Reading assembly descriptor:
>>src/main/assembly/tez-dist-minimal.xml
>>[WARNING] NOTE: Currently, inclusion of module dependencies may produce
>>unpredictable results if a version conflict occurs.
>>[WARNING] The following patterns were never triggered in this artifact
>>exclusion filter:
>>o  '*:*:test-jar'
>>
>>[WARNING] The following patterns were never triggered in this artifact
>>exclusion filter:
>>o  '*:*:test-jar'
>>
>>[WARNING] The following patterns were never triggered in this artifact
>>exclusion filter:
>>o  '*:*:test-jar'
>>
>>[WARNING] The following patterns were never triggered in this artifact
>>exclusion filter:
>>o  '*:*:test-jar'
>>
>>[WARNING] The following patterns were never triggered in this artifact
>>exclusion filter:
>>o  '*:*:test-jar'
>>
>>[WARNING] The following patterns were never triggered in this artifact
>>exclusion filter:
>>o  '*:*:test-jar'
>>
>>[WARNING] The following patterns were never triggered in this artifact
>>exclusion filter:
>>o  '*:*:test-jar'
>>
>>[WARNING] The following patterns were never triggered in this artifact
>>exclusion filter:
>>o  '*:*:test-jar'
>>
>>[WARNING] The following patterns were never triggered in this artifact
>>exclusion filter:
>>o  '*:*:test-jar'
>>
>>[WARNING] The following patterns were never triggered in this artifact
>>exclusion filter:
>>o  '*:*:test-jar'
>>
>>[WARNING] The following patterns were never triggered in this artifact
>>exclusion filter:
>>o  '*:*:test-jar'
>>
>>[WARNING] The following patterns were never triggered in this artifact
>>exclusion filter:
>>o  '*:*:test-jar'
>>
>>[INFO] Building tar:
>><https://builds.apache.org/job/Tez-Build-branch-0.7/26/artifact/tez-dist/
>>t
>>arget/tez-0.7.1-SNAPSHOT-minimal.tar.gz>
>>[INFO] 
>>[INFO] --- maven-jar-plugin:2.4:test-jar (default) @ tez-dist ---
>>[WARNING] JAR will be empty - no content was marked for inclusion!
>>[INFO]           
>>     
>>[INFO] 
>>------------------------------------------------------------------------
>>[INFO] Building Tez 0.7.1-SNAPSHOT
>>[INFO] 
>>------------------------------------------------------------------------
>>[INFO] 
>>[INFO] --- maven-clean-plugin:2.5:clean (default-clean) @ tez-docs ---
>>[INFO] Deleting 
>><https://builds.apache.org/job/Tez-Build-branch-0.7/ws/docs/target>
>>[INFO] 
>>[INFO] --- buildnumber-maven-plugin:1.1:create (default) @ tez-docs ---
>>[INFO] Checking for local modifications: skipped.
>>[INFO] Updating project files from SCM: skipped.
>>[INFO] Executing: /bin/sh -c cd
>><https://builds.apache.org/job/Tez-Build-branch-0.7/ws/docs> && git
>>rev-parse --verify HEAD
>>[INFO] Working directory:
>><https://builds.apache.org/job/Tez-Build-branch-0.7/ws/docs>
>>[INFO] Storing buildNumber: a5a6794306d13341daf07314d62bebed5be2217a at
>>timestamp: 1433980156627
>>[INFO] Executing: /bin/sh -c cd
>><https://builds.apache.org/job/Tez-Build-branch-0.7/ws/docs> && git
>>rev-parse --verify HEAD
>>[INFO] Working directory:
>><https://builds.apache.org/job/Tez-Build-branch-0.7/ws/docs>
>>[INFO] Storing buildScmBranch: UNKNOWN
>>[INFO] 
>>[INFO] --- build-helper-maven-plugin:1.8:maven-version (maven-version) @
>>tez-docs ---
>>[INFO] 
>>[INFO] --- buildnumber-maven-plugin:1.1:create (default) @ tez-docs ---
>>[INFO] Checking for local modifications: skipped.
>>[INFO] Updating project files from SCM: skipped.
>>[INFO] Executing: /bin/sh -c cd
>><https://builds.apache.org/job/Tez-Build-branch-0.7/ws/docs> && git
>>rev-parse --verify HEAD
>>[INFO] Working directory:
>><https://builds.apache.org/job/Tez-Build-branch-0.7/ws/docs>
>>[INFO] Storing buildNumber: a5a6794306d13341daf07314d62bebed5be2217a at
>>timestamp: 1433980156637
>>[INFO] Executing: /bin/sh -c cd
>><https://builds.apache.org/job/Tez-Build-branch-0.7/ws/docs> && git
>>rev-parse --verify HEAD
>>[INFO] Working directory:
>><https://builds.apache.org/job/Tez-Build-branch-0.7/ws/docs>
>>[INFO] Storing buildScmBranch: UNKNOWN
>>[INFO] 
>>[INFO] --- build-helper-maven-plugin:1.8:maven-version (maven-version) @
>>tez-docs ---
>>[INFO] 
>>[INFO] --- maven-jar-plugin:2.4:test-jar (default) @ tez-docs ---
>>[WARNING] JAR will be empty - no content was marked for inclusion!
>>[INFO] Building jar:
>><https://builds.apache.org/job/Tez-Build-branch-0.7/ws/docs/target/tez-do
>>c
>>s-0.7.1-SNAPSHOT-tests.jar>
>>[INFO] 
>>[INFO] --- maven-install-plugin:2.4:install (default-install) @ tez-docs
>>---
>>[INFO] Installing
>><https://builds.apache.org/job/Tez-Build-branch-0.7/ws/docs/pom.xml> to
>>/home/jenkins/.m2/repository/org/apache/tez/tez-docs/0.7.1-SNAPSHOT/tez-d
>>o
>>cs-0.7.1-SNAPSHOT.pom
>>[INFO] Installing
>><https://builds.apache.org/job/Tez-Build-branch-0.7/ws/docs/target/tez-do
>>c
>>s-0.7.1-SNAPSHOT-tests.jar> to
>>/home/jenkins/.m2/repository/org/apache/tez/tez-docs/0.7.1-SNAPSHOT/tez-d
>>o
>>cs-0.7.1-SNAPSHOT-tests.jar
>>[INFO] 
>>[INFO] --- maven-deploy-plugin:2.8.1:deploy (default-deploy) @ tez-docs
>>---
>>[INFO] Skipping artifact deployment
>>Downloading: 
>>https://repository.apache.org/content/repositories/snapshots/org/apache/t
>>e
>>z/tez/0.7.1-SNAPSHOT/maven-metadata.xml
>>
>>[WARNING] Could not transfer metadata
>>org.apache.tez:tez:0.7.1-SNAPSHOT/maven-metadata.xml from/to
>>apache.snapshots.https
>>(https://repository.apache.org/content/repositories/snapshots):
>>java.lang.RuntimeException: Could not generate DH keypair
>>[INFO] 
>>------------------------------------------------------------------------
>>[INFO] Reactor Summary:
>>[INFO] 
>>[INFO] tez ............................................... SUCCESS [
>>1.184 s]
>>[INFO] tez-api ........................................... SUCCESS [
>>16.121 s]
>>[INFO] tez-common ........................................ SUCCESS [
>>0.640 s]
>>[INFO] tez-runtime-internals ............................. SUCCESS [
>>0.861 s]
>>[INFO] tez-runtime-library ............................... SUCCESS [
>>3.379 s]
>>[INFO] tez-mapreduce ..................................... SUCCESS [
>>1.668 s]
>>[INFO] tez-examples ...................................... SUCCESS [
>>0.368 s]
>>[INFO] tez-dag ........................................... SUCCESS [
>>8.154 s]
>>[INFO] tez-tests ......................................... SUCCESS [
>>0.811 s]
>>[INFO] tez-ui ............................................ SUCCESS [
>>39.648 s]
>>[INFO] tez-plugins ....................................... SUCCESS [
>>0.081 s]
>>[INFO] tez-yarn-timeline-history ......................... SUCCESS [
>>0.701 s]
>>[INFO] tez-yarn-timeline-history-with-acls ............... SUCCESS [
>>0.534 s]
>>[INFO] tez-mbeans-resource-calculator .................... SUCCESS [
>>0.279 s]
>>[INFO] tez-tools ......................................... SUCCESS [
>>0.069 s]
>>[INFO] tez-dist .......................................... SUCCESS [
>>50.895 s]
>>[INFO] Tez ............................................... FAILURE [
>>0.776 s]
>>[INFO] 
>>------------------------------------------------------------------------
>>[INFO] BUILD FAILURE
>>[INFO] 
>>------------------------------------------------------------------------
>>[INFO] Total time: 02:06 min
>>[INFO] Finished at: 2015-06-10T23:49:17+00:00
>>[INFO] Final Memory: 68M/1185M
>>[INFO] 
>>------------------------------------------------------------------------
>>[ERROR] Failed to execute goal
>>org.apache.maven.plugins:maven-deploy-plugin:2.8.1:deploy
>>(default-deploy) on project tez-docs: Failed to retrieve remote metadata
>>org.apache.tez:tez:0.7.1-SNAPSHOT/maven-metadata.xml: Could not transfer
>>metadata org.apache.tez:tez:0.7.1-SNAPSHOT/maven-metadata.xml from/to
>>apache.snapshots.https
>>(https://repository.apache.org/content/repositories/snapshots):
>>java.lang.RuntimeException: Could not generate DH keypair: Prime size
>>must be multiple of 64, and can only range from 512 to 1024 (inclusive)
>>-> [Help 1]
>>[ERROR] 
>>[ERROR] To see the full stack trace of the errors, re-run Maven with the
>>-e switch.
>>[ERROR] Re-run Maven using the -X switch to enable full debug logging.
>>[ERROR] 
>>[ERROR] For more information about the errors and possible solutions,
>>please read the following articles:
>>[ERROR] [Help 1] 
>>http://cwiki.apache.org/confluence/display/MAVEN/MojoExecutionException
>>[ERROR] 
>>[ERROR] After correcting the problems, you can resume the build with the
>>command
>>[ERROR]   mvn <goals> -rf :tez-docs
>>Build step 'Execute shell' marked build as failure
>>Archiving artifacts
>>Sending artifact delta relative to Tez-Build-branch-0.7 #24
>>Archived 2 artifacts
>>Archive block size is 32768
>>Received 0 blocks and 51831123 bytes
>>Compression is 0.0%
>>Took 30 sec
>>
>
>


Re: Build failed in Jenkins: Tez-Build-branch-0.7 #26

Posted by "Jianfeng (Jeff) Zhang" <jz...@hortonworks.com>.
-> Failed to execute goal
org.apache.maven.plugins:maven-deploy-plugin:2.8.1:deploy (default-deploy)
on project tez-docs: Failed to retrieve remote metadata
org.apache.tez:tez:0.7.1-SNAPSHOT/maven-metadata.xml: Could not transfer
metadata org.apache.tez:tez:0.7.1-SNAPSHOT/maven-metadata.xml from/to
apache.snapshots.https
(https://repository.apache.org/content/repositories/snapshots):
java.lang.RuntimeException: Could not generate DH keypair: Prime size must
be multiple of 64, and can only range from 512 to 1024 (inclusive) ->
[Help 1]

Probably due to a JDK bug, Trying to look for a solution for it.

http://bugs.java.com/bugdatabase/view_bug.do?bug_id=6521495




Best Regard,
Jeff Zhang





On 6/11/15, 7:49 AM, "Apache Jenkins Server" <je...@builds.apache.org>
wrote:

>See <https://builds.apache.org/job/Tez-Build-branch-0.7/26/changes>
>
>Changes:
>
>[zjffdu] Update version to 0.7.1-SNPASHOT (zjffdu)
>
>------------------------------------------
>[...truncated 2634 lines...]
>[WARNING] The following patterns were never triggered in this artifact
>exclusion filter:
>o  '*:*:test-jar'
>
>[WARNING] The following patterns were never triggered in this artifact
>exclusion filter:
>o  '*:*:test-jar'
>
>[WARNING] The following patterns were never triggered in this artifact
>exclusion filter:
>o  '*:*:test-jar'
>
>[WARNING] The following patterns were never triggered in this artifact
>exclusion filter:
>o  '*:*:test-jar'
>
>[INFO] Building tar:
><https://builds.apache.org/job/Tez-Build-branch-0.7/26/artifact/tez-dist/t
>arget/tez-0.7.1-SNAPSHOT-minimal.tar.gz>
>[INFO] 
>[INFO] --- maven-jar-plugin:2.4:test-jar (default) @ tez-dist ---
>[WARNING] JAR will be empty - no content was marked for inclusion!
>[INFO] Building jar:
><https://builds.apache.org/job/Tez-Build-branch-0.7/ws/tez-dist/target/tez
>-dist-0.7.1-SNAPSHOT-tests.jar>
>[INFO] 
>[INFO] --- maven-install-plugin:2.4:install (default-install) @ tez-dist
>---
>[INFO] Installing 
><https://builds.apache.org/job/Tez-Build-branch-0.7/ws/tez-dist/pom.xml>
>to 
>/home/jenkins/.m2/repository/org/apache/tez/tez-dist/0.7.1-SNAPSHOT/tez-di
>st-0.7.1-SNAPSHOT.pom
>[INFO] Installing 
><https://builds.apache.org/job/Tez-Build-branch-0.7/ws/tez-dist/target/tez
>-dist-0.7.1-SNAPSHOT-tests.jar> to
>/home/jenkins/.m2/repository/org/apache/tez/tez-dist/0.7.1-SNAPSHOT/tez-di
>st-0.7.1-SNAPSHOT-tests.jar
>[INFO] 
>[INFO] --- maven-deploy-plugin:2.8.1:deploy (default-deploy) @ tez-dist
>---
>[INFO] Skipping artifact deployment
>[INFO] 
>[INFO] --- buildnumber-maven-plugin:1.1:create (default) @ tez-dist ---
>[INFO] Checking for local modifications: skipped.
>[INFO] Updating project files from SCM: skipped.
>[INFO] Executing: /bin/sh -c cd
><https://builds.apache.org/job/Tez-Build-branch-0.7/ws/tez-dist> && git
>rev-parse --verify HEAD
>[INFO] Working directory:
><https://builds.apache.org/job/Tez-Build-branch-0.7/ws/tez-dist>
>[INFO] Storing buildNumber: a5a6794306d13341daf07314d62bebed5be2217a at
>timestamp: 1433980132938
>[INFO] Executing: /bin/sh -c cd
><https://builds.apache.org/job/Tez-Build-branch-0.7/ws/tez-dist> && git
>rev-parse --verify HEAD
>[INFO] Working directory:
><https://builds.apache.org/job/Tez-Build-branch-0.7/ws/tez-dist>
>[INFO] Storing buildScmBranch: UNKNOWN
>[INFO] 
>[INFO] --- build-helper-maven-plugin:1.8:maven-version (maven-version) @
>tez-dist ---
>[INFO] 
>[INFO] --- maven-assembly-plugin:2.4:single (package-tez) @ tez-dist ---
>[INFO] Reading assembly descriptor: src/main/assembly/tez-dist.xml
>[WARNING] NOTE: Currently, inclusion of module dependencies may produce
>unpredictable results if a version conflict occurs.
>[WARNING] The following patterns were never triggered in this artifact
>exclusion filter:
>o  '*:*:test-jar'
>
>[WARNING] The following patterns were never triggered in this artifact
>exclusion filter:
>o  '*:*:test-jar'
>
>[WARNING] The following patterns were never triggered in this artifact
>exclusion filter:
>o  '*:*:test-jar'
>
>[WARNING] The following patterns were never triggered in this artifact
>exclusion filter:
>o  '*:*:test-jar'
>
>[WARNING] The following patterns were never triggered in this artifact
>exclusion filter:
>o  '*:*:test-jar'
>
>[WARNING] The following patterns were never triggered in this artifact
>exclusion filter:
>o  '*:*:test-jar'
>
>[WARNING] The following patterns were never triggered in this artifact
>exclusion filter:
>o  '*:*:test-jar'
>
>[WARNING] The following patterns were never triggered in this artifact
>exclusion filter:
>o  '*:*:test-jar'
>
>[WARNING] The following patterns were never triggered in this artifact
>exclusion filter:
>o  '*:*:test-jar'
>
>[WARNING] The following patterns were never triggered in this artifact
>exclusion filter:
>o  '*:*:test-jar'
>
>[WARNING] The following patterns were never triggered in this artifact
>exclusion filter:
>o  '*:*:test-jar'
>
>[WARNING] The following patterns were never triggered in this artifact
>exclusion filter:
>o  '*:*:test-jar'
>
>[INFO] Copying files to
><https://builds.apache.org/job/Tez-Build-branch-0.7/ws/tez-dist/target/tez
>-0.7.1-SNAPSHOT>
>[WARNING] NOTE: Currently, inclusion of module dependencies may produce
>unpredictable results if a version conflict occurs.
>[WARNING] The following patterns were never triggered in this artifact
>exclusion filter:
>o  '*:*:test-jar'
>
>[WARNING] The following patterns were never triggered in this artifact
>exclusion filter:
>o  '*:*:test-jar'
>
>[WARNING] The following patterns were never triggered in this artifact
>exclusion filter:
>o  '*:*:test-jar'
>
>[WARNING] The following patterns were never triggered in this artifact
>exclusion filter:
>o  '*:*:test-jar'
>
>[WARNING] The following patterns were never triggered in this artifact
>exclusion filter:
>o  '*:*:test-jar'
>
>[WARNING] The following patterns were never triggered in this artifact
>exclusion filter:
>o  '*:*:test-jar'
>
>[WARNING] The following patterns were never triggered in this artifact
>exclusion filter:
>o  '*:*:test-jar'
>
>[WARNING] The following patterns were never triggered in this artifact
>exclusion filter:
>o  '*:*:test-jar'
>
>[WARNING] The following patterns were never triggered in this artifact
>exclusion filter:
>o  '*:*:test-jar'
>
>[WARNING] The following patterns were never triggered in this artifact
>exclusion filter:
>o  '*:*:test-jar'
>
>[WARNING] The following patterns were never triggered in this artifact
>exclusion filter:
>o  '*:*:test-jar'
>
>[WARNING] The following patterns were never triggered in this artifact
>exclusion filter:
>o  '*:*:test-jar'
>
>[INFO] Building tar:
><https://builds.apache.org/job/Tez-Build-branch-0.7/26/artifact/tez-dist/t
>arget/tez-0.7.1-SNAPSHOT.tar.gz>
>[INFO] 
>[INFO] --- maven-assembly-plugin:2.4:single (package-tez-minimal) @
>tez-dist ---
>[INFO] Reading assembly descriptor: src/main/assembly/tez-dist-minimal.xml
>[WARNING] NOTE: Currently, inclusion of module dependencies may produce
>unpredictable results if a version conflict occurs.
>[WARNING] The following patterns were never triggered in this artifact
>exclusion filter:
>o  '*:*:test-jar'
>
>[WARNING] The following patterns were never triggered in this artifact
>exclusion filter:
>o  '*:*:test-jar'
>
>[WARNING] The following patterns were never triggered in this artifact
>exclusion filter:
>o  '*:*:test-jar'
>
>[WARNING] The following patterns were never triggered in this artifact
>exclusion filter:
>o  '*:*:test-jar'
>
>[WARNING] The following patterns were never triggered in this artifact
>exclusion filter:
>o  '*:*:test-jar'
>
>[WARNING] The following patterns were never triggered in this artifact
>exclusion filter:
>o  '*:*:test-jar'
>
>[WARNING] The following patterns were never triggered in this artifact
>exclusion filter:
>o  '*:*:test-jar'
>
>[WARNING] The following patterns were never triggered in this artifact
>exclusion filter:
>o  '*:*:test-jar'
>
>[WARNING] The following patterns were never triggered in this artifact
>exclusion filter:
>o  '*:*:test-jar'
>
>[WARNING] The following patterns were never triggered in this artifact
>exclusion filter:
>o  '*:*:test-jar'
>
>[WARNING] The following patterns were never triggered in this artifact
>exclusion filter:
>o  '*:*:test-jar'
>
>[WARNING] The following patterns were never triggered in this artifact
>exclusion filter:
>o  '*:*:test-jar'
>
>[INFO] Building tar:
><https://builds.apache.org/job/Tez-Build-branch-0.7/26/artifact/tez-dist/t
>arget/tez-0.7.1-SNAPSHOT-minimal.tar.gz>
>[INFO] 
>[INFO] --- maven-jar-plugin:2.4:test-jar (default) @ tez-dist ---
>[WARNING] JAR will be empty - no content was marked for inclusion!
>[INFO]            
>     
>[INFO] 
>------------------------------------------------------------------------
>[INFO] Building Tez 0.7.1-SNAPSHOT
>[INFO] 
>------------------------------------------------------------------------
>[INFO] 
>[INFO] --- maven-clean-plugin:2.5:clean (default-clean) @ tez-docs ---
>[INFO] Deleting 
><https://builds.apache.org/job/Tez-Build-branch-0.7/ws/docs/target>
>[INFO] 
>[INFO] --- buildnumber-maven-plugin:1.1:create (default) @ tez-docs ---
>[INFO] Checking for local modifications: skipped.
>[INFO] Updating project files from SCM: skipped.
>[INFO] Executing: /bin/sh -c cd
><https://builds.apache.org/job/Tez-Build-branch-0.7/ws/docs> && git
>rev-parse --verify HEAD
>[INFO] Working directory:
><https://builds.apache.org/job/Tez-Build-branch-0.7/ws/docs>
>[INFO] Storing buildNumber: a5a6794306d13341daf07314d62bebed5be2217a at
>timestamp: 1433980156627
>[INFO] Executing: /bin/sh -c cd
><https://builds.apache.org/job/Tez-Build-branch-0.7/ws/docs> && git
>rev-parse --verify HEAD
>[INFO] Working directory:
><https://builds.apache.org/job/Tez-Build-branch-0.7/ws/docs>
>[INFO] Storing buildScmBranch: UNKNOWN
>[INFO] 
>[INFO] --- build-helper-maven-plugin:1.8:maven-version (maven-version) @
>tez-docs ---
>[INFO] 
>[INFO] --- buildnumber-maven-plugin:1.1:create (default) @ tez-docs ---
>[INFO] Checking for local modifications: skipped.
>[INFO] Updating project files from SCM: skipped.
>[INFO] Executing: /bin/sh -c cd
><https://builds.apache.org/job/Tez-Build-branch-0.7/ws/docs> && git
>rev-parse --verify HEAD
>[INFO] Working directory:
><https://builds.apache.org/job/Tez-Build-branch-0.7/ws/docs>
>[INFO] Storing buildNumber: a5a6794306d13341daf07314d62bebed5be2217a at
>timestamp: 1433980156637
>[INFO] Executing: /bin/sh -c cd
><https://builds.apache.org/job/Tez-Build-branch-0.7/ws/docs> && git
>rev-parse --verify HEAD
>[INFO] Working directory:
><https://builds.apache.org/job/Tez-Build-branch-0.7/ws/docs>
>[INFO] Storing buildScmBranch: UNKNOWN
>[INFO] 
>[INFO] --- build-helper-maven-plugin:1.8:maven-version (maven-version) @
>tez-docs ---
>[INFO] 
>[INFO] --- maven-jar-plugin:2.4:test-jar (default) @ tez-docs ---
>[WARNING] JAR will be empty - no content was marked for inclusion!
>[INFO] Building jar:
><https://builds.apache.org/job/Tez-Build-branch-0.7/ws/docs/target/tez-doc
>s-0.7.1-SNAPSHOT-tests.jar>
>[INFO] 
>[INFO] --- maven-install-plugin:2.4:install (default-install) @ tez-docs
>---
>[INFO] Installing 
><https://builds.apache.org/job/Tez-Build-branch-0.7/ws/docs/pom.xml> to
>/home/jenkins/.m2/repository/org/apache/tez/tez-docs/0.7.1-SNAPSHOT/tez-do
>cs-0.7.1-SNAPSHOT.pom
>[INFO] Installing 
><https://builds.apache.org/job/Tez-Build-branch-0.7/ws/docs/target/tez-doc
>s-0.7.1-SNAPSHOT-tests.jar> to
>/home/jenkins/.m2/repository/org/apache/tez/tez-docs/0.7.1-SNAPSHOT/tez-do
>cs-0.7.1-SNAPSHOT-tests.jar
>[INFO] 
>[INFO] --- maven-deploy-plugin:2.8.1:deploy (default-deploy) @ tez-docs
>---
>[INFO] Skipping artifact deployment
>Downloading: 
>https://repository.apache.org/content/repositories/snapshots/org/apache/te
>z/tez/0.7.1-SNAPSHOT/maven-metadata.xml
>
>[WARNING] Could not transfer metadata
>org.apache.tez:tez:0.7.1-SNAPSHOT/maven-metadata.xml from/to
>apache.snapshots.https
>(https://repository.apache.org/content/repositories/snapshots):
>java.lang.RuntimeException: Could not generate DH keypair
>[INFO] 
>------------------------------------------------------------------------
>[INFO] Reactor Summary:
>[INFO] 
>[INFO] tez ............................................... SUCCESS [
>1.184 s]
>[INFO] tez-api ........................................... SUCCESS [
>16.121 s]
>[INFO] tez-common ........................................ SUCCESS [
>0.640 s]
>[INFO] tez-runtime-internals ............................. SUCCESS [
>0.861 s]
>[INFO] tez-runtime-library ............................... SUCCESS [
>3.379 s]
>[INFO] tez-mapreduce ..................................... SUCCESS [
>1.668 s]
>[INFO] tez-examples ...................................... SUCCESS [
>0.368 s]
>[INFO] tez-dag ........................................... SUCCESS [
>8.154 s]
>[INFO] tez-tests ......................................... SUCCESS [
>0.811 s]
>[INFO] tez-ui ............................................ SUCCESS [
>39.648 s]
>[INFO] tez-plugins ....................................... SUCCESS [
>0.081 s]
>[INFO] tez-yarn-timeline-history ......................... SUCCESS [
>0.701 s]
>[INFO] tez-yarn-timeline-history-with-acls ............... SUCCESS [
>0.534 s]
>[INFO] tez-mbeans-resource-calculator .................... SUCCESS [
>0.279 s]
>[INFO] tez-tools ......................................... SUCCESS [
>0.069 s]
>[INFO] tez-dist .......................................... SUCCESS [
>50.895 s]
>[INFO] Tez ............................................... FAILURE [
>0.776 s]
>[INFO] 
>------------------------------------------------------------------------
>[INFO] BUILD FAILURE
>[INFO] 
>------------------------------------------------------------------------
>[INFO] Total time: 02:06 min
>[INFO] Finished at: 2015-06-10T23:49:17+00:00
>[INFO] Final Memory: 68M/1185M
>[INFO] 
>------------------------------------------------------------------------
>[ERROR] Failed to execute goal
>org.apache.maven.plugins:maven-deploy-plugin:2.8.1:deploy
>(default-deploy) on project tez-docs: Failed to retrieve remote metadata
>org.apache.tez:tez:0.7.1-SNAPSHOT/maven-metadata.xml: Could not transfer
>metadata org.apache.tez:tez:0.7.1-SNAPSHOT/maven-metadata.xml from/to
>apache.snapshots.https
>(https://repository.apache.org/content/repositories/snapshots):
>java.lang.RuntimeException: Could not generate DH keypair: Prime size
>must be multiple of 64, and can only range from 512 to 1024 (inclusive)
>-> [Help 1]
>[ERROR] 
>[ERROR] To see the full stack trace of the errors, re-run Maven with the
>-e switch.
>[ERROR] Re-run Maven using the -X switch to enable full debug logging.
>[ERROR] 
>[ERROR] For more information about the errors and possible solutions,
>please read the following articles:
>[ERROR] [Help 1] 
>http://cwiki.apache.org/confluence/display/MAVEN/MojoExecutionException
>[ERROR] 
>[ERROR] After correcting the problems, you can resume the build with the
>command
>[ERROR]   mvn <goals> -rf :tez-docs
>Build step 'Execute shell' marked build as failure
>Archiving artifacts
>Sending artifact delta relative to Tez-Build-branch-0.7 #24
>Archived 2 artifacts
>Archive block size is 32768
>Received 0 blocks and 51831123 bytes
>Compression is 0.0%
>Took 30 sec
>


Build failed in Jenkins: Tez-Build-branch-0.7 #26

Posted by Apache Jenkins Server <je...@builds.apache.org>.
See <https://builds.apache.org/job/Tez-Build-branch-0.7/26/changes>

Changes:

[zjffdu] Update version to 0.7.1-SNPASHOT (zjffdu)

------------------------------------------
[...truncated 2634 lines...]
[WARNING] The following patterns were never triggered in this artifact exclusion filter:
o  '*:*:test-jar'

[WARNING] The following patterns were never triggered in this artifact exclusion filter:
o  '*:*:test-jar'

[WARNING] The following patterns were never triggered in this artifact exclusion filter:
o  '*:*:test-jar'

[WARNING] The following patterns were never triggered in this artifact exclusion filter:
o  '*:*:test-jar'

[INFO] Building tar: <https://builds.apache.org/job/Tez-Build-branch-0.7/26/artifact/tez-dist/target/tez-0.7.1-SNAPSHOT-minimal.tar.gz>
[INFO] 
[INFO] --- maven-jar-plugin:2.4:test-jar (default) @ tez-dist ---
[WARNING] JAR will be empty - no content was marked for inclusion!
[INFO] Building jar: <https://builds.apache.org/job/Tez-Build-branch-0.7/ws/tez-dist/target/tez-dist-0.7.1-SNAPSHOT-tests.jar>
[INFO] 
[INFO] --- maven-install-plugin:2.4:install (default-install) @ tez-dist ---
[INFO] Installing <https://builds.apache.org/job/Tez-Build-branch-0.7/ws/tez-dist/pom.xml> to /home/jenkins/.m2/repository/org/apache/tez/tez-dist/0.7.1-SNAPSHOT/tez-dist-0.7.1-SNAPSHOT.pom
[INFO] Installing <https://builds.apache.org/job/Tez-Build-branch-0.7/ws/tez-dist/target/tez-dist-0.7.1-SNAPSHOT-tests.jar> to /home/jenkins/.m2/repository/org/apache/tez/tez-dist/0.7.1-SNAPSHOT/tez-dist-0.7.1-SNAPSHOT-tests.jar
[INFO] 
[INFO] --- maven-deploy-plugin:2.8.1:deploy (default-deploy) @ tez-dist ---
[INFO] Skipping artifact deployment
[INFO] 
[INFO] --- buildnumber-maven-plugin:1.1:create (default) @ tez-dist ---
[INFO] Checking for local modifications: skipped.
[INFO] Updating project files from SCM: skipped.
[INFO] Executing: /bin/sh -c cd <https://builds.apache.org/job/Tez-Build-branch-0.7/ws/tez-dist> && git rev-parse --verify HEAD
[INFO] Working directory: <https://builds.apache.org/job/Tez-Build-branch-0.7/ws/tez-dist>
[INFO] Storing buildNumber: a5a6794306d13341daf07314d62bebed5be2217a at timestamp: 1433980132938
[INFO] Executing: /bin/sh -c cd <https://builds.apache.org/job/Tez-Build-branch-0.7/ws/tez-dist> && git rev-parse --verify HEAD
[INFO] Working directory: <https://builds.apache.org/job/Tez-Build-branch-0.7/ws/tez-dist>
[INFO] Storing buildScmBranch: UNKNOWN
[INFO] 
[INFO] --- build-helper-maven-plugin:1.8:maven-version (maven-version) @ tez-dist ---
[INFO] 
[INFO] --- maven-assembly-plugin:2.4:single (package-tez) @ tez-dist ---
[INFO] Reading assembly descriptor: src/main/assembly/tez-dist.xml
[WARNING] NOTE: Currently, inclusion of module dependencies may produce unpredictable results if a version conflict occurs.
[WARNING] The following patterns were never triggered in this artifact exclusion filter:
o  '*:*:test-jar'

[WARNING] The following patterns were never triggered in this artifact exclusion filter:
o  '*:*:test-jar'

[WARNING] The following patterns were never triggered in this artifact exclusion filter:
o  '*:*:test-jar'

[WARNING] The following patterns were never triggered in this artifact exclusion filter:
o  '*:*:test-jar'

[WARNING] The following patterns were never triggered in this artifact exclusion filter:
o  '*:*:test-jar'

[WARNING] The following patterns were never triggered in this artifact exclusion filter:
o  '*:*:test-jar'

[WARNING] The following patterns were never triggered in this artifact exclusion filter:
o  '*:*:test-jar'

[WARNING] The following patterns were never triggered in this artifact exclusion filter:
o  '*:*:test-jar'

[WARNING] The following patterns were never triggered in this artifact exclusion filter:
o  '*:*:test-jar'

[WARNING] The following patterns were never triggered in this artifact exclusion filter:
o  '*:*:test-jar'

[WARNING] The following patterns were never triggered in this artifact exclusion filter:
o  '*:*:test-jar'

[WARNING] The following patterns were never triggered in this artifact exclusion filter:
o  '*:*:test-jar'

[INFO] Copying files to <https://builds.apache.org/job/Tez-Build-branch-0.7/ws/tez-dist/target/tez-0.7.1-SNAPSHOT>
[WARNING] NOTE: Currently, inclusion of module dependencies may produce unpredictable results if a version conflict occurs.
[WARNING] The following patterns were never triggered in this artifact exclusion filter:
o  '*:*:test-jar'

[WARNING] The following patterns were never triggered in this artifact exclusion filter:
o  '*:*:test-jar'

[WARNING] The following patterns were never triggered in this artifact exclusion filter:
o  '*:*:test-jar'

[WARNING] The following patterns were never triggered in this artifact exclusion filter:
o  '*:*:test-jar'

[WARNING] The following patterns were never triggered in this artifact exclusion filter:
o  '*:*:test-jar'

[WARNING] The following patterns were never triggered in this artifact exclusion filter:
o  '*:*:test-jar'

[WARNING] The following patterns were never triggered in this artifact exclusion filter:
o  '*:*:test-jar'

[WARNING] The following patterns were never triggered in this artifact exclusion filter:
o  '*:*:test-jar'

[WARNING] The following patterns were never triggered in this artifact exclusion filter:
o  '*:*:test-jar'

[WARNING] The following patterns were never triggered in this artifact exclusion filter:
o  '*:*:test-jar'

[WARNING] The following patterns were never triggered in this artifact exclusion filter:
o  '*:*:test-jar'

[WARNING] The following patterns were never triggered in this artifact exclusion filter:
o  '*:*:test-jar'

[INFO] Building tar: <https://builds.apache.org/job/Tez-Build-branch-0.7/26/artifact/tez-dist/target/tez-0.7.1-SNAPSHOT.tar.gz>
[INFO] 
[INFO] --- maven-assembly-plugin:2.4:single (package-tez-minimal) @ tez-dist ---
[INFO] Reading assembly descriptor: src/main/assembly/tez-dist-minimal.xml
[WARNING] NOTE: Currently, inclusion of module dependencies may produce unpredictable results if a version conflict occurs.
[WARNING] The following patterns were never triggered in this artifact exclusion filter:
o  '*:*:test-jar'

[WARNING] The following patterns were never triggered in this artifact exclusion filter:
o  '*:*:test-jar'

[WARNING] The following patterns were never triggered in this artifact exclusion filter:
o  '*:*:test-jar'

[WARNING] The following patterns were never triggered in this artifact exclusion filter:
o  '*:*:test-jar'

[WARNING] The following patterns were never triggered in this artifact exclusion filter:
o  '*:*:test-jar'

[WARNING] The following patterns were never triggered in this artifact exclusion filter:
o  '*:*:test-jar'

[WARNING] The following patterns were never triggered in this artifact exclusion filter:
o  '*:*:test-jar'

[WARNING] The following patterns were never triggered in this artifact exclusion filter:
o  '*:*:test-jar'

[WARNING] The following patterns were never triggered in this artifact exclusion filter:
o  '*:*:test-jar'

[WARNING] The following patterns were never triggered in this artifact exclusion filter:
o  '*:*:test-jar'

[WARNING] The following patterns were never triggered in this artifact exclusion filter:
o  '*:*:test-jar'

[WARNING] The following patterns were never triggered in this artifact exclusion filter:
o  '*:*:test-jar'

[INFO] Building tar: <https://builds.apache.org/job/Tez-Build-branch-0.7/26/artifact/tez-dist/target/tez-0.7.1-SNAPSHOT-minimal.tar.gz>
[INFO] 
[INFO] --- maven-jar-plugin:2.4:test-jar (default) @ tez-dist ---
[WARNING] JAR will be empty - no content was marked for inclusion!
[INFO]                                                                         
[INFO] ------------------------------------------------------------------------
[INFO] Building Tez 0.7.1-SNAPSHOT
[INFO] ------------------------------------------------------------------------
[INFO] 
[INFO] --- maven-clean-plugin:2.5:clean (default-clean) @ tez-docs ---
[INFO] Deleting <https://builds.apache.org/job/Tez-Build-branch-0.7/ws/docs/target>
[INFO] 
[INFO] --- buildnumber-maven-plugin:1.1:create (default) @ tez-docs ---
[INFO] Checking for local modifications: skipped.
[INFO] Updating project files from SCM: skipped.
[INFO] Executing: /bin/sh -c cd <https://builds.apache.org/job/Tez-Build-branch-0.7/ws/docs> && git rev-parse --verify HEAD
[INFO] Working directory: <https://builds.apache.org/job/Tez-Build-branch-0.7/ws/docs>
[INFO] Storing buildNumber: a5a6794306d13341daf07314d62bebed5be2217a at timestamp: 1433980156627
[INFO] Executing: /bin/sh -c cd <https://builds.apache.org/job/Tez-Build-branch-0.7/ws/docs> && git rev-parse --verify HEAD
[INFO] Working directory: <https://builds.apache.org/job/Tez-Build-branch-0.7/ws/docs>
[INFO] Storing buildScmBranch: UNKNOWN
[INFO] 
[INFO] --- build-helper-maven-plugin:1.8:maven-version (maven-version) @ tez-docs ---
[INFO] 
[INFO] --- buildnumber-maven-plugin:1.1:create (default) @ tez-docs ---
[INFO] Checking for local modifications: skipped.
[INFO] Updating project files from SCM: skipped.
[INFO] Executing: /bin/sh -c cd <https://builds.apache.org/job/Tez-Build-branch-0.7/ws/docs> && git rev-parse --verify HEAD
[INFO] Working directory: <https://builds.apache.org/job/Tez-Build-branch-0.7/ws/docs>
[INFO] Storing buildNumber: a5a6794306d13341daf07314d62bebed5be2217a at timestamp: 1433980156637
[INFO] Executing: /bin/sh -c cd <https://builds.apache.org/job/Tez-Build-branch-0.7/ws/docs> && git rev-parse --verify HEAD
[INFO] Working directory: <https://builds.apache.org/job/Tez-Build-branch-0.7/ws/docs>
[INFO] Storing buildScmBranch: UNKNOWN
[INFO] 
[INFO] --- build-helper-maven-plugin:1.8:maven-version (maven-version) @ tez-docs ---
[INFO] 
[INFO] --- maven-jar-plugin:2.4:test-jar (default) @ tez-docs ---
[WARNING] JAR will be empty - no content was marked for inclusion!
[INFO] Building jar: <https://builds.apache.org/job/Tez-Build-branch-0.7/ws/docs/target/tez-docs-0.7.1-SNAPSHOT-tests.jar>
[INFO] 
[INFO] --- maven-install-plugin:2.4:install (default-install) @ tez-docs ---
[INFO] Installing <https://builds.apache.org/job/Tez-Build-branch-0.7/ws/docs/pom.xml> to /home/jenkins/.m2/repository/org/apache/tez/tez-docs/0.7.1-SNAPSHOT/tez-docs-0.7.1-SNAPSHOT.pom
[INFO] Installing <https://builds.apache.org/job/Tez-Build-branch-0.7/ws/docs/target/tez-docs-0.7.1-SNAPSHOT-tests.jar> to /home/jenkins/.m2/repository/org/apache/tez/tez-docs/0.7.1-SNAPSHOT/tez-docs-0.7.1-SNAPSHOT-tests.jar
[INFO] 
[INFO] --- maven-deploy-plugin:2.8.1:deploy (default-deploy) @ tez-docs ---
[INFO] Skipping artifact deployment
Downloading: https://repository.apache.org/content/repositories/snapshots/org/apache/tez/tez/0.7.1-SNAPSHOT/maven-metadata.xml

[WARNING] Could not transfer metadata org.apache.tez:tez:0.7.1-SNAPSHOT/maven-metadata.xml from/to apache.snapshots.https (https://repository.apache.org/content/repositories/snapshots): java.lang.RuntimeException: Could not generate DH keypair
[INFO] ------------------------------------------------------------------------
[INFO] Reactor Summary:
[INFO] 
[INFO] tez ............................................... SUCCESS [  1.184 s]
[INFO] tez-api ........................................... SUCCESS [ 16.121 s]
[INFO] tez-common ........................................ SUCCESS [  0.640 s]
[INFO] tez-runtime-internals ............................. SUCCESS [  0.861 s]
[INFO] tez-runtime-library ............................... SUCCESS [  3.379 s]
[INFO] tez-mapreduce ..................................... SUCCESS [  1.668 s]
[INFO] tez-examples ...................................... SUCCESS [  0.368 s]
[INFO] tez-dag ........................................... SUCCESS [  8.154 s]
[INFO] tez-tests ......................................... SUCCESS [  0.811 s]
[INFO] tez-ui ............................................ SUCCESS [ 39.648 s]
[INFO] tez-plugins ....................................... SUCCESS [  0.081 s]
[INFO] tez-yarn-timeline-history ......................... SUCCESS [  0.701 s]
[INFO] tez-yarn-timeline-history-with-acls ............... SUCCESS [  0.534 s]
[INFO] tez-mbeans-resource-calculator .................... SUCCESS [  0.279 s]
[INFO] tez-tools ......................................... SUCCESS [  0.069 s]
[INFO] tez-dist .......................................... SUCCESS [ 50.895 s]
[INFO] Tez ............................................... FAILURE [  0.776 s]
[INFO] ------------------------------------------------------------------------
[INFO] BUILD FAILURE
[INFO] ------------------------------------------------------------------------
[INFO] Total time: 02:06 min
[INFO] Finished at: 2015-06-10T23:49:17+00:00
[INFO] Final Memory: 68M/1185M
[INFO] ------------------------------------------------------------------------
[ERROR] Failed to execute goal org.apache.maven.plugins:maven-deploy-plugin:2.8.1:deploy (default-deploy) on project tez-docs: Failed to retrieve remote metadata org.apache.tez:tez:0.7.1-SNAPSHOT/maven-metadata.xml: Could not transfer metadata org.apache.tez:tez:0.7.1-SNAPSHOT/maven-metadata.xml from/to apache.snapshots.https (https://repository.apache.org/content/repositories/snapshots): java.lang.RuntimeException: Could not generate DH keypair: Prime size must be multiple of 64, and can only range from 512 to 1024 (inclusive) -> [Help 1]
[ERROR] 
[ERROR] To see the full stack trace of the errors, re-run Maven with the -e switch.
[ERROR] Re-run Maven using the -X switch to enable full debug logging.
[ERROR] 
[ERROR] For more information about the errors and possible solutions, please read the following articles:
[ERROR] [Help 1] http://cwiki.apache.org/confluence/display/MAVEN/MojoExecutionException
[ERROR] 
[ERROR] After correcting the problems, you can resume the build with the command
[ERROR]   mvn <goals> -rf :tez-docs
Build step 'Execute shell' marked build as failure
Archiving artifacts
Sending artifact delta relative to Tez-Build-branch-0.7 #24
Archived 2 artifacts
Archive block size is 32768
Received 0 blocks and 51831123 bytes
Compression is 0.0%
Took 30 sec