You are viewing a plain text version of this content. The canonical link for it is here.
Posted to dev@airavata.apache.org by Apache Jenkins Server <je...@builds.apache.org> on 2011/10/14 02:27:33 UTC

Build failed in Jenkins: Airavata #105

See <https://builds.apache.org/job/Airavata/105/changes>

Changes:

[patanachai] Change file name

[patanachai] Change file name

[patanachai] Add echo.sh for tutorial

------------------------------------------
[...truncated 1732 lines...]
[INFO]                                                                         
[INFO] ------------------------------------------------------------------------
[INFO] Building Messenger Commons 0.0.1-SNAPSHOT
[INFO] ------------------------------------------------------------------------
[INFO] 
[INFO] --- maven-clean-plugin:2.4.1:clean (default-clean) @ airavata-messenger-commons ---
[INFO] [INFO] Using 'UTF-8' encoding to copy filtered resources.
[INFO] skip non existing resourceDirectory <https://builds.apache.org/job/Airavata/ws/modules/ws-messenger/commons/src/main/resources>

[INFO] --- maven-resources-plugin:2.4.3:resources (default-resources) @ airavata-messenger-commons ---
[INFO] [INFO] Compiling 10 source files to <https://builds.apache.org/job/Airavata/ws/modules/ws-messenger/commons/target/classes>

[INFO] --- maven-compiler-plugin:2.0.2:compile (default-compile) @ airavata-messenger-commons ---
[INFO] [INFO] Using 'UTF-8' encoding to copy filtered resources.
[INFO] skip non existing resourceDirectory <https://builds.apache.org/job/Airavata/ws/modules/ws-messenger/commons/src/test/resources>

[INFO] --- maven-resources-plugin:2.4.3:testResources (default-testResources) @ airavata-messenger-commons ---
[INFO] [INFO] Nothing to compile - all classes are up to date

[INFO] --- maven-compiler-plugin:2.0.2:testCompile (default-testCompile) @ airavata-messenger-commons ---
[INFO] [INFO] Tests are skipped.

[INFO] --- maven-surefire-plugin:2.7.1:test (default-test) @ airavata-messenger-commons ---
[INFO] 
[INFO] --- maven-jar-plugin:2.3.1:jar (default-jar) @ airavata-messenger-commons ---
[INFO] Building jar: <https://builds.apache.org/job/Airavata/ws/modules/ws-messenger/commons/target/airavata-messenger-commons-0.0.1-SNAPSHOT.jar>
[INFO] [INFO] Installing <https://builds.apache.org/job/Airavata/ws/modules/ws-messenger/commons/target/airavata-messenger-commons-0.0.1-SNAPSHOT.jar> to /home/jenkins/.m2/repository/airavata/airavata-messenger-commons/0.0.1-SNAPSHOT/airavata-messenger-commons-0.0.1-SNAPSHOT.jar
[INFO] Installing <https://builds.apache.org/job/Airavata/ws/modules/ws-messenger/commons/pom.xml> to /home/jenkins/.m2/repository/airavata/airavata-messenger-commons/0.0.1-SNAPSHOT/airavata-messenger-commons-0.0.1-SNAPSHOT.pom

[INFO] --- maven-install-plugin:2.3.1:install (default-install) @ airavata-messenger-commons ---
[JENKINS] Archiving <https://builds.apache.org/job/Airavata/ws/modules/ws-messenger/commons/pom.xml> to /home/hudson/hudson/jobs/Airavata/modules/airavata$airavata-messenger-commons/builds/2011-10-14_00-26-55/archive/airavata/airavata-messenger-commons/0.0.1-SNAPSHOT/airavata-messenger-commons-0.0.1-SNAPSHOT.pom
[JENKINS] Archiving <https://builds.apache.org/job/Airavata/ws/modules/ws-messenger/commons/target/airavata-messenger-commons-0.0.1-SNAPSHOT.jar> to /home/hudson/hudson/jobs/Airavata/modules/airavata$airavata-messenger-commons/builds/2011-10-14_00-26-55/archive/airavata/airavata-messenger-commons/0.0.1-SNAPSHOT/airavata-messenger-commons-0.0.1-SNAPSHOT.jar
[INFO]                                                                         
[INFO] ------------------------------------------------------------------------
[INFO] Building Messenger Client 0.0.1-SNAPSHOT
[INFO] ------------------------------------------------------------------------
[INFO] 
[INFO] --- maven-clean-plugin:2.4.1:clean (default-clean) @ airavata-messenger-client ---
[INFO] [INFO] Using 'UTF-8' encoding to copy filtered resources.
[INFO] skip non existing resourceDirectory <https://builds.apache.org/job/Airavata/ws/modules/ws-messenger/client/src/main/resources>

[INFO] --- maven-resources-plugin:2.4.3:resources (default-resources) @ airavata-messenger-client ---
[INFO] [INFO] Compiling 33 source files to <https://builds.apache.org/job/Airavata/ws/modules/ws-messenger/client/target/classes>

[INFO] --- maven-compiler-plugin:2.0.2:compile (default-compile) @ airavata-messenger-client ---
[INFO] [INFO] Using 'UTF-8' encoding to copy filtered resources.
[INFO] skip non existing resourceDirectory <https://builds.apache.org/job/Airavata/ws/modules/ws-messenger/client/src/test/resources>

[INFO] --- maven-resources-plugin:2.4.3:testResources (default-testResources) @ airavata-messenger-client ---
[INFO] [INFO] Compiling 4 source files to <https://builds.apache.org/job/Airavata/ws/modules/ws-messenger/client/target/test-classes>

[INFO] --- maven-compiler-plugin:2.0.2:testCompile (default-testCompile) @ airavata-messenger-client ---
[INFO] [INFO] Tests are skipped.

[INFO] --- maven-surefire-plugin:2.7.1:test (default-test) @ airavata-messenger-client ---
[INFO] 
[INFO] --- maven-jar-plugin:2.3.1:jar (default-jar) @ airavata-messenger-client ---
[INFO] Building jar: <https://builds.apache.org/job/Airavata/ws/modules/ws-messenger/client/target/airavata-messenger-client-0.0.1-SNAPSHOT.jar>
[INFO] [INFO] Installing <https://builds.apache.org/job/Airavata/ws/modules/ws-messenger/client/target/airavata-messenger-client-0.0.1-SNAPSHOT.jar> to /home/jenkins/.m2/repository/airavata/airavata-messenger-client/0.0.1-SNAPSHOT/airavata-messenger-client-0.0.1-SNAPSHOT.jar
[INFO] Installing <https://builds.apache.org/job/Airavata/ws/modules/ws-messenger/client/pom.xml> to /home/jenkins/.m2/repository/airavata/airavata-messenger-client/0.0.1-SNAPSHOT/airavata-messenger-client-0.0.1-SNAPSHOT.pom

[INFO] --- maven-install-plugin:2.3.1:install (default-install) @ airavata-messenger-client ---
[JENKINS] Archiving <https://builds.apache.org/job/Airavata/ws/modules/ws-messenger/client/pom.xml> to /home/hudson/hudson/jobs/Airavata/modules/airavata$airavata-messenger-client/builds/2011-10-14_00-26-55/archive/airavata/airavata-messenger-client/0.0.1-SNAPSHOT/airavata-messenger-client-0.0.1-SNAPSHOT.pom
[JENKINS] Archiving <https://builds.apache.org/job/Airavata/ws/modules/ws-messenger/client/target/airavata-messenger-client-0.0.1-SNAPSHOT.jar> to /home/hudson/hudson/jobs/Airavata/modules/airavata$airavata-messenger-client/builds/2011-10-14_00-26-55/archive/airavata/airavata-messenger-client/0.0.1-SNAPSHOT/airavata-messenger-client-0.0.1-SNAPSHOT.jar
[INFO]                                                                         
[INFO] ------------------------------------------------------------------------
[INFO] Building Airavata Workflow Tracking 0.0.1-SNAPSHOT
[INFO] ------------------------------------------------------------------------
[INFO] 
[INFO] --- maven-clean-plugin:2.4.1:clean (default-clean) @ airavata-workflowtracking ---
[INFO] 
[INFO] --- build-helper-maven-plugin:1.5:add-source (add-source) @ airavata-workflowtracking ---
[INFO] Source directory: <https://builds.apache.org/job/Airavata/ws/modules/commons/workflow-tracking/target/generated-sources/xmlbeans> added.
[INFO] 
[INFO] --- xmlbeans-maven-plugin:2.3.3:xmlbeans (generateBindings) @ airavata-workflowtracking ---
[INFO] [INFO] Using 'UTF-8' encoding to copy filtered resources.

[INFO] Copying 2 resources
[INFO] --- maven-resources-plugin:2.4.3:resources (default-resources) @ airavata-workflowtracking ---
[INFO] Copying 468 resources
[INFO] [INFO] Compiling 59 source files to <https://builds.apache.org/job/Airavata/ws/modules/commons/workflow-tracking/target/classes>

[INFO] --- maven-compiler-plugin:2.0.2:compile (default-compile) @ airavata-workflowtracking ---
[INFO] [INFO] Using 'UTF-8' encoding to copy filtered resources.
[INFO] Copying 1 resource

[INFO] --- maven-resources-plugin:2.4.3:testResources (default-testResources) @ airavata-workflowtracking ---
[INFO] [INFO] Compiling 19 source files to <https://builds.apache.org/job/Airavata/ws/modules/commons/workflow-tracking/target/test-classes>

[INFO] --- maven-compiler-plugin:2.0.2:testCompile (default-testCompile) @ airavata-workflowtracking ---
[INFO] [INFO] Tests are skipped.

[INFO] --- maven-surefire-plugin:2.7.1:test (default-test) @ airavata-workflowtracking ---
[INFO] 
[INFO] --- maven-jar-plugin:2.3.1:jar (default-jar) @ airavata-workflowtracking ---
[INFO] Building jar: <https://builds.apache.org/job/Airavata/ws/modules/commons/workflow-tracking/target/airavata-workflowtracking-0.0.1-SNAPSHOT.jar>
[INFO] [INFO] Installing <https://builds.apache.org/job/Airavata/ws/modules/commons/workflow-tracking/target/airavata-workflowtracking-0.0.1-SNAPSHOT.jar> to /home/jenkins/.m2/repository/airavata/airavata-workflowtracking/0.0.1-SNAPSHOT/airavata-workflowtracking-0.0.1-SNAPSHOT.jar

[INFO] --- maven-install-plugin:2.3.1:install (default-install) @ airavata-workflowtracking ---
[INFO] Installing <https://builds.apache.org/job/Airavata/ws/modules/commons/workflow-tracking/pom.xml> to /home/jenkins/.m2/repository/airavata/airavata-workflowtracking/0.0.1-SNAPSHOT/airavata-workflowtracking-0.0.1-SNAPSHOT.pom
[JENKINS] Archiving <https://builds.apache.org/job/Airavata/ws/modules/commons/workflow-tracking/pom.xml> to /home/hudson/hudson/jobs/Airavata/modules/airavata$airavata-workflowtracking/builds/2011-10-14_00-26-55/archive/airavata/airavata-workflowtracking/0.0.1-SNAPSHOT/airavata-workflowtracking-0.0.1-SNAPSHOT.pom
[JENKINS] Archiving <https://builds.apache.org/job/Airavata/ws/modules/commons/workflow-tracking/target/airavata-workflowtracking-0.0.1-SNAPSHOT.jar> to /home/hudson/hudson/jobs/Airavata/modules/airavata$airavata-workflowtracking/builds/2011-10-14_00-26-55/archive/airavata/airavata-workflowtracking/0.0.1-SNAPSHOT/airavata-workflowtracking-0.0.1-SNAPSHOT.jar
[INFO]                                                                         
[INFO] ------------------------------------------------------------------------
[INFO] Building GFac-Core 0.0.1-SNAPSHOT
[INFO] ------------------------------------------------------------------------
Downloading: http://community.ucs.indiana.edu:9090/archiva/repository/ogce.m2.all/cog-4_1_6_rc2/puretls/cog-4_1_6/puretls-cog-4_1_6.pom
Downloading: http://people.apache.org/repo/m2-snapshot-repository/cog-4_1_6_rc2/puretls/cog-4_1_6/puretls-cog-4_1_6.pom
Downloading: http://mirrors.ibiblio.org/pub/mirrors/maven2/cog-4_1_6_rc2/puretls/cog-4_1_6/puretls-cog-4_1_6.pom
Downloading: http://download.java.net/maven/2/cog-4_1_6_rc2/puretls/cog-4_1_6/puretls-cog-4_1_6.pom
Downloading: http://people.apache.org/~lahiru/maven-repo/cog-4_1_6_rc2/puretls/cog-4_1_6/puretls-cog-4_1_6.pom
Downloading: http://maven.ow2.org/maven2/cog-4_1_6_rc2/puretls/cog-4_1_6/puretls-cog-4_1_6.pom
Downloading: http://repo1.maven.org/maven2/cog-4_1_6_rc2/puretls/cog-4_1_6/puretls-cog-4_1_6.pom
Downloading: http://community.ucs.indiana.edu:9090/archiva/repository/ogce.m2.all/cog-4_1_6_rc2/cryptix32/cog-4_1_6/cryptix32-cog-4_1_6.pom
Downloading: http://people.apache.org/repo/m2-snapshot-repository/cog-4_1_6_rc2/cryptix32/cog-4_1_6/cryptix32-cog-4_1_6.pom
Downloading: http://mirrors.ibiblio.org/pub/mirrors/maven2/cog-4_1_6_rc2/cryptix32/cog-4_1_6/cryptix32-cog-4_1_6.pom
Downloading: http://download.java.net/maven/2/cog-4_1_6_rc2/cryptix32/cog-4_1_6/cryptix32-cog-4_1_6.pom
Downloading: http://people.apache.org/~lahiru/maven-repo/cog-4_1_6_rc2/cryptix32/cog-4_1_6/cryptix32-cog-4_1_6.pom
Downloading: http://maven.ow2.org/maven2/cog-4_1_6_rc2/cryptix32/cog-4_1_6/cryptix32-cog-4_1_6.pom
Downloading: http://repo1.maven.org/maven2/cog-4_1_6_rc2/cryptix32/cog-4_1_6/cryptix32-cog-4_1_6.pom
Downloading: http://community.ucs.indiana.edu:9090/archiva/repository/ogce.m2.all/cog-4_1_6_rc2/cryptix-asn1/cog-4_1_6/cryptix-asn1-cog-4_1_6.pom
Downloading: http://people.apache.org/repo/m2-snapshot-repository/cog-4_1_6_rc2/cryptix-asn1/cog-4_1_6/cryptix-asn1-cog-4_1_6.pom
Downloading: http://mirrors.ibiblio.org/pub/mirrors/maven2/cog-4_1_6_rc2/cryptix-asn1/cog-4_1_6/cryptix-asn1-cog-4_1_6.pom
Downloading: http://download.java.net/maven/2/cog-4_1_6_rc2/cryptix-asn1/cog-4_1_6/cryptix-asn1-cog-4_1_6.pom
Downloading: http://people.apache.org/~lahiru/maven-repo/cog-4_1_6_rc2/cryptix-asn1/cog-4_1_6/cryptix-asn1-cog-4_1_6.pom
Downloading: http://maven.ow2.org/maven2/cog-4_1_6_rc2/cryptix-asn1/cog-4_1_6/cryptix-asn1-cog-4_1_6.pom
Downloading: http://repo1.maven.org/maven2/cog-4_1_6_rc2/cryptix-asn1/cog-4_1_6/cryptix-asn1-cog-4_1_6.pom
[JENKINS] Archiving <https://builds.apache.org/job/Airavata/ws/modules/gfac-core/pom.xml> to /home/hudson/hudson/jobs/Airavata/modules/airavata$airavata-gfac-core/builds/2011-10-14_00-26-55/archive/airavata/airavata-gfac-core/0.0.1-SNAPSHOT/airavata-gfac-core-0.0.1-SNAPSHOT.pom
[INFO] ------------------------------------------------------------------------
[INFO] Reactor Summary:
[INFO] 
[INFO] Airavata .......................................... SUCCESS [2.052s]
[INFO] Airavata Commons .................................. SUCCESS [0.200s]
[INFO] Airavata GFac Schema Utilities .................... SUCCESS [6.640s]
[INFO] Airavata Registry API ............................. SUCCESS [1.324s]
[INFO] Airavata-WS-Messenger ............................. SUCCESS [0.161s]
[INFO] Messenger Commons ................................. SUCCESS [1.930s]
[INFO] Messenger Client .................................. SUCCESS [1.746s]
[INFO] Airavata Workflow Tracking ........................ SUCCESS [4.694s]
[INFO] GFac-Core ......................................... FAILURE [8.267s]
[INFO] GFac-Axis2-Interface .............................. SKIPPED
[INFO] MessageBox ........................................ SKIPPED
[INFO] Message Broker .................................... SKIPPED
[INFO] distribution ...................................... SKIPPED
[INFO] Airavata Common Utilities ......................... SKIPPED
[INFO] Airavata XBaya .................................... SKIPPED
[INFO] Simple Math Service ............................... SKIPPED
[INFO] distribution ...................................... SKIPPED
[INFO] ------------------------------------------------------------------------
[INFO] BUILD FAILURE
[INFO] ------------------------------------------------------------------------
[INFO] Total time: 32.330s
[INFO] Finished at: Fri Oct 14 00:27:31 UTC 2011
[INFO] Final Memory: 45M/146M
[INFO] ------------------------------------------------------------------------
mavenExecutionResult exceptions not empty
message : Failed to execute goal on project airavata-gfac-core: Could not resolve dependencies for project airavata:airavata-gfac-core:jar:0.0.1-SNAPSHOT: Failed to collect dependencies for [cog-jglobus:cog-jglobus:jar:1.8.0_1 (compile), cog-4_1_6_rc2:puretls:jar:cog-4_1_6 (compile), cog-4_1_6_rc2:cryptix32:jar:cog-4_1_6 (compile), cog-4_1_6_rc2:cryptix-asn1:jar:cog-4_1_6 (compile), bouncycastle:bcprov-jdk15:jar:143 (compile), commons-configuration:commons-configuration:jar:1.6 (compile), org.slf4j:slf4j-api:jar:1.6.1 (compile), airavata:airavata-gfac-schema-utils:jar:0.0.1-SNAPSHOT (compile), airavata:airavata-registry-api:jar:0.0.1-SNAPSHOT (compile), airavata:airavata-workflowtracking:jar:0.0.1-SNAPSHOT (compile), net.schmizz:sshj:jar:0.5.0 (compile), com.amazonaws:aws-java-sdk:jar:1.1.8 (compile), junit:junit:jar:4.7 (test), org.slf4j:slf4j-simple:jar:1.6.1 (test), org.apache.jackrabbit:jackrabbit-core:jar:2.2.7 (compile), org.apache.jackrabbit:jackrabbit-jcr-rmi:jar:2.2.7 (compile)]
cause : Could not resolve dependencies for project airavata:airavata-gfac-core:jar:0.0.1-SNAPSHOT: Failed to collect dependencies for [cog-jglobus:cog-jglobus:jar:1.8.0_1 (compile), cog-4_1_6_rc2:puretls:jar:cog-4_1_6 (compile), cog-4_1_6_rc2:cryptix32:jar:cog-4_1_6 (compile), cog-4_1_6_rc2:cryptix-asn1:jar:cog-4_1_6 (compile), bouncycastle:bcprov-jdk15:jar:143 (compile), commons-configuration:commons-configuration:jar:1.6 (compile), org.slf4j:slf4j-api:jar:1.6.1 (compile), airavata:airavata-gfac-schema-utils:jar:0.0.1-SNAPSHOT (compile), airavata:airavata-registry-api:jar:0.0.1-SNAPSHOT (compile), airavata:airavata-workflowtracking:jar:0.0.1-SNAPSHOT (compile), net.schmizz:sshj:jar:0.5.0 (compile), com.amazonaws:aws-java-sdk:jar:1.1.8 (compile), junit:junit:jar:4.7 (test), org.slf4j:slf4j-simple:jar:1.6.1 (test), org.apache.jackrabbit:jackrabbit-core:jar:2.2.7 (compile), org.apache.jackrabbit:jackrabbit-jcr-rmi:jar:2.2.7 (compile)]
Stack trace : 
org.apache.maven.lifecycle.LifecycleExecutionException: Failed to execute goal on project airavata-gfac-core: Could not resolve dependencies for project airavata:airavata-gfac-core:jar:0.0.1-SNAPSHOT: Failed to collect dependencies for [cog-jglobus:cog-jglobus:jar:1.8.0_1 (compile), cog-4_1_6_rc2:puretls:jar:cog-4_1_6 (compile), cog-4_1_6_rc2:cryptix32:jar:cog-4_1_6 (compile), cog-4_1_6_rc2:cryptix-asn1:jar:cog-4_1_6 (compile), bouncycastle:bcprov-jdk15:jar:143 (compile), commons-configuration:commons-configuration:jar:1.6 (compile), org.slf4j:slf4j-api:jar:1.6.1 (compile), airavata:airavata-gfac-schema-utils:jar:0.0.1-SNAPSHOT (compile), airavata:airavata-registry-api:jar:0.0.1-SNAPSHOT (compile), airavata:airavata-workflowtracking:jar:0.0.1-SNAPSHOT (compile), net.schmizz:sshj:jar:0.5.0 (compile), com.amazonaws:aws-java-sdk:jar:1.1.8 (compile), junit:junit:jar:4.7 (test), org.slf4j:slf4j-simple:jar:1.6.1 (test), org.apache.jackrabbit:jackrabbit-core:jar:2.2.7 (compile), org.apache.jackrabbit:jackrabbit-jcr-rmi:jar:2.2.7 (compile)]
	at org.apache.maven.lifecycle.internal.LifecycleDependencyResolver.getDependencies(LifecycleDependencyResolver.java:190)
	at org.apache.maven.lifecycle.internal.LifecycleDependencyResolver.resolveProjectDependencies(LifecycleDependencyResolver.java:104)
	at org.apache.maven.lifecycle.internal.MojoExecutor.ensureDependenciesAreResolved(MojoExecutor.java:258)
	at org.apache.maven.lifecycle.internal.MojoExecutor.execute(MojoExecutor.java:201)
	at org.apache.maven.lifecycle.internal.MojoExecutor.execute(MojoExecutor.java:153)
	at org.apache.maven.lifecycle.internal.MojoExecutor.execute(MojoExecutor.java:145)
	at org.apache.maven.lifecycle.internal.LifecycleModuleBuilder.buildProject(LifecycleModuleBuilder.java:84)
	at org.apache.maven.lifecycle.internal.LifecycleModuleBuilder.buildProject(LifecycleModuleBuilder.java:59)
	at org.apache.maven.lifecycle.internal.LifecycleStarter.singleThreadedBuild(LifecycleStarter.java:183)
	at org.apache.maven.lifecycle.internal.LifecycleStarter.execute(LifecycleStarter.java:161)
	at org.apache.maven.DefaultMaven.doExecute(DefaultMaven.java:319)
	at org.apache.maven.DefaultMaven.execute(DefaultMaven.java:156)
	at org.jvnet.hudson.maven3.launcher.Maven3Launcher.main(Maven3Launcher.java:79)
	at sun.reflect.NativeMethodAccessorImpl.invoke0(Native Method)
	at sun.reflect.NativeMethodAccessorImpl.invoke(NativeMethodAccessorImpl.java:39)
	at sun.reflect.DelegatingMethodAccessorImpl.invoke(DelegatingMethodAccessorImpl.java:25)
	at java.lang.reflect.Method.invoke(Method.java:597)
	at org.codehaus.plexus.classworlds.launcher.Launcher.launchStandard(Launcher.java:329)
	at org.codehaus.plexus.classworlds.launcher.Launcher.launch(Launcher.java:239)
	at org.jvnet.hudson.maven3.agent.Maven3Main.launch(Maven3Main.java:158)
	at hudson.maven.Maven3Builder.call(Maven3Builder.java:122)
	at hudson.maven.Maven3Builder.call(Maven3Builder.java:74)
	at hudson.remoting.UserRequest.perform(UserRequest.java:118)
	at hudson.remoting.UserRequest.perform(UserRequest.java:48)
	at hudson.remoting.Request$2.run(Request.java:287)
	at java.util.concurrent.Executors$RunnableAdapter.call(Executors.java:441)
	at java.util.concurrent.FutureTask$Sync.innerRun(FutureTask.java:303)
	at java.util.concurrent.FutureTask.run(FutureTask.java:138)
	at java.util.concurrent.ThreadPoolExecutor$Worker.runTask(ThreadPoolExecutor.java:886)
	at java.util.concurrent.ThreadPoolExecutor$Worker.run(ThreadPoolExecutor.java:908)
	at java.lang.Thread.run(Thread.java:619)
Caused by: org.apache.maven.project.DependencyResolutionException: Could not resolve dependencies for project airavata:airavata-gfac-core:jar:0.0.1-SNAPSHOT: Failed to collect dependencies for [cog-jglobus:cog-jglobus:jar:1.8.0_1 (compile), cog-4_1_6_rc2:puretls:jar:cog-4_1_6 (compile), cog-4_1_6_rc2:cryptix32:jar:cog-4_1_6 (compile), cog-4_1_6_rc2:cryptix-asn1:jar:cog-4_1_6 (compile), bouncycastle:bcprov-jdk15:jar:143 (compile), commons-configuration:commons-configuration:jar:1.6 (compile), org.slf4j:slf4j-api:jar:1.6.1 (compile), airavata:airavata-gfac-schema-utils:jar:0.0.1-SNAPSHOT (compile), airavata:airavata-registry-api:jar:0.0.1-SNAPSHOT (compile), airavata:airavata-workflowtracking:jar:0.0.1-SNAPSHOT (compile), net.schmizz:sshj:jar:0.5.0 (compile), com.amazonaws:aws-java-sdk:jar:1.1.8 (compile), junit:junit:jar:4.7 (test), org.slf4j:slf4j-simple:jar:1.6.1 (test), org.apache.jackrabbit:jackrabbit-core:jar:2.2.7 (compile), org.apache.jackrabbit:jackrabbit-jcr-rmi:jar:2.2.7 (compile)]
	at org.apache.maven.project.DefaultProjectDependenciesResolver.resolve(DefaultProjectDependenciesResolver.java:127)
	at org.apache.maven.lifecycle.internal.LifecycleDependencyResolver.getDependencies(LifecycleDependencyResolver.java:165)
	... 30 more
Caused by: org.sonatype.aether.collection.DependencyCollectionException: Failed to collect dependencies for [cog-jglobus:cog-jglobus:jar:1.8.0_1 (compile), cog-4_1_6_rc2:puretls:jar:cog-4_1_6 (compile), cog-4_1_6_rc2:cryptix32:jar:cog-4_1_6 (compile), cog-4_1_6_rc2:cryptix-asn1:jar:cog-4_1_6 (compile), bouncycastle:bcprov-jdk15:jar:143 (compile), commons-configuration:commons-configuration:jar:1.6 (compile), org.slf4j:slf4j-api:jar:1.6.1 (compile), airavata:airavata-gfac-schema-utils:jar:0.0.1-SNAPSHOT (compile), airavata:airavata-registry-api:jar:0.0.1-SNAPSHOT (compile), airavata:airavata-workflowtracking:jar:0.0.1-SNAPSHOT (compile), net.schmizz:sshj:jar:0.5.0 (compile), com.amazonaws:aws-java-sdk:jar:1.1.8 (compile), junit:junit:jar:4.7 (test), org.slf4j:slf4j-simple:jar:1.6.1 (test), org.apache.jackrabbit:jackrabbit-core:jar:2.2.7 (compile), org.apache.jackrabbit:jackrabbit-jcr-rmi:jar:2.2.7 (compile)]
	at org.sonatype.aether.impl.internal.DefaultDependencyCollector.collectDependencies(DefaultDependencyCollector.java:251)
	at org.sonatype.aether.impl.internal.DefaultRepositorySystem.collectDependencies(DefaultRepositorySystem.java:318)
	at org.apache.maven.project.DefaultProjectDependenciesResolver.resolve(DefaultProjectDependenciesResolver.java:119)
	... 31 more
Caused by: org.sonatype.aether.resolution.ArtifactDescriptorException: Failed to read artifact descriptor for cog-4_1_6_rc2:puretls:jar:cog-4_1_6
	at org.apache.maven.repository.internal.DefaultArtifactDescriptorReader.loadPom(DefaultArtifactDescriptorReader.java:283)
	at org.apache.maven.repository.internal.DefaultArtifactDescriptorReader.readArtifactDescriptor(DefaultArtifactDescriptorReader.java:173)
	at org.sonatype.aether.impl.internal.DefaultDependencyCollector.process(DefaultDependencyCollector.java:419)
	at org.sonatype.aether.impl.internal.DefaultDependencyCollector.collectDependencies(DefaultDependencyCollector.java:233)
	... 33 more
Caused by: org.sonatype.aether.resolution.ArtifactResolutionException: Could not transfer artifact cog-4_1_6_rc2:puretls:pom:cog-4_1_6 from/to ibiblio (http://mirrors.ibiblio.org/pub/mirrors/maven2): Error transferring file: Connection refused
	at org.sonatype.aether.impl.internal.DefaultArtifactResolver.resolveArtifacts(DefaultArtifactResolver.java:526)
	at org.sonatype.aether.impl.internal.DefaultArtifactResolver.resolveArtifact(DefaultArtifactResolver.java:214)
	at org.apache.maven.repository.internal.DefaultArtifactDescriptorReader.loadPom(DefaultArtifactDescriptorReader.java:268)
	... 36 more
Caused by: org.sonatype.aether.transfer.ArtifactTransferException: Could not transfer artifact cog-4_1_6_rc2:puretls:pom:cog-4_1_6 from/to ibiblio (http://mirrors.ibiblio.org/pub/mirrors/maven2): Error transferring file: Connection refused
	at org.sonatype.aether.connector.wagon.WagonRepositoryConnector$4.wrap(WagonRepositoryConnector.java:949)
	at org.sonatype.aether.connector.wagon.WagonRepositoryConnector$4.wrap(WagonRepositoryConnector.java:940)
	at org.sonatype.aether.connector.wagon.WagonRepositoryConnector$GetTask.flush(WagonRepositoryConnector.java:696)
	at org.sonatype.aether.connector.wagon.WagonRepositoryConnector$GetTask.flush(WagonRepositoryConnector.java:690)
	at org.sonatype.aether.connector.wagon.WagonRepositoryConnector.get(WagonRepositoryConnector.java:435)
	at org.sonatype.aether.impl.internal.DefaultArtifactResolver.resolveArtifacts(DefaultArtifactResolver.java:438)
	... 38 more
Caused by: org.apache.maven.wagon.TransferFailedException: Error transferring file: Connection refused
	at org.apache.maven.wagon.providers.http.LightweightHttpWagon.fillInputData(LightweightHttpWagon.java:143)
	at org.apache.maven.wagon.StreamWagon.getInputStream(StreamWagon.java:116)
	at org.apache.maven.wagon.StreamWagon.getIfNewer(StreamWagon.java:88)
	at org.apache.maven.wagon.StreamWagon.get(StreamWagon.java:61)
	at org.sonatype.aether.connector.wagon.WagonRepositoryConnector$GetTask.run(WagonRepositoryConnector.java:605)
	... 3 more
Caused by: java.net.ConnectException: Connection refused
	at java.net.PlainSocketImpl.socketConnect(Native Method)
	at java.net.PlainSocketImpl.doConnect(PlainSocketImpl.java:333)
	at java.net.PlainSocketImpl.connectToAddress(PlainSocketImpl.java:195)
	at java.net.PlainSocketImpl.connect(PlainSocketImpl.java:182)
	at java.net.SocksSocketImpl.connect(SocksSocketImpl.java:366)
	at java.net.Socket.connect(Socket.java:529)
	at java.net.Socket.connect(Socket.java:478)
	at sun.net.NetworkClient.doConnect(NetworkClient.java:163)
	at sun.net.www.http.HttpClient.openServer(HttpClient.java:394)
	at sun.net.www.http.HttpClient.openServer(HttpClient.java:529)
	at sun.net.www.http.HttpClient.<init>(HttpClient.java:233)
	at sun.net.www.http.HttpClient.New(HttpClient.java:306)
	at sun.net.www.http.HttpClient.New(HttpClient.java:323)
	at sun.net.www.protocol.http.HttpURLConnection.getNewHttpClient(HttpURLConnection.java:860)
	at sun.net.www.protocol.http.HttpURLConnection.plainConnect(HttpURLConnection.java:801)
	at sun.net.www.protocol.http.HttpURLConnection.connect(HttpURLConnection.java:726)
	at sun.net.www.protocol.http.HttpURLConnection.getInputStream(HttpURLConnection.java:1049)
	at java.net.HttpURLConnection.getResponseCode(HttpURLConnection.java:373)
	at org.apache.maven.wagon.providers.http.LightweightHttpWagon.fillInputData(LightweightHttpWagon.java:115)
	... 7 more
Sending e-mails to: airavata-dev@incubator.apache.org
channel stopped


Build failed in Jenkins: Airavata #107

Posted by Apache Jenkins Server <je...@builds.apache.org>.
See <https://builds.apache.org/job/Airavata/107/changes>

Changes:

[lahiru] https://issues.apache.org/jira/browse/AIRAVATA-123
AIRAVATA-123-GUI-3.patch

------------------------------------------
[...truncated 1732 lines...]
[INFO]                                                                         
[INFO] ------------------------------------------------------------------------
[INFO] Building Messenger Commons 0.0.1-SNAPSHOT
[INFO] ------------------------------------------------------------------------
[INFO] 
[INFO] --- maven-clean-plugin:2.4.1:clean (default-clean) @ airavata-messenger-commons ---
[INFO] [INFO] Using 'UTF-8' encoding to copy filtered resources.
[INFO] skip non existing resourceDirectory <https://builds.apache.org/job/Airavata/ws/modules/ws-messenger/commons/src/main/resources>

[INFO] --- maven-resources-plugin:2.4.3:resources (default-resources) @ airavata-messenger-commons ---
[INFO] 
[INFO] --- maven-compiler-plugin:2.0.2:compile (default-compile) @ airavata-messenger-commons ---
[INFO] Compiling 10 source files to <https://builds.apache.org/job/Airavata/ws/modules/ws-messenger/commons/target/classes>
[INFO] [INFO] Using 'UTF-8' encoding to copy filtered resources.
[INFO] skip non existing resourceDirectory <https://builds.apache.org/job/Airavata/ws/modules/ws-messenger/commons/src/test/resources>

[INFO] --- maven-resources-plugin:2.4.3:testResources (default-testResources) @ airavata-messenger-commons ---
[INFO] [INFO] Nothing to compile - all classes are up to date

[INFO] --- maven-compiler-plugin:2.0.2:testCompile (default-testCompile) @ airavata-messenger-commons ---
[INFO] [INFO] Tests are skipped.

[INFO] --- maven-surefire-plugin:2.7.1:test (default-test) @ airavata-messenger-commons ---
[INFO] 
[INFO] --- maven-jar-plugin:2.3.1:jar (default-jar) @ airavata-messenger-commons ---
[INFO] Building jar: <https://builds.apache.org/job/Airavata/ws/modules/ws-messenger/commons/target/airavata-messenger-commons-0.0.1-SNAPSHOT.jar>
[INFO] [INFO] Installing <https://builds.apache.org/job/Airavata/ws/modules/ws-messenger/commons/target/airavata-messenger-commons-0.0.1-SNAPSHOT.jar> to /home/jenkins/.m2/repository/airavata/airavata-messenger-commons/0.0.1-SNAPSHOT/airavata-messenger-commons-0.0.1-SNAPSHOT.jar
[INFO] Installing <https://builds.apache.org/job/Airavata/ws/modules/ws-messenger/commons/pom.xml> to /home/jenkins/.m2/repository/airavata/airavata-messenger-commons/0.0.1-SNAPSHOT/airavata-messenger-commons-0.0.1-SNAPSHOT.pom

[INFO] --- maven-install-plugin:2.3.1:install (default-install) @ airavata-messenger-commons ---
[JENKINS] Archiving <https://builds.apache.org/job/Airavata/ws/modules/ws-messenger/commons/pom.xml> to /home/hudson/hudson/jobs/Airavata/modules/airavata$airavata-messenger-commons/builds/2011-10-14_04-01-02/archive/airavata/airavata-messenger-commons/0.0.1-SNAPSHOT/airavata-messenger-commons-0.0.1-SNAPSHOT.pom
[JENKINS] Archiving <https://builds.apache.org/job/Airavata/ws/modules/ws-messenger/commons/target/airavata-messenger-commons-0.0.1-SNAPSHOT.jar> to /home/hudson/hudson/jobs/Airavata/modules/airavata$airavata-messenger-commons/builds/2011-10-14_04-01-02/archive/airavata/airavata-messenger-commons/0.0.1-SNAPSHOT/airavata-messenger-commons-0.0.1-SNAPSHOT.jar
[INFO]                                                                         
[INFO] ------------------------------------------------------------------------
[INFO] Building Messenger Client 0.0.1-SNAPSHOT
[INFO] ------------------------------------------------------------------------
[INFO] 
[INFO] --- maven-clean-plugin:2.4.1:clean (default-clean) @ airavata-messenger-client ---
[INFO] [INFO] Using 'UTF-8' encoding to copy filtered resources.
[INFO] skip non existing resourceDirectory <https://builds.apache.org/job/Airavata/ws/modules/ws-messenger/client/src/main/resources>

[INFO] --- maven-resources-plugin:2.4.3:resources (default-resources) @ airavata-messenger-client ---
[INFO] 
[INFO] --- maven-compiler-plugin:2.0.2:compile (default-compile) @ airavata-messenger-client ---
[INFO] Compiling 33 source files to <https://builds.apache.org/job/Airavata/ws/modules/ws-messenger/client/target/classes>
[INFO] [INFO] Using 'UTF-8' encoding to copy filtered resources.
[INFO] skip non existing resourceDirectory <https://builds.apache.org/job/Airavata/ws/modules/ws-messenger/client/src/test/resources>

[INFO] --- maven-resources-plugin:2.4.3:testResources (default-testResources) @ airavata-messenger-client ---
[INFO] [INFO] Compiling 4 source files to <https://builds.apache.org/job/Airavata/ws/modules/ws-messenger/client/target/test-classes>

[INFO] --- maven-compiler-plugin:2.0.2:testCompile (default-testCompile) @ airavata-messenger-client ---
[INFO] [INFO] Tests are skipped.

[INFO] --- maven-surefire-plugin:2.7.1:test (default-test) @ airavata-messenger-client ---
[INFO] 
[INFO] --- maven-jar-plugin:2.3.1:jar (default-jar) @ airavata-messenger-client ---
[INFO] Building jar: <https://builds.apache.org/job/Airavata/ws/modules/ws-messenger/client/target/airavata-messenger-client-0.0.1-SNAPSHOT.jar>
[INFO] [INFO] Installing <https://builds.apache.org/job/Airavata/ws/modules/ws-messenger/client/target/airavata-messenger-client-0.0.1-SNAPSHOT.jar> to /home/jenkins/.m2/repository/airavata/airavata-messenger-client/0.0.1-SNAPSHOT/airavata-messenger-client-0.0.1-SNAPSHOT.jar

[INFO] Installing <https://builds.apache.org/job/Airavata/ws/modules/ws-messenger/client/pom.xml> to /home/jenkins/.m2/repository/airavata/airavata-messenger-client/0.0.1-SNAPSHOT/airavata-messenger-client-0.0.1-SNAPSHOT.pom
[INFO] --- maven-install-plugin:2.3.1:install (default-install) @ airavata-messenger-client ---
[JENKINS] Archiving <https://builds.apache.org/job/Airavata/ws/modules/ws-messenger/client/pom.xml> to /home/hudson/hudson/jobs/Airavata/modules/airavata$airavata-messenger-client/builds/2011-10-14_04-01-02/archive/airavata/airavata-messenger-client/0.0.1-SNAPSHOT/airavata-messenger-client-0.0.1-SNAPSHOT.pom
[JENKINS] Archiving <https://builds.apache.org/job/Airavata/ws/modules/ws-messenger/client/target/airavata-messenger-client-0.0.1-SNAPSHOT.jar> to /home/hudson/hudson/jobs/Airavata/modules/airavata$airavata-messenger-client/builds/2011-10-14_04-01-02/archive/airavata/airavata-messenger-client/0.0.1-SNAPSHOT/airavata-messenger-client-0.0.1-SNAPSHOT.jar
[INFO]                                                                         
[INFO] ------------------------------------------------------------------------
[INFO] Building Airavata Workflow Tracking 0.0.1-SNAPSHOT
[INFO] ------------------------------------------------------------------------
[INFO] 
[INFO] --- maven-clean-plugin:2.4.1:clean (default-clean) @ airavata-workflowtracking ---
[INFO] 
[INFO] --- build-helper-maven-plugin:1.5:add-source (add-source) @ airavata-workflowtracking ---
[INFO] Source directory: <https://builds.apache.org/job/Airavata/ws/modules/commons/workflow-tracking/target/generated-sources/xmlbeans> added.
[INFO] 
[INFO] --- xmlbeans-maven-plugin:2.3.3:xmlbeans (generateBindings) @ airavata-workflowtracking ---
[INFO] [INFO] Using 'UTF-8' encoding to copy filtered resources.
[INFO] Copying 2 resources

[INFO] --- maven-resources-plugin:2.4.3:resources (default-resources) @ airavata-workflowtracking ---
[INFO] Copying 468 resources
[INFO] [INFO] Compiling 59 source files to <https://builds.apache.org/job/Airavata/ws/modules/commons/workflow-tracking/target/classes>

[INFO] --- maven-compiler-plugin:2.0.2:compile (default-compile) @ airavata-workflowtracking ---
[INFO] [INFO] Using 'UTF-8' encoding to copy filtered resources.
[INFO] Copying 1 resource

[INFO] --- maven-resources-plugin:2.4.3:testResources (default-testResources) @ airavata-workflowtracking ---
[INFO] 
[INFO] --- maven-compiler-plugin:2.0.2:testCompile (default-testCompile) @ airavata-workflowtracking ---
[INFO] Compiling 19 source files to <https://builds.apache.org/job/Airavata/ws/modules/commons/workflow-tracking/target/test-classes>
[INFO] [INFO] Tests are skipped.

[INFO] --- maven-surefire-plugin:2.7.1:test (default-test) @ airavata-workflowtracking ---
[INFO] 
[INFO] --- maven-jar-plugin:2.3.1:jar (default-jar) @ airavata-workflowtracking ---
[INFO] Building jar: <https://builds.apache.org/job/Airavata/ws/modules/commons/workflow-tracking/target/airavata-workflowtracking-0.0.1-SNAPSHOT.jar>
[INFO] [INFO] Installing <https://builds.apache.org/job/Airavata/ws/modules/commons/workflow-tracking/target/airavata-workflowtracking-0.0.1-SNAPSHOT.jar> to /home/jenkins/.m2/repository/airavata/airavata-workflowtracking/0.0.1-SNAPSHOT/airavata-workflowtracking-0.0.1-SNAPSHOT.jar
[INFO] Installing <https://builds.apache.org/job/Airavata/ws/modules/commons/workflow-tracking/pom.xml> to /home/jenkins/.m2/repository/airavata/airavata-workflowtracking/0.0.1-SNAPSHOT/airavata-workflowtracking-0.0.1-SNAPSHOT.pom

[INFO] --- maven-install-plugin:2.3.1:install (default-install) @ airavata-workflowtracking ---
[JENKINS] Archiving <https://builds.apache.org/job/Airavata/ws/modules/commons/workflow-tracking/pom.xml> to /home/hudson/hudson/jobs/Airavata/modules/airavata$airavata-workflowtracking/builds/2011-10-14_04-01-02/archive/airavata/airavata-workflowtracking/0.0.1-SNAPSHOT/airavata-workflowtracking-0.0.1-SNAPSHOT.pom
[JENKINS] Archiving <https://builds.apache.org/job/Airavata/ws/modules/commons/workflow-tracking/target/airavata-workflowtracking-0.0.1-SNAPSHOT.jar> to /home/hudson/hudson/jobs/Airavata/modules/airavata$airavata-workflowtracking/builds/2011-10-14_04-01-02/archive/airavata/airavata-workflowtracking/0.0.1-SNAPSHOT/airavata-workflowtracking-0.0.1-SNAPSHOT.jar
[INFO]                                                                         
[INFO] ------------------------------------------------------------------------
[INFO] Building GFac-Core 0.0.1-SNAPSHOT
[INFO] ------------------------------------------------------------------------
Downloading: http://community.ucs.indiana.edu:9090/archiva/repository/ogce.m2.all/cog-4_1_6_rc2/puretls/cog-4_1_6/puretls-cog-4_1_6.pom
Downloading: http://people.apache.org/repo/m2-snapshot-repository/cog-4_1_6_rc2/puretls/cog-4_1_6/puretls-cog-4_1_6.pom
Downloading: http://mirrors.ibiblio.org/pub/mirrors/maven2/cog-4_1_6_rc2/puretls/cog-4_1_6/puretls-cog-4_1_6.pom
Downloading: http://download.java.net/maven/2/cog-4_1_6_rc2/puretls/cog-4_1_6/puretls-cog-4_1_6.pom
Downloading: http://people.apache.org/~lahiru/maven-repo/cog-4_1_6_rc2/puretls/cog-4_1_6/puretls-cog-4_1_6.pom
Downloading: http://maven.ow2.org/maven2/cog-4_1_6_rc2/puretls/cog-4_1_6/puretls-cog-4_1_6.pom
Downloading: http://repo1.maven.org/maven2/cog-4_1_6_rc2/puretls/cog-4_1_6/puretls-cog-4_1_6.pom
Downloading: http://community.ucs.indiana.edu:9090/archiva/repository/ogce.m2.all/cog-4_1_6_rc2/cryptix32/cog-4_1_6/cryptix32-cog-4_1_6.pom
Downloading: http://people.apache.org/repo/m2-snapshot-repository/cog-4_1_6_rc2/cryptix32/cog-4_1_6/cryptix32-cog-4_1_6.pom
Downloading: http://mirrors.ibiblio.org/pub/mirrors/maven2/cog-4_1_6_rc2/cryptix32/cog-4_1_6/cryptix32-cog-4_1_6.pom
Downloading: http://download.java.net/maven/2/cog-4_1_6_rc2/cryptix32/cog-4_1_6/cryptix32-cog-4_1_6.pom
Downloading: http://people.apache.org/~lahiru/maven-repo/cog-4_1_6_rc2/cryptix32/cog-4_1_6/cryptix32-cog-4_1_6.pom
Downloading: http://maven.ow2.org/maven2/cog-4_1_6_rc2/cryptix32/cog-4_1_6/cryptix32-cog-4_1_6.pom
Downloading: http://repo1.maven.org/maven2/cog-4_1_6_rc2/cryptix32/cog-4_1_6/cryptix32-cog-4_1_6.pom
Downloading: http://community.ucs.indiana.edu:9090/archiva/repository/ogce.m2.all/cog-4_1_6_rc2/cryptix-asn1/cog-4_1_6/cryptix-asn1-cog-4_1_6.pom
Downloading: http://people.apache.org/repo/m2-snapshot-repository/cog-4_1_6_rc2/cryptix-asn1/cog-4_1_6/cryptix-asn1-cog-4_1_6.pom
Downloading: http://mirrors.ibiblio.org/pub/mirrors/maven2/cog-4_1_6_rc2/cryptix-asn1/cog-4_1_6/cryptix-asn1-cog-4_1_6.pom
Downloading: http://download.java.net/maven/2/cog-4_1_6_rc2/cryptix-asn1/cog-4_1_6/cryptix-asn1-cog-4_1_6.pom
Downloading: http://people.apache.org/~lahiru/maven-repo/cog-4_1_6_rc2/cryptix-asn1/cog-4_1_6/cryptix-asn1-cog-4_1_6.pom
Downloading: http://maven.ow2.org/maven2/cog-4_1_6_rc2/cryptix-asn1/cog-4_1_6/cryptix-asn1-cog-4_1_6.pom
Downloading: http://repo1.maven.org/maven2/cog-4_1_6_rc2/cryptix-asn1/cog-4_1_6/cryptix-asn1-cog-4_1_6.pom
[JENKINS] Archiving <https://builds.apache.org/job/Airavata/ws/modules/gfac-core/pom.xml> to /home/hudson/hudson/jobs/Airavata/modules/airavata$airavata-gfac-core/builds/2011-10-14_04-01-02/archive/airavata/airavata-gfac-core/0.0.1-SNAPSHOT/airavata-gfac-core-0.0.1-SNAPSHOT.pom
[INFO] ------------------------------------------------------------------------
[INFO] Reactor Summary:
[INFO] 
[INFO] Airavata .......................................... SUCCESS [1.917s]
[INFO] Airavata Commons .................................. SUCCESS [0.130s]
[INFO] Airavata GFac Schema Utilities .................... SUCCESS [5.980s]
[INFO] Airavata Registry API ............................. SUCCESS [1.312s]
[INFO] Airavata-WS-Messenger ............................. SUCCESS [0.131s]
[INFO] Messenger Commons ................................. SUCCESS [1.571s]
[INFO] Messenger Client .................................. SUCCESS [1.663s]
[INFO] Airavata Workflow Tracking ........................ SUCCESS [4.463s]
[INFO] GFac-Core ......................................... FAILURE [4.785s]
[INFO] GFac-Axis2-Interface .............................. SKIPPED
[INFO] MessageBox ........................................ SKIPPED
[INFO] Message Broker .................................... SKIPPED
[INFO] distribution ...................................... SKIPPED
[INFO] Airavata Common Utilities ......................... SKIPPED
[INFO] Airavata XBaya .................................... SKIPPED
[INFO] Simple Math Service ............................... SKIPPED
[INFO] distribution ...................................... SKIPPED
[INFO] ------------------------------------------------------------------------
[INFO] BUILD FAILURE
[INFO] ------------------------------------------------------------------------
[INFO] Total time: 27.080s
[INFO] Finished at: Fri Oct 14 04:01:33 UTC 2011
[INFO] Final Memory: 47M/286M
[INFO] ------------------------------------------------------------------------
mavenExecutionResult exceptions not empty
message : Failed to execute goal on project airavata-gfac-core: Could not resolve dependencies for project airavata:airavata-gfac-core:jar:0.0.1-SNAPSHOT: Failed to collect dependencies for [cog-jglobus:cog-jglobus:jar:1.8.0_1 (compile), cog-4_1_6_rc2:puretls:jar:cog-4_1_6 (compile), cog-4_1_6_rc2:cryptix32:jar:cog-4_1_6 (compile), cog-4_1_6_rc2:cryptix-asn1:jar:cog-4_1_6 (compile), bouncycastle:bcprov-jdk15:jar:143 (compile), commons-configuration:commons-configuration:jar:1.6 (compile), org.slf4j:slf4j-api:jar:1.6.1 (compile), airavata:airavata-gfac-schema-utils:jar:0.0.1-SNAPSHOT (compile), airavata:airavata-registry-api:jar:0.0.1-SNAPSHOT (compile), airavata:airavata-workflowtracking:jar:0.0.1-SNAPSHOT (compile), net.schmizz:sshj:jar:0.5.0 (compile), com.amazonaws:aws-java-sdk:jar:1.1.8 (compile), junit:junit:jar:4.7 (test), org.slf4j:slf4j-simple:jar:1.6.1 (test), org.apache.jackrabbit:jackrabbit-core:jar:2.2.7 (compile), org.apache.jackrabbit:jackrabbit-jcr-rmi:jar:2.2.7 (compile)]
cause : Could not resolve dependencies for project airavata:airavata-gfac-core:jar:0.0.1-SNAPSHOT: Failed to collect dependencies for [cog-jglobus:cog-jglobus:jar:1.8.0_1 (compile), cog-4_1_6_rc2:puretls:jar:cog-4_1_6 (compile), cog-4_1_6_rc2:cryptix32:jar:cog-4_1_6 (compile), cog-4_1_6_rc2:cryptix-asn1:jar:cog-4_1_6 (compile), bouncycastle:bcprov-jdk15:jar:143 (compile), commons-configuration:commons-configuration:jar:1.6 (compile), org.slf4j:slf4j-api:jar:1.6.1 (compile), airavata:airavata-gfac-schema-utils:jar:0.0.1-SNAPSHOT (compile), airavata:airavata-registry-api:jar:0.0.1-SNAPSHOT (compile), airavata:airavata-workflowtracking:jar:0.0.1-SNAPSHOT (compile), net.schmizz:sshj:jar:0.5.0 (compile), com.amazonaws:aws-java-sdk:jar:1.1.8 (compile), junit:junit:jar:4.7 (test), org.slf4j:slf4j-simple:jar:1.6.1 (test), org.apache.jackrabbit:jackrabbit-core:jar:2.2.7 (compile), org.apache.jackrabbit:jackrabbit-jcr-rmi:jar:2.2.7 (compile)]
Stack trace : 
org.apache.maven.lifecycle.LifecycleExecutionException: Failed to execute goal on project airavata-gfac-core: Could not resolve dependencies for project airavata:airavata-gfac-core:jar:0.0.1-SNAPSHOT: Failed to collect dependencies for [cog-jglobus:cog-jglobus:jar:1.8.0_1 (compile), cog-4_1_6_rc2:puretls:jar:cog-4_1_6 (compile), cog-4_1_6_rc2:cryptix32:jar:cog-4_1_6 (compile), cog-4_1_6_rc2:cryptix-asn1:jar:cog-4_1_6 (compile), bouncycastle:bcprov-jdk15:jar:143 (compile), commons-configuration:commons-configuration:jar:1.6 (compile), org.slf4j:slf4j-api:jar:1.6.1 (compile), airavata:airavata-gfac-schema-utils:jar:0.0.1-SNAPSHOT (compile), airavata:airavata-registry-api:jar:0.0.1-SNAPSHOT (compile), airavata:airavata-workflowtracking:jar:0.0.1-SNAPSHOT (compile), net.schmizz:sshj:jar:0.5.0 (compile), com.amazonaws:aws-java-sdk:jar:1.1.8 (compile), junit:junit:jar:4.7 (test), org.slf4j:slf4j-simple:jar:1.6.1 (test), org.apache.jackrabbit:jackrabbit-core:jar:2.2.7 (compile), org.apache.jackrabbit:jackrabbit-jcr-rmi:jar:2.2.7 (compile)]
	at org.apache.maven.lifecycle.internal.LifecycleDependencyResolver.getDependencies(LifecycleDependencyResolver.java:190)
	at org.apache.maven.lifecycle.internal.LifecycleDependencyResolver.resolveProjectDependencies(LifecycleDependencyResolver.java:104)
	at org.apache.maven.lifecycle.internal.MojoExecutor.ensureDependenciesAreResolved(MojoExecutor.java:258)
	at org.apache.maven.lifecycle.internal.MojoExecutor.execute(MojoExecutor.java:201)
	at org.apache.maven.lifecycle.internal.MojoExecutor.execute(MojoExecutor.java:153)
	at org.apache.maven.lifecycle.internal.MojoExecutor.execute(MojoExecutor.java:145)
	at org.apache.maven.lifecycle.internal.LifecycleModuleBuilder.buildProject(LifecycleModuleBuilder.java:84)
	at org.apache.maven.lifecycle.internal.LifecycleModuleBuilder.buildProject(LifecycleModuleBuilder.java:59)
	at org.apache.maven.lifecycle.internal.LifecycleStarter.singleThreadedBuild(LifecycleStarter.java:183)
	at org.apache.maven.lifecycle.internal.LifecycleStarter.execute(LifecycleStarter.java:161)
	at org.apache.maven.DefaultMaven.doExecute(DefaultMaven.java:319)
	at org.apache.maven.DefaultMaven.execute(DefaultMaven.java:156)
	at org.jvnet.hudson.maven3.launcher.Maven3Launcher.main(Maven3Launcher.java:79)
	at sun.reflect.NativeMethodAccessorImpl.invoke0(Native Method)
	at sun.reflect.NativeMethodAccessorImpl.invoke(NativeMethodAccessorImpl.java:39)
	at sun.reflect.DelegatingMethodAccessorImpl.invoke(DelegatingMethodAccessorImpl.java:25)
	at java.lang.reflect.Method.invoke(Method.java:597)
	at org.codehaus.plexus.classworlds.launcher.Launcher.launchStandard(Launcher.java:329)
	at org.codehaus.plexus.classworlds.launcher.Launcher.launch(Launcher.java:239)
	at org.jvnet.hudson.maven3.agent.Maven3Main.launch(Maven3Main.java:158)
	at hudson.maven.Maven3Builder.call(Maven3Builder.java:122)
	at hudson.maven.Maven3Builder.call(Maven3Builder.java:74)
	at hudson.remoting.UserRequest.perform(UserRequest.java:118)
	at hudson.remoting.UserRequest.perform(UserRequest.java:48)
	at hudson.remoting.Request$2.run(Request.java:287)
	at java.util.concurrent.Executors$RunnableAdapter.call(Executors.java:441)
	at java.util.concurrent.FutureTask$Sync.innerRun(FutureTask.java:303)
	at java.util.concurrent.FutureTask.run(FutureTask.java:138)
	at java.util.concurrent.ThreadPoolExecutor$Worker.runTask(ThreadPoolExecutor.java:886)
	at java.util.concurrent.ThreadPoolExecutor$Worker.run(ThreadPoolExecutor.java:908)
	at java.lang.Thread.run(Thread.java:619)
Caused by: org.apache.maven.project.DependencyResolutionException: Could not resolve dependencies for project airavata:airavata-gfac-core:jar:0.0.1-SNAPSHOT: Failed to collect dependencies for [cog-jglobus:cog-jglobus:jar:1.8.0_1 (compile), cog-4_1_6_rc2:puretls:jar:cog-4_1_6 (compile), cog-4_1_6_rc2:cryptix32:jar:cog-4_1_6 (compile), cog-4_1_6_rc2:cryptix-asn1:jar:cog-4_1_6 (compile), bouncycastle:bcprov-jdk15:jar:143 (compile), commons-configuration:commons-configuration:jar:1.6 (compile), org.slf4j:slf4j-api:jar:1.6.1 (compile), airavata:airavata-gfac-schema-utils:jar:0.0.1-SNAPSHOT (compile), airavata:airavata-registry-api:jar:0.0.1-SNAPSHOT (compile), airavata:airavata-workflowtracking:jar:0.0.1-SNAPSHOT (compile), net.schmizz:sshj:jar:0.5.0 (compile), com.amazonaws:aws-java-sdk:jar:1.1.8 (compile), junit:junit:jar:4.7 (test), org.slf4j:slf4j-simple:jar:1.6.1 (test), org.apache.jackrabbit:jackrabbit-core:jar:2.2.7 (compile), org.apache.jackrabbit:jackrabbit-jcr-rmi:jar:2.2.7 (compile)]
	at org.apache.maven.project.DefaultProjectDependenciesResolver.resolve(DefaultProjectDependenciesResolver.java:127)
	at org.apache.maven.lifecycle.internal.LifecycleDependencyResolver.getDependencies(LifecycleDependencyResolver.java:165)
	... 30 more
Caused by: org.sonatype.aether.collection.DependencyCollectionException: Failed to collect dependencies for [cog-jglobus:cog-jglobus:jar:1.8.0_1 (compile), cog-4_1_6_rc2:puretls:jar:cog-4_1_6 (compile), cog-4_1_6_rc2:cryptix32:jar:cog-4_1_6 (compile), cog-4_1_6_rc2:cryptix-asn1:jar:cog-4_1_6 (compile), bouncycastle:bcprov-jdk15:jar:143 (compile), commons-configuration:commons-configuration:jar:1.6 (compile), org.slf4j:slf4j-api:jar:1.6.1 (compile), airavata:airavata-gfac-schema-utils:jar:0.0.1-SNAPSHOT (compile), airavata:airavata-registry-api:jar:0.0.1-SNAPSHOT (compile), airavata:airavata-workflowtracking:jar:0.0.1-SNAPSHOT (compile), net.schmizz:sshj:jar:0.5.0 (compile), com.amazonaws:aws-java-sdk:jar:1.1.8 (compile), junit:junit:jar:4.7 (test), org.slf4j:slf4j-simple:jar:1.6.1 (test), org.apache.jackrabbit:jackrabbit-core:jar:2.2.7 (compile), org.apache.jackrabbit:jackrabbit-jcr-rmi:jar:2.2.7 (compile)]
	at org.sonatype.aether.impl.internal.DefaultDependencyCollector.collectDependencies(DefaultDependencyCollector.java:251)
	at org.sonatype.aether.impl.internal.DefaultRepositorySystem.collectDependencies(DefaultRepositorySystem.java:318)
	at org.apache.maven.project.DefaultProjectDependenciesResolver.resolve(DefaultProjectDependenciesResolver.java:119)
	... 31 more
Caused by: org.sonatype.aether.resolution.ArtifactDescriptorException: Failed to read artifact descriptor for cog-4_1_6_rc2:puretls:jar:cog-4_1_6
	at org.apache.maven.repository.internal.DefaultArtifactDescriptorReader.loadPom(DefaultArtifactDescriptorReader.java:283)
	at org.apache.maven.repository.internal.DefaultArtifactDescriptorReader.readArtifactDescriptor(DefaultArtifactDescriptorReader.java:173)
	at org.sonatype.aether.impl.internal.DefaultDependencyCollector.process(DefaultDependencyCollector.java:419)
	at org.sonatype.aether.impl.internal.DefaultDependencyCollector.collectDependencies(DefaultDependencyCollector.java:233)
	... 33 more
Caused by: org.sonatype.aether.resolution.ArtifactResolutionException: Could not transfer artifact cog-4_1_6_rc2:puretls:pom:cog-4_1_6 from/to ibiblio (http://mirrors.ibiblio.org/pub/mirrors/maven2): Error transferring file: Connection refused
	at org.sonatype.aether.impl.internal.DefaultArtifactResolver.resolveArtifacts(DefaultArtifactResolver.java:526)
	at org.sonatype.aether.impl.internal.DefaultArtifactResolver.resolveArtifact(DefaultArtifactResolver.java:214)
	at org.apache.maven.repository.internal.DefaultArtifactDescriptorReader.loadPom(DefaultArtifactDescriptorReader.java:268)
	... 36 more
Caused by: org.sonatype.aether.transfer.ArtifactTransferException: Could not transfer artifact cog-4_1_6_rc2:puretls:pom:cog-4_1_6 from/to ibiblio (http://mirrors.ibiblio.org/pub/mirrors/maven2): Error transferring file: Connection refused
	at org.sonatype.aether.connector.wagon.WagonRepositoryConnector$4.wrap(WagonRepositoryConnector.java:949)
	at org.sonatype.aether.connector.wagon.WagonRepositoryConnector$4.wrap(WagonRepositoryConnector.java:940)
	at org.sonatype.aether.connector.wagon.WagonRepositoryConnector$GetTask.flush(WagonRepositoryConnector.java:696)
	at org.sonatype.aether.connector.wagon.WagonRepositoryConnector$GetTask.flush(WagonRepositoryConnector.java:690)
	at org.sonatype.aether.connector.wagon.WagonRepositoryConnector.get(WagonRepositoryConnector.java:435)
	at org.sonatype.aether.impl.internal.DefaultArtifactResolver.resolveArtifacts(DefaultArtifactResolver.java:438)
	... 38 more
Caused by: org.apache.maven.wagon.TransferFailedException: Error transferring file: Connection refused
	at org.apache.maven.wagon.providers.http.LightweightHttpWagon.fillInputData(LightweightHttpWagon.java:143)
	at org.apache.maven.wagon.StreamWagon.getInputStream(StreamWagon.java:116)
	at org.apache.maven.wagon.StreamWagon.getIfNewer(StreamWagon.java:88)
	at org.apache.maven.wagon.StreamWagon.get(StreamWagon.java:61)
	at org.sonatype.aether.connector.wagon.WagonRepositoryConnector$GetTask.run(WagonRepositoryConnector.java:605)
	... 3 more
Caused by: java.net.ConnectException: Connection refused
	at java.net.PlainSocketImpl.socketConnect(Native Method)
	at java.net.PlainSocketImpl.doConnect(PlainSocketImpl.java:333)
	at java.net.PlainSocketImpl.connectToAddress(PlainSocketImpl.java:195)
	at java.net.PlainSocketImpl.connect(PlainSocketImpl.java:182)
	at java.net.SocksSocketImpl.connect(SocksSocketImpl.java:366)
	at java.net.Socket.connect(Socket.java:529)
	at java.net.Socket.connect(Socket.java:478)
	at sun.net.NetworkClient.doConnect(NetworkClient.java:163)
	at sun.net.www.http.HttpClient.openServer(HttpClient.java:394)
	at sun.net.www.http.HttpClient.openServer(HttpClient.java:529)
	at sun.net.www.http.HttpClient.<init>(HttpClient.java:233)
	at sun.net.www.http.HttpClient.New(HttpClient.java:306)
	at sun.net.www.http.HttpClient.New(HttpClient.java:323)
	at sun.net.www.protocol.http.HttpURLConnection.getNewHttpClient(HttpURLConnection.java:860)
	at sun.net.www.protocol.http.HttpURLConnection.plainConnect(HttpURLConnection.java:801)
	at sun.net.www.protocol.http.HttpURLConnection.connect(HttpURLConnection.java:726)
	at sun.net.www.protocol.http.HttpURLConnection.getInputStream(HttpURLConnection.java:1049)
	at java.net.HttpURLConnection.getResponseCode(HttpURLConnection.java:373)
	at org.apache.maven.wagon.providers.http.LightweightHttpWagon.fillInputData(LightweightHttpWagon.java:115)
	... 7 more
Sending e-mails to: airavata-dev@incubator.apache.org
channel stopped


Build failed in Jenkins: Airavata #106

Posted by Apache Jenkins Server <je...@builds.apache.org>.
See <https://builds.apache.org/job/Airavata/106/changes>

Changes:

[patanachai] add echo.sh with new file permission

[patanachai] remove echo.sh

------------------------------------------
[...truncated 2203 lines...]
9138 [main] INFO org.apache.airavata.core.gfac.notification.impl.LoggingNotification - Notifier: class org.apache.airavata.core.gfac.notification.impl.LoggingNotification
9138 [main] INFO org.apache.airavata.core.gfac.notification.impl.LoggingNotification - -----DATA-----
9138 [main] INFO org.apache.airavata.core.gfac.notification.impl.LoggingNotification - Finish execution
9138 [main] INFO org.apache.airavata.core.gfac.notification.impl.LoggingNotification - -----END DATA-----
9140 [main] INFO org.apache.airavata.core.gfac.services.impl.PropertiesBasedServiceImpl - try to load post-execution chain
9141 [main] INFO org.apache.airavata.core.gfac.services.impl.PropertiesBasedServiceImpl - org.apache.airavata.core.gfac.extension.PostExecuteChain : org.apache.airavata.core.gfac.extension.post.GridFtpOutputStaging is loaded
9141 [main] INFO org.apache.airavata.core.gfac.services.impl.PropertiesBasedServiceImpl - org.apache.airavata.core.gfac.extension.PostExecuteChain : org.apache.airavata.core.gfac.extension.post.OutputRegister is loaded
Tests run: 1, Failures: 0, Errors: 0, Skipped: 0, Time elapsed: 9.197 sec

Results :

Tests run: 1, Failures: 0, Errors: 0, Skipped: 0

[JENKINS] Recording test results
log4j:WARN No appenders could be found for logger (org.apache.commons.beanutils.converters.BooleanConverter).
log4j:WARN Please initialize the log4j system properly.
[INFO] 
[INFO] --- maven-jar-plugin:2.3.1:jar (default-jar) @ airavata-gfac-core ---
[INFO] Building jar: <https://builds.apache.org/job/Airavata/ws/modules/gfac-core/target/airavata-gfac-core-0.0.1-SNAPSHOT.jar>
[INFO] [INFO] Installing <https://builds.apache.org/job/Airavata/ws/modules/gfac-core/target/airavata-gfac-core-0.0.1-SNAPSHOT.jar> to /home/jenkins/.m2/repository/airavata/airavata-gfac-core/0.0.1-SNAPSHOT/airavata-gfac-core-0.0.1-SNAPSHOT.jar
[INFO] Installing <https://builds.apache.org/job/Airavata/ws/modules/gfac-core/pom.xml> to /home/jenkins/.m2/repository/airavata/airavata-gfac-core/0.0.1-SNAPSHOT/airavata-gfac-core-0.0.1-SNAPSHOT.pom

[INFO] --- maven-install-plugin:2.3.1:install (default-install) @ airavata-gfac-core ---
[JENKINS] Archiving <https://builds.apache.org/job/Airavata/ws/modules/gfac-core/pom.xml> to /home/hudson/hudson/jobs/Airavata/modules/airavata$airavata-gfac-core/builds/2011-10-14_02-02-51/archive/airavata/airavata-gfac-core/0.0.1-SNAPSHOT/airavata-gfac-core-0.0.1-SNAPSHOT.pom
[JENKINS] Archiving <https://builds.apache.org/job/Airavata/ws/modules/gfac-core/target/airavata-gfac-core-0.0.1-SNAPSHOT.jar> to /home/hudson/hudson/jobs/Airavata/modules/airavata$airavata-gfac-core/builds/2011-10-14_02-02-51/archive/airavata/airavata-gfac-core/0.0.1-SNAPSHOT/airavata-gfac-core-0.0.1-SNAPSHOT.jar
[INFO]                                                                         
[INFO] ------------------------------------------------------------------------
[INFO] Building GFac-Axis2-Interface 0.0.1-SNAPSHOT
[INFO] ------------------------------------------------------------------------
[INFO] 
[INFO] --- maven-clean-plugin:2.4.1:clean (default-clean) @ airavata-gfac-axis2-interface ---
[INFO] [INFO] Using 'UTF-8' encoding to copy filtered resources.
[INFO] Copying 2 resources

[INFO] --- maven-resources-plugin:2.4.3:resources (default-resources) @ airavata-gfac-axis2-interface ---
[INFO] [INFO] Compiling 9 source files to <https://builds.apache.org/job/Airavata/ws/modules/gfac-axis2/target/classes>

[INFO] --- maven-compiler-plugin:2.3.2:compile (default-compile) @ airavata-gfac-axis2-interface ---
[INFO] [INFO] Using 'UTF-8' encoding to copy filtered resources.
[INFO] skip non existing resourceDirectory <https://builds.apache.org/job/Airavata/ws/modules/gfac-axis2/src/test/resources>

[INFO] --- maven-resources-plugin:2.4.3:testResources (default-testResources) @ airavata-gfac-axis2-interface ---
[INFO] [INFO] No sources to compile

[INFO] --- maven-compiler-plugin:2.3.2:testCompile (default-testCompile) @ airavata-gfac-axis2-interface ---
[INFO] [INFO] No tests to run.
[INFO] Surefire report directory: <https://builds.apache.org/job/Airavata/ws/modules/gfac-axis2/target/surefire-reports>

[INFO] --- maven-surefire-plugin:2.7.2:test (default-test) @ airavata-gfac-axis2-interface ---

-------------------------------------------------------
 T E S T S
-------------------------------------------------------
There are no tests to run.

Results :

Tests run: 0, Failures: 0, Errors: 0, Skipped: 0

[JENKINS] Recording test results
[INFO] 
[INFO] --- maven-jar-plugin:2.3.1:jar (default-jar) @ airavata-gfac-axis2-interface ---
[INFO] Building jar: <https://builds.apache.org/job/Airavata/ws/modules/gfac-axis2/target/airavata-gfac-axis2-interface-0.0.1-SNAPSHOT.jar>
[INFO] 
[INFO] --- axis2-aar-maven-plugin:1.5.1:aar (createAAR) @ airavata-gfac-axis2-interface ---
[INFO] Generating aar <https://builds.apache.org/job/Airavata/ws/modules/gfac-axis2/target/airavata-gfac-axis2-interface-0.0.1-SNAPSHOT.aar>
[INFO] Building jar: <https://builds.apache.org/job/Airavata/ws/modules/gfac-axis2/target/airavata-gfac-axis2-interface-0.0.1-SNAPSHOT.aar>
[INFO] Installing <https://builds.apache.org/job/Airavata/ws/modules/gfac-axis2/target/airavata-gfac-axis2-interface-0.0.1-SNAPSHOT.aar> to /home/jenkins/.m2/repository/airavata/airavata-gfac-axis2-interface/0.0.1-SNAPSHOT/airavata-gfac-axis2-interface-0.0.1-SNAPSHOT.jar
[INFO] 
[INFO] --- maven-install-plugin:2.3.1:install (default-install) @ airavata-gfac-axis2-interface ---
[INFO] Installing <https://builds.apache.org/job/Airavata/ws/modules/gfac-axis2/pom.xml> to /home/jenkins/.m2/repository/airavata/airavata-gfac-axis2-interface/0.0.1-SNAPSHOT/airavata-gfac-axis2-interface-0.0.1-SNAPSHOT.pom
[JENKINS] Archiving <https://builds.apache.org/job/Airavata/ws/modules/gfac-axis2/pom.xml> to /home/hudson/hudson/jobs/Airavata/modules/airavata$airavata-gfac-axis2-interface/builds/2011-10-14_02-02-51/archive/airavata/airavata-gfac-axis2-interface/0.0.1-SNAPSHOT/airavata-gfac-axis2-interface-0.0.1-SNAPSHOT.pom
[JENKINS] Archiving <https://builds.apache.org/job/Airavata/ws/modules/gfac-axis2/target/airavata-gfac-axis2-interface-0.0.1-SNAPSHOT.aar> to /home/hudson/hudson/jobs/Airavata/modules/airavata$airavata-gfac-axis2-interface/builds/2011-10-14_02-02-51/archive/airavata/airavata-gfac-axis2-interface/0.0.1-SNAPSHOT/airavata-gfac-axis2-interface-0.0.1-SNAPSHOT.jar
[INFO]                                                                         
[INFO] ------------------------------------------------------------------------
[INFO] Building MessageBox 0.0.1-SNAPSHOT
[INFO] ------------------------------------------------------------------------
[INFO] 
[INFO] --- maven-clean-plugin:2.4.1:clean (default-clean) @ airavata-messagebox ---
[INFO] [INFO] Using 'UTF-8' encoding to copy filtered resources.
[INFO] skip non existing resourceDirectory <https://builds.apache.org/job/Airavata/ws/modules/ws-messenger/messagebox/resources>

[INFO] --- maven-resources-plugin:2.4.3:resources (default-resources) @ airavata-messagebox ---
[INFO] 
[INFO] --- maven-compiler-plugin:2.0.2:compile (default-compile) @ airavata-messagebox ---
[INFO] Compiling 12 source files to <https://builds.apache.org/job/Airavata/ws/modules/ws-messenger/messagebox/target/classes>
[INFO] [INFO] Using 'UTF-8' encoding to copy filtered resources.
[INFO] Copying 1 resource

[INFO] --- maven-resources-plugin:2.4.3:testResources (default-testResources) @ airavata-messagebox ---
[INFO] [INFO] Compiling 3 source files to <https://builds.apache.org/job/Airavata/ws/modules/ws-messenger/messagebox/target/test-classes>

[INFO] --- maven-compiler-plugin:2.0.2:testCompile (default-testCompile) @ airavata-messagebox ---
[INFO] [INFO] Tests are skipped.

[INFO] --- maven-surefire-plugin:2.7.2:test (default-test) @ airavata-messagebox ---
[INFO] 
[INFO] --- maven-jar-plugin:2.3.1:jar (default-jar) @ airavata-messagebox ---
[INFO] Building jar: <https://builds.apache.org/job/Airavata/ws/modules/ws-messenger/messagebox/target/airavata-messagebox-0.0.1-SNAPSHOT.jar>
[INFO] 
[INFO] --- axis2-aar-maven-plugin:1.5.1:aar (createAAR) @ airavata-messagebox ---
[INFO] Generating aar <https://builds.apache.org/job/Airavata/ws/modules/ws-messenger/messagebox/target/airavata-messagebox-0.0.1-SNAPSHOT.aar>
[INFO] Building jar: <https://builds.apache.org/job/Airavata/ws/modules/ws-messenger/messagebox/target/airavata-messagebox-0.0.1-SNAPSHOT.aar>
[INFO] Installing <https://builds.apache.org/job/Airavata/ws/modules/ws-messenger/messagebox/target/airavata-messagebox-0.0.1-SNAPSHOT.aar> to /home/jenkins/.m2/repository/airavata/airavata-messagebox/0.0.1-SNAPSHOT/airavata-messagebox-0.0.1-SNAPSHOT.jar
[INFO] 
[INFO] --- maven-install-plugin:2.3.1:install (default-install) @ airavata-messagebox ---
[INFO] Installing <https://builds.apache.org/job/Airavata/ws/modules/ws-messenger/messagebox/pom.xml> to /home/jenkins/.m2/repository/airavata/airavata-messagebox/0.0.1-SNAPSHOT/airavata-messagebox-0.0.1-SNAPSHOT.pom
[JENKINS] Archiving <https://builds.apache.org/job/Airavata/ws/modules/ws-messenger/messagebox/pom.xml> to /home/hudson/hudson/jobs/Airavata/modules/airavata$airavata-messagebox/builds/2011-10-14_02-02-51/archive/airavata/airavata-messagebox/0.0.1-SNAPSHOT/airavata-messagebox-0.0.1-SNAPSHOT.pom
[JENKINS] Archiving <https://builds.apache.org/job/Airavata/ws/modules/ws-messenger/messagebox/target/airavata-messagebox-0.0.1-SNAPSHOT.aar> to /home/hudson/hudson/jobs/Airavata/modules/airavata$airavata-messagebox/builds/2011-10-14_02-02-51/archive/airavata/airavata-messagebox/0.0.1-SNAPSHOT/airavata-messagebox-0.0.1-SNAPSHOT.jar
[INFO]                                                                         
[INFO] ------------------------------------------------------------------------
[INFO] Building Message Broker 0.0.1-SNAPSHOT
[INFO] ------------------------------------------------------------------------
Downloading: http://people.apache.org/repo/m2-snapshot-repository/edu/berkeley/yfilter/1.0/yfilter-1.0.pom
Downloading: http://mirrors.ibiblio.org/pub/mirrors/maven2/edu/berkeley/yfilter/1.0/yfilter-1.0.pom
Downloading: http://download.java.net/maven/2/edu/berkeley/yfilter/1.0/yfilter-1.0.pom
Downloading: http://people.apache.org/~lahiru/maven-repo/edu/berkeley/yfilter/1.0/yfilter-1.0.pom
Downloading: http://repo1.maven.org/maven2/edu/berkeley/yfilter/1.0/yfilter-1.0.pom
Downloading: http://people.apache.org/repo/m2-snapshot-repository/wsdl4j/wsdl4j/1.5.2/wsdl4j-1.5.2.pom
Downloading: http://mirrors.ibiblio.org/pub/mirrors/maven2/wsdl4j/wsdl4j/1.5.2/wsdl4j-1.5.2.pom
Downloading: http://download.java.net/maven/2/wsdl4j/wsdl4j/1.5.2/wsdl4j-1.5.2.pom
Downloading: http://people.apache.org/~lahiru/maven-repo/wsdl4j/wsdl4j/1.5.2/wsdl4j-1.5.2.pom
Downloading: http://repo1.maven.org/maven2/wsdl4j/wsdl4j/1.5.2/wsdl4j-1.5.2.pom
Downloaded: http://repo1.maven.org/maven2/wsdl4j/wsdl4j/1.5.2/wsdl4j-1.5.2.pom (0 B at 0.0 KB/sec)
[JENKINS] Archiving <https://builds.apache.org/job/Airavata/ws/modules/ws-messenger/messagebroker/pom.xml> to /home/hudson/hudson/jobs/Airavata/modules/airavata$airavata-messagebroker/builds/2011-10-14_02-02-51/archive/airavata/airavata-messagebroker/0.0.1-SNAPSHOT/airavata-messagebroker-0.0.1-SNAPSHOT.pom
[INFO] ------------------------------------------------------------------------
[INFO] Reactor Summary:
[INFO] 
[INFO] Airavata .......................................... SUCCESS [8.279s]
[INFO] Airavata Commons .................................. SUCCESS [5.424s]
[INFO] Airavata GFac Schema Utilities .................... SUCCESS [8.941s]
[INFO] Airavata Registry API ............................. SUCCESS [2.154s]
[INFO] Airavata-WS-Messenger ............................. SUCCESS [0.281s]
[INFO] Messenger Commons ................................. SUCCESS [3.061s]
[INFO] Messenger Client .................................. SUCCESS [2.952s]
[INFO] Airavata Workflow Tracking ........................ SUCCESS [7.664s]
[INFO] GFac-Core ......................................... SUCCESS [46.953s]
[INFO] GFac-Axis2-Interface .............................. SUCCESS [12.271s]
[INFO] MessageBox ........................................ SUCCESS [3.905s]
[INFO] Message Broker .................................... FAILURE [1.171s]
[INFO] distribution ...................................... SKIPPED
[INFO] Airavata Common Utilities ......................... SKIPPED
[INFO] Airavata XBaya .................................... SKIPPED
[INFO] Simple Math Service ............................... SKIPPED
[INFO] distribution ...................................... SKIPPED
[INFO] ------------------------------------------------------------------------
[INFO] BUILD FAILURE
[INFO] ------------------------------------------------------------------------
[INFO] Total time: 5:51.218s
[INFO] Finished at: Fri Oct 14 02:08:52 UTC 2011
[INFO] Final Memory: 77M/216M
[INFO] ------------------------------------------------------------------------
mavenExecutionResult exceptions not empty
message : Failed to execute goal on project airavata-messagebroker: Could not resolve dependencies for project airavata:airavata-messagebroker:jar:0.0.1-SNAPSHOT: Failed to collect dependencies for [airavata:airavata-messenger-commons:jar:0.0.1-SNAPSHOT (compile), edu.berkeley:yfilter:jar:1.0 (compile), wsdl4j:wsdl4j:jar:1.5.2 (compile), javax.servlet:servlet-api:jar:2.5 (provided), org.apache.axis2:axis2:jar:1.5.1 (provided), org.apache.axis2:axis2-transport-http:jar:1.5.1 (compile), org.apache.axis2:axis2-transport-local:jar:1.5.1 (compile), org.slf4j:slf4j-api:jar:1.6.1 (compile), junit:junit:jar:4.7 (test), airavata:airavata-messenger-client:jar:0.0.1-SNAPSHOT (test)]
cause : Could not resolve dependencies for project airavata:airavata-messagebroker:jar:0.0.1-SNAPSHOT: Failed to collect dependencies for [airavata:airavata-messenger-commons:jar:0.0.1-SNAPSHOT (compile), edu.berkeley:yfilter:jar:1.0 (compile), wsdl4j:wsdl4j:jar:1.5.2 (compile), javax.servlet:servlet-api:jar:2.5 (provided), org.apache.axis2:axis2:jar:1.5.1 (provided), org.apache.axis2:axis2-transport-http:jar:1.5.1 (compile), org.apache.axis2:axis2-transport-local:jar:1.5.1 (compile), org.slf4j:slf4j-api:jar:1.6.1 (compile), junit:junit:jar:4.7 (test), airavata:airavata-messenger-client:jar:0.0.1-SNAPSHOT (test)]
Stack trace : 
org.apache.maven.lifecycle.LifecycleExecutionException: Failed to execute goal on project airavata-messagebroker: Could not resolve dependencies for project airavata:airavata-messagebroker:jar:0.0.1-SNAPSHOT: Failed to collect dependencies for [airavata:airavata-messenger-commons:jar:0.0.1-SNAPSHOT (compile), edu.berkeley:yfilter:jar:1.0 (compile), wsdl4j:wsdl4j:jar:1.5.2 (compile), javax.servlet:servlet-api:jar:2.5 (provided), org.apache.axis2:axis2:jar:1.5.1 (provided), org.apache.axis2:axis2-transport-http:jar:1.5.1 (compile), org.apache.axis2:axis2-transport-local:jar:1.5.1 (compile), org.slf4j:slf4j-api:jar:1.6.1 (compile), junit:junit:jar:4.7 (test), airavata:airavata-messenger-client:jar:0.0.1-SNAPSHOT (test)]
	at org.apache.maven.lifecycle.internal.LifecycleDependencyResolver.getDependencies(LifecycleDependencyResolver.java:196)
	at org.apache.maven.lifecycle.internal.LifecycleDependencyResolver.resolveProjectDependencies(LifecycleDependencyResolver.java:108)
	at org.apache.maven.lifecycle.internal.MojoExecutor.ensureDependenciesAreResolved(MojoExecutor.java:258)
	at org.apache.maven.lifecycle.internal.MojoExecutor.execute(MojoExecutor.java:201)
	at org.apache.maven.lifecycle.internal.MojoExecutor.execute(MojoExecutor.java:153)
	at org.apache.maven.lifecycle.internal.MojoExecutor.execute(MojoExecutor.java:145)
	at org.apache.maven.lifecycle.internal.LifecycleModuleBuilder.buildProject(LifecycleModuleBuilder.java:84)
	at org.apache.maven.lifecycle.internal.LifecycleModuleBuilder.buildProject(LifecycleModuleBuilder.java:59)
	at org.apache.maven.lifecycle.internal.LifecycleStarter.singleThreadedBuild(LifecycleStarter.java:183)
	at org.apache.maven.lifecycle.internal.LifecycleStarter.execute(LifecycleStarter.java:161)
	at org.apache.maven.DefaultMaven.doExecute(DefaultMaven.java:319)
	at org.apache.maven.DefaultMaven.execute(DefaultMaven.java:156)
	at org.jvnet.hudson.maven3.launcher.Maven3Launcher.main(Maven3Launcher.java:79)
	at sun.reflect.NativeMethodAccessorImpl.invoke0(Native Method)
	at sun.reflect.NativeMethodAccessorImpl.invoke(NativeMethodAccessorImpl.java:39)
	at sun.reflect.DelegatingMethodAccessorImpl.invoke(DelegatingMethodAccessorImpl.java:25)
	at java.lang.reflect.Method.invoke(Method.java:597)
	at org.codehaus.plexus.classworlds.launcher.Launcher.launchStandard(Launcher.java:329)
	at org.codehaus.plexus.classworlds.launcher.Launcher.launch(Launcher.java:239)
	at org.jvnet.hudson.maven3.agent.Maven3Main.launch(Maven3Main.java:158)
	at hudson.maven.Maven3Builder.call(Maven3Builder.java:122)
	at hudson.maven.Maven3Builder.call(Maven3Builder.java:74)
	at hudson.remoting.UserRequest.perform(UserRequest.java:118)
	at hudson.remoting.UserRequest.perform(UserRequest.java:48)
	at hudson.remoting.Request$2.run(Request.java:287)
	at java.util.concurrent.Executors$RunnableAdapter.call(Executors.java:441)
	at java.util.concurrent.FutureTask$Sync.innerRun(FutureTask.java:303)
	at java.util.concurrent.FutureTask.run(FutureTask.java:138)
	at java.util.concurrent.ThreadPoolExecutor$Worker.runTask(ThreadPoolExecutor.java:886)
	at java.util.concurrent.ThreadPoolExecutor$Worker.run(ThreadPoolExecutor.java:908)
	at java.lang.Thread.run(Thread.java:619)
Caused by: org.apache.maven.project.DependencyResolutionException: Could not resolve dependencies for project airavata:airavata-messagebroker:jar:0.0.1-SNAPSHOT: Failed to collect dependencies for [airavata:airavata-messenger-commons:jar:0.0.1-SNAPSHOT (compile), edu.berkeley:yfilter:jar:1.0 (compile), wsdl4j:wsdl4j:jar:1.5.2 (compile), javax.servlet:servlet-api:jar:2.5 (provided), org.apache.axis2:axis2:jar:1.5.1 (provided), org.apache.axis2:axis2-transport-http:jar:1.5.1 (compile), org.apache.axis2:axis2-transport-local:jar:1.5.1 (compile), org.slf4j:slf4j-api:jar:1.6.1 (compile), junit:junit:jar:4.7 (test), airavata:airavata-messenger-client:jar:0.0.1-SNAPSHOT (test)]
	at org.apache.maven.project.DefaultProjectDependenciesResolver.resolve(DefaultProjectDependenciesResolver.java:139)
	at org.apache.maven.lifecycle.internal.LifecycleDependencyResolver.getDependencies(LifecycleDependencyResolver.java:171)
	... 30 more
Caused by: org.sonatype.aether.collection.DependencyCollectionException: Failed to collect dependencies for [airavata:airavata-messenger-commons:jar:0.0.1-SNAPSHOT (compile), edu.berkeley:yfilter:jar:1.0 (compile), wsdl4j:wsdl4j:jar:1.5.2 (compile), javax.servlet:servlet-api:jar:2.5 (provided), org.apache.axis2:axis2:jar:1.5.1 (provided), org.apache.axis2:axis2-transport-http:jar:1.5.1 (compile), org.apache.axis2:axis2-transport-local:jar:1.5.1 (compile), org.slf4j:slf4j-api:jar:1.6.1 (compile), junit:junit:jar:4.7 (test), airavata:airavata-messenger-client:jar:0.0.1-SNAPSHOT (test)]
	at org.sonatype.aether.impl.internal.DefaultDependencyCollector.collectDependencies(DefaultDependencyCollector.java:262)
	at org.sonatype.aether.impl.internal.DefaultRepositorySystem.collectDependencies(DefaultRepositorySystem.java:345)
	at org.apache.maven.project.DefaultProjectDependenciesResolver.resolve(DefaultProjectDependenciesResolver.java:131)
	... 31 more
Caused by: org.sonatype.aether.resolution.ArtifactDescriptorException: Failed to read artifact descriptor for edu.berkeley:yfilter:jar:1.0
	at org.apache.maven.repository.internal.DefaultArtifactDescriptorReader.loadPom(DefaultArtifactDescriptorReader.java:282)
	at org.apache.maven.repository.internal.DefaultArtifactDescriptorReader.readArtifactDescriptor(DefaultArtifactDescriptorReader.java:172)
	at org.sonatype.aether.impl.internal.DefaultDependencyCollector.process(DefaultDependencyCollector.java:419)
	at org.sonatype.aether.impl.internal.DefaultDependencyCollector.collectDependencies(DefaultDependencyCollector.java:243)
	... 33 more
Caused by: org.sonatype.aether.resolution.ArtifactResolutionException: Could not transfer artifact edu.berkeley:yfilter:pom:1.0 from/to ibiblio (http://mirrors.ibiblio.org/pub/mirrors/maven2): Error transferring file: Connection refused
	at org.sonatype.aether.impl.internal.DefaultArtifactResolver.resolve(DefaultArtifactResolver.java:541)
	at org.sonatype.aether.impl.internal.DefaultArtifactResolver.resolveArtifacts(DefaultArtifactResolver.java:220)
	at org.sonatype.aether.impl.internal.DefaultArtifactResolver.resolveArtifact(DefaultArtifactResolver.java:197)
	at org.apache.maven.repository.internal.DefaultArtifactDescriptorReader.loadPom(DefaultArtifactDescriptorReader.java:267)
	... 36 more
Caused by: org.sonatype.aether.transfer.ArtifactTransferException: Could not transfer artifact edu.berkeley:yfilter:pom:1.0 from/to ibiblio (http://mirrors.ibiblio.org/pub/mirrors/maven2): Error transferring file: Connection refused
	at org.sonatype.aether.connector.wagon.WagonRepositoryConnector$4.wrap(WagonRepositoryConnector.java:949)
	at org.sonatype.aether.connector.wagon.WagonRepositoryConnector$4.wrap(WagonRepositoryConnector.java:940)
	at org.sonatype.aether.connector.wagon.WagonRepositoryConnector$GetTask.flush(WagonRepositoryConnector.java:695)
	at org.sonatype.aether.connector.wagon.WagonRepositoryConnector$GetTask.flush(WagonRepositoryConnector.java:689)
	at org.sonatype.aether.connector.wagon.WagonRepositoryConnector.get(WagonRepositoryConnector.java:445)
	at org.sonatype.aether.impl.internal.DefaultArtifactResolver.resolve(DefaultArtifactResolver.java:460)
	... 39 more
Caused by: org.apache.maven.wagon.TransferFailedException: Error transferring file: Connection refused
	at org.apache.maven.wagon.providers.http.LightweightHttpWagon.fillInputData(LightweightHttpWagon.java:143)
	at org.apache.maven.wagon.StreamWagon.getInputStream(StreamWagon.java:116)
	at org.apache.maven.wagon.StreamWagon.getIfNewer(StreamWagon.java:88)
	at org.apache.maven.wagon.StreamWagon.get(StreamWagon.java:61)
	at org.sonatype.aether.connector.wagon.WagonRepositoryConnector$GetTask.run(WagonRepositoryConnector.java:608)
	at org.sonatype.aether.util.concurrency.RunnableErrorForwarder$1.run(RunnableErrorForwarder.java:64)
	... 3 more
Caused by: java.net.ConnectException: Connection refused
	at java.net.PlainSocketImpl.socketConnect(Native Method)
	at java.net.PlainSocketImpl.doConnect(PlainSocketImpl.java:333)
	at java.net.PlainSocketImpl.connectToAddress(PlainSocketImpl.java:195)
	at java.net.PlainSocketImpl.connect(PlainSocketImpl.java:182)
	at java.net.SocksSocketImpl.connect(SocksSocketImpl.java:366)
	at java.net.Socket.connect(Socket.java:529)
	at java.net.Socket.connect(Socket.java:478)
	at sun.net.NetworkClient.doConnect(NetworkClient.java:163)
	at sun.net.www.http.HttpClient.openServer(HttpClient.java:394)
	at sun.net.www.http.HttpClient.openServer(HttpClient.java:529)
	at sun.net.www.http.HttpClient.<init>(HttpClient.java:233)
	at sun.net.www.http.HttpClient.New(HttpClient.java:306)
	at sun.net.www.http.HttpClient.New(HttpClient.java:323)
	at sun.net.www.protocol.http.HttpURLConnection.getNewHttpClient(HttpURLConnection.java:860)
	at sun.net.www.protocol.http.HttpURLConnection.plainConnect(HttpURLConnection.java:801)
	at sun.net.www.protocol.http.HttpURLConnection.connect(HttpURLConnection.java:726)
	at sun.net.www.protocol.http.HttpURLConnection.getInputStream(HttpURLConnection.java:1049)
	at java.net.HttpURLConnection.getResponseCode(HttpURLConnection.java:373)
	at org.apache.maven.wagon.providers.http.LightweightHttpWagon.fillInputData(LightweightHttpWagon.java:115)
	... 8 more
Sending e-mails to: airavata-dev@incubator.apache.org
Sending e-mails to: airavata-dev@incubator.apache.org
channel stopped