You are viewing a plain text version of this content. The canonical link for it is here.
Posted to dev@lucene.apache.org by Apache Jenkins Server <je...@builds.apache.org> on 2014/10/13 20:53:07 UTC
[JENKINS-MAVEN] Lucene-Solr-Maven-5.x #731: POMs out of sync
Build: https://builds.apache.org/job/Lucene-Solr-Maven-5.x/731/
3 tests failed.
REGRESSION: org.apache.solr.cloud.ChaosMonkeySafeLeaderTest.testDistribSearch
Error Message:
shard1 is not consistent. Got 35 from http://127.0.0.1:19887/collection1lastClient and got 11 from http://127.0.0.1:32370/collection1
Stack Trace:
java.lang.AssertionError: shard1 is not consistent. Got 35 from http://127.0.0.1:19887/collection1lastClient and got 11 from http://127.0.0.1:32370/collection1
at __randomizedtesting.SeedInfo.seed([882E075B35E84A4D:9C8894342B72A71]:0)
at org.junit.Assert.fail(Assert.java:93)
at org.apache.solr.cloud.AbstractFullDistribZkTestBase.checkShardConsistency(AbstractFullDistribZkTestBase.java:1255)
at org.apache.solr.cloud.AbstractFullDistribZkTestBase.checkShardConsistency(AbstractFullDistribZkTestBase.java:1234)
at org.apache.solr.cloud.ChaosMonkeySafeLeaderTest.doTest(ChaosMonkeySafeLeaderTest.java:162)
REGRESSION: org.apache.solr.cloud.CollectionsAPIDistributedZkTest.testDistribSearch
Error Message:
Error CREATEing SolrCore 'halfcollection_shard1_replica1': Unable to create core [halfcollection_shard1_replica1] Caused by: Could not get shard id for core: halfcollection_shard1_replica1
Stack Trace:
org.apache.solr.client.solrj.impl.HttpSolrServer$RemoteSolrException: Error CREATEing SolrCore 'halfcollection_shard1_replica1': Unable to create core [halfcollection_shard1_replica1] Caused by: Could not get shard id for core: halfcollection_shard1_replica1
at __randomizedtesting.SeedInfo.seed([A07AB56BAB8B253A:219C3B73DCD44506]:0)
at org.apache.solr.client.solrj.impl.HttpSolrServer.executeMethod(HttpSolrServer.java:569)
at org.apache.solr.client.solrj.impl.HttpSolrServer.request(HttpSolrServer.java:215)
at org.apache.solr.client.solrj.impl.HttpSolrServer.request(HttpSolrServer.java:211)
at org.apache.solr.cloud.CollectionsAPIDistributedZkTest.testErrorHandling(CollectionsAPIDistributedZkTest.java:583)
at org.apache.solr.cloud.CollectionsAPIDistributedZkTest.doTest(CollectionsAPIDistributedZkTest.java:205)
REGRESSION: org.apache.solr.cloud.DeleteReplicaTest.testDistribSearch
Error Message:
No live SolrServers available to handle this request:[https://127.0.0.1:62624/zh/oh, https://127.0.0.1:59855/zh/oh, https://127.0.0.1:59852/zh/oh, https://127.0.0.1:59858/zh/oh, https://127.0.0.1:12555/zh/oh]
Stack Trace:
org.apache.solr.client.solrj.SolrServerException: No live SolrServers available to handle this request:[https://127.0.0.1:62624/zh/oh, https://127.0.0.1:59855/zh/oh, https://127.0.0.1:59852/zh/oh, https://127.0.0.1:59858/zh/oh, https://127.0.0.1:12555/zh/oh]
at org.apache.solr.client.solrj.impl.HttpSolrServer.executeMethod(HttpSolrServer.java:569)
at org.apache.solr.client.solrj.impl.HttpSolrServer.request(HttpSolrServer.java:215)
at org.apache.solr.client.solrj.impl.HttpSolrServer.request(HttpSolrServer.java:211)
at org.apache.solr.client.solrj.impl.LBHttpSolrServer.doRequest(LBHttpSolrServer.java:353)
at org.apache.solr.client.solrj.impl.LBHttpSolrServer.request(LBHttpSolrServer.java:312)
at org.apache.solr.client.solrj.impl.CloudSolrServer.sendRequest(CloudSolrServer.java:880)
at org.apache.solr.client.solrj.impl.CloudSolrServer.requestWithRetryOnStaleState(CloudSolrServer.java:658)
at org.apache.solr.client.solrj.impl.CloudSolrServer.request(CloudSolrServer.java:601)
at org.apache.solr.cloud.DeleteReplicaTest.removeAndWaitForReplicaGone(DeleteReplicaTest.java:172)
at org.apache.solr.cloud.DeleteReplicaTest.deleteLiveReplicaTest(DeleteReplicaTest.java:145)
at org.apache.solr.cloud.DeleteReplicaTest.doTest(DeleteReplicaTest.java:89)
Build Log:
[...truncated 53231 lines...]
BUILD FAILED
/usr/home/jenkins/jenkins-slave/workspace/Lucene-Solr-Maven-5.x/build.xml:547: The following error occurred while executing this line:
/usr/home/jenkins/jenkins-slave/workspace/Lucene-Solr-Maven-5.x/build.xml:199: The following error occurred while executing this line:
: Java returned: 1
Total time: 280 minutes 16 seconds
Build step 'Invoke Ant' marked build as failure
Recording test results
Email was triggered for: Failure
Sending email for trigger: Failure