You are viewing a plain text version of this content. The canonical link for it is here.
Posted to builds@beam.apache.org by Apache Jenkins Server <je...@builds.apache.org> on 2023/10/15 16:26:11 UTC
Build failed in Jenkins: beam_PreCommit_Python_Integration_Cron #1135
See <https://ci-beam.apache.org/job/beam_PreCommit_Python_Integration_Cron/1135/display/redirect>
Changes:
------------------------------------------
Started by timer
Running as SYSTEM
[EnvInject] - Loading node environment variables.
Building remotely on apache-beam-jenkins-1 (beam) in workspace <https://ci-beam.apache.org/job/beam_PreCommit_Python_Integration_Cron/ws/>
The recommended git tool is: NONE
No credentials specified
Wiping out workspace first.
Cloning the remote Git repository
Using shallow clone with depth 1
Avoid fetching tags
Cloning repository https://github.com/apache/beam.git
> git init <https://ci-beam.apache.org/job/beam_PreCommit_Python_Integration_Cron/ws/src> # timeout=10
Fetching upstream changes from https://github.com/apache/beam.git
> git --version # timeout=10
> git --version # 'git version 2.25.1'
> git fetch --no-tags --force --progress --depth=1 -- https://github.com/apache/beam.git +refs/heads/*:refs/remotes/origin/* # timeout=10
> git config remote.origin.url https://github.com/apache/beam.git # timeout=10
> git config --add remote.origin.fetch +refs/heads/*:refs/remotes/origin/* # timeout=10
> git config remote.origin.url https://github.com/apache/beam.git # timeout=10
Using shallow fetch with depth 1
Fetching upstream changes from https://github.com/apache/beam.git
> git fetch --no-tags --force --progress --depth=1 -- https://github.com/apache/beam.git +refs/heads/*:refs/remotes/origin/* +refs/pull/${ghprbPullId}/*:refs/remotes/origin/pr/${ghprbPullId}/* # timeout=10
> git rev-parse origin/master^{commit} # timeout=10
Checking out Revision 8de14655f783f2dd5754b87ee9f9dcd96e552136 (origin/master)
> git config core.sparsecheckout # timeout=10
> git checkout -f 8de14655f783f2dd5754b87ee9f9dcd96e552136 # timeout=10
Commit message: "[RRIO] Stub the RequestResponseIO transform (#28950)"
> git rev-list --no-walk 8de14655f783f2dd5754b87ee9f9dcd96e552136 # timeout=10
No emails were triggered.
[EnvInject] - Executing scripts and injecting environment variables after the SCM step.
[EnvInject] - Injecting as environment variables the properties content
SETUPTOOLS_USE_DISTUTILS=stdlib
SPARK_LOCAL_IP=127.0.0.1
[EnvInject] - Variables injected successfully.
[Gradle] - Launching build.
[src] $ <https://ci-beam.apache.org/job/beam_PreCommit_Python_Integration_Cron/ws/src/gradlew> -PuseWheelDistribution --continue --max-workers=8 -Dorg.gradle.jvmargs=-Xms2g -Dorg.gradle.jvmargs=-Xmx6g -Dorg.gradle.vfs.watch=false -Pdocker-pull-licenses :pythonPreCommitIT
To honour the JVM settings for this build a single-use Daemon process will be forked. For more on this, please refer to https://docs.gradle.org/8.3/userguide/gradle_daemon.html#sec:disabling_the_daemon in the Gradle documentation.
Daemon will be stopped at the end of the build
Configuration on demand is an incubating feature.
Gradle Enterprise plugins resolution: https://plugins.gradle.org/m2
Enforcing Gradle Enterprise: https://ge.apache.org, allowUntrustedServer: false
> Task :buildSrc:compileJava NO-SOURCE
> Task :buildSrc:compileGroovy FROM-CACHE
> Task :buildSrc:pluginDescriptors
> Task :buildSrc:processResources
> Task :buildSrc:classes
> Task :buildSrc:jar
> Configure project :sdks:java:container:java8
docker-pull-licenses set, creating go-licenses
> Configure project :sdks:java:container:java11
docker-pull-licenses set, creating go-licenses
> Task :sdks:python:test-suites:tox:pycommon:preCommitPyCommon UP-TO-DATE
> Task :sdks:python:test-suites:dataflow:py38:setupVirtualenv
Collecting pip
Downloading pip-23.3-py3-none-any.whl (2.1 MB)
Installing collected packages: pip
Attempting uninstall: pip
Found existing installation: pip 20.0.2
Uninstalling pip-20.0.2:
Successfully uninstalled pip-20.0.2
Successfully installed pip-23.3
Collecting tox
Downloading tox-4.11.3-py3-none-any.whl.metadata (5.0 kB)
Collecting cachetools>=5.3.1 (from tox)
Downloading cachetools-5.3.1-py3-none-any.whl.metadata (5.2 kB)
Collecting chardet>=5.2 (from tox)
Downloading chardet-5.2.0-py3-none-any.whl.metadata (3.4 kB)
Collecting colorama>=0.4.6 (from tox)
Downloading colorama-0.4.6-py2.py3-none-any.whl (25 kB)
Collecting filelock>=3.12.3 (from tox)
Downloading filelock-3.12.4-py3-none-any.whl.metadata (2.8 kB)
Collecting packaging>=23.1 (from tox)
Downloading packaging-23.2-py3-none-any.whl.metadata (3.2 kB)
Collecting platformdirs>=3.10 (from tox)
Downloading platformdirs-3.11.0-py3-none-any.whl.metadata (11 kB)
Collecting pluggy>=1.3 (from tox)
Downloading pluggy-1.3.0-py3-none-any.whl.metadata (4.3 kB)
Collecting pyproject-api>=1.6.1 (from tox)
Downloading pyproject_api-1.6.1-py3-none-any.whl.metadata (2.8 kB)
Collecting tomli>=2.0.1 (from tox)
Downloading tomli-2.0.1-py3-none-any.whl (12 kB)
Collecting virtualenv>=20.24.3 (from tox)
Downloading virtualenv-20.24.5-py3-none-any.whl.metadata (4.5 kB)
Collecting distlib<1,>=0.3.7 (from virtualenv>=20.24.3->tox)
Downloading distlib-0.3.7-py2.py3-none-any.whl.metadata (5.1 kB)
Downloading tox-4.11.3-py3-none-any.whl (153 kB)
━━━━━━━━━━━━━━━━━━━━━━━━━━━━━━━━━━━━━━━━ 153.8/153.8 kB 4.7 MB/s eta 0:00:00
Downloading cachetools-5.3.1-py3-none-any.whl (9.3 kB)
Downloading chardet-5.2.0-py3-none-any.whl (199 kB)
━━━━━━━━━━━━━━━━━━━━━━━━━━━━━━━━━━━━━━━━ 199.4/199.4 kB 12.2 MB/s eta 0:00:00
Downloading filelock-3.12.4-py3-none-any.whl (11 kB)
Downloading packaging-23.2-py3-none-any.whl (53 kB)
━━━━━━━━━━━━━━━━━━━━━━━━━━━━━━━━━━━━━━━━ 53.0/53.0 kB 3.6 MB/s eta 0:00:00
Downloading platformdirs-3.11.0-py3-none-any.whl (17 kB)
> Task :sdks:python:setupVirtualenv FAILED
Collecting pip
Downloading pip-23.3-py3-none-any.whl (2.1 MB)
Installing collected packages: pip
Attempting uninstall: pip
Found existing installation: pip 20.0.2
Uninstalling pip-20.0.2:
Successfully uninstalled pip-20.0.2
Successfully installed pip-23.3
Collecting tox
Downloading tox-4.11.3-py3-none-any.whl.metadata (5.0 kB)
Collecting cachetools>=5.3.1 (from tox)
Using cached cachetools-5.3.1-py3-none-any.whl.metadata (5.2 kB)
Collecting chardet>=5.2 (from tox)
Downloading chardet-5.2.0-py3-none-any.whl.metadata (3.4 kB)
Collecting colorama>=0.4.6 (from tox)
Downloading colorama-0.4.6-py2.py3-none-any.whl (25 kB)
Collecting filelock>=3.12.3 (from tox)
Downloading filelock-3.12.4-py3-none-any.whl.metadata (2.8 kB)
Collecting packaging>=23.1 (from tox)
Using cached packaging-23.2-py3-none-any.whl.metadata (3.2 kB)
ERROR: THESE PACKAGES DO NOT MATCH THE HASHES FROM THE REQUIREMENTS FILE. If you have updated the package versions, please update the hashes. Otherwise, examine the package contents carefully; someone may have tampered with them.
packaging>=23.1 from https://files.pythonhosted.org/packages/ec/1a/610693ac4ee14fcdf2d9bf3c493370e4f2ef7ae2e19217d7a237ff42367d/packaging-23.2-py3-none-any.whl (from tox):
Expected sha256 b3574943ce848d906e97f50291034674771b2edb3a660e3f9b10aa93ad17eb1b
Got e3b0c44298fc1c149afbf4c8996fb92427ae41e4649b934ca495991b7852b855
WARNING: There was an error checking the latest version of pip.
> Task :sdks:python:test-suites:dataflow:py311:setupVirtualenv
Requirement already satisfied: pip in <https://ci-beam.apache.org/job/beam_PreCommit_Python_Integration_Cron/ws/src/build/gradleenv/2050596099/lib/python3.11/site-packages> (22.3.1)
Collecting pip
Using cached pip-23.3-py3-none-any.whl (2.1 MB)
Installing collected packages: pip
Attempting uninstall: pip
Found existing installation: pip 22.3.1
Uninstalling pip-22.3.1:
Successfully uninstalled pip-22.3.1
Successfully installed pip-23.3
Collecting tox
Using cached tox-4.11.3-py3-none-any.whl.metadata (5.0 kB)
Collecting cachetools>=5.3.1 (from tox)
Using cached cachetools-5.3.1-py3-none-any.whl.metadata (5.2 kB)
Collecting chardet>=5.2 (from tox)
Using cached chardet-5.2.0-py3-none-any.whl.metadata (3.4 kB)
Collecting colorama>=0.4.6 (from tox)
Using cached colorama-0.4.6-py2.py3-none-any.whl (25 kB)
Collecting filelock>=3.12.3 (from tox)
Using cached filelock-3.12.4-py3-none-any.whl.metadata (2.8 kB)
Collecting packaging>=23.1 (from tox)
Using cached packaging-23.2-py3-none-any.whl.metadata (3.2 kB)
Collecting platformdirs>=3.10 (from tox)
Using cached platformdirs-3.11.0-py3-none-any.whl.metadata (11 kB)
Collecting pluggy>=1.3 (from tox)
Using cached pluggy-1.3.0-py3-none-any.whl.metadata (4.3 kB)
Collecting pyproject-api>=1.6.1 (from tox)
Using cached pyproject_api-1.6.1-py3-none-any.whl.metadata (2.8 kB)
Collecting virtualenv>=20.24.3 (from tox)
Using cached virtualenv-20.24.5-py3-none-any.whl.metadata (4.5 kB)
Collecting distlib<1,>=0.3.7 (from virtualenv>=20.24.3->tox)
Using cached distlib-0.3.7-py2.py3-none-any.whl.metadata (5.1 kB)
Using cached tox-4.11.3-py3-none-any.whl (153 kB)
Using cached cachetools-5.3.1-py3-none-any.whl (9.3 kB)
Using cached chardet-5.2.0-py3-none-any.whl (199 kB)
Using cached filelock-3.12.4-py3-none-any.whl (11 kB)
Using cached packaging-23.2-py3-none-any.whl (53 kB)
Using cached platformdirs-3.11.0-py3-none-any.whl (17 kB)
Using cached pluggy-1.3.0-py3-none-any.whl (18 kB)
> Task :sdks:python:test-suites:dataflow:py38:setupVirtualenv
Downloading pluggy-1.3.0-py3-none-any.whl (18 kB)
Downloading pyproject_api-1.6.1-py3-none-any.whl (12 kB)
Downloading virtualenv-20.24.5-py3-none-any.whl (3.7 MB)
━━━━━━━━━━━━━━━━━━━━━━━━━━━━━━━━━━━━━━━━ 3.7/3.7 MB 61.1 MB/s eta 0:00:00
Downloading distlib-0.3.7-py2.py3-none-any.whl (468 kB)
━━━━━━━━━━━━━━━━━━━━━━━━━━━━━━━━━━━━━━━━ 468.9/468.9 kB 25.7 MB/s eta 0:00:00
Installing collected packages: distlib, tomli, pluggy, platformdirs, packaging, filelock, colorama, chardet, cachetools, virtualenv, pyproject-api, tox
Successfully installed cachetools-5.3.1 chardet-5.2.0 colorama-0.4.6 distlib-0.3.7 filelock-3.12.4 packaging-23.2 platformdirs-3.11.0 pluggy-1.3.0 pyproject-api-1.6.1 tomli-2.0.1 tox-4.11.3 virtualenv-20.24.5
WARNING: There was an error checking the latest version of pip.
> Task :sdks:python:test-suites:dataflow:py311:setupVirtualenv
Using cached pyproject_api-1.6.1-py3-none-any.whl (12 kB)
Using cached virtualenv-20.24.5-py3-none-any.whl (3.7 MB)
Using cached distlib-0.3.7-py2.py3-none-any.whl (468 kB)
Installing collected packages: distlib, pluggy, platformdirs, packaging, filelock, colorama, chardet, cachetools, virtualenv, pyproject-api, tox
Successfully installed cachetools-5.3.1 chardet-5.2.0 colorama-0.4.6 distlib-0.3.7 filelock-3.12.4 packaging-23.2 platformdirs-3.11.0 pluggy-1.3.0 pyproject-api-1.6.1 tox-4.11.3 virtualenv-20.24.5
FAILURE: Build failed with an exception.
* What went wrong:
Execution failed for task ':sdks:python:setupVirtualenv'.
> Process 'command 'sh'' finished with non-zero exit value 1
* Try:
> Run with --stacktrace option to get the stack trace.
> Run with --info or --debug option to get more log output.
> Get more help at https://help.gradle.org.
Deprecated Gradle features were used in this build, making it incompatible with Gradle 9.0.
You can use '--warning-mode all' to show the individual deprecation warnings and determine if they come from your own scripts or plugins.
For more on this, please refer to https://docs.gradle.org/8.3/userguide/command_line_interface.html#sec:command_line_warnings in the Gradle documentation.
BUILD FAILED in 43s
7 actionable tasks: 6 executed, 1 from cache
Publishing build scan...
https://ge.apache.org/s/to54cficdar5k
Build step 'Invoke Gradle script' changed build result to FAILURE
Build step 'Invoke Gradle script' marked build as failure
---------------------------------------------------------------------
To unsubscribe, e-mail: builds-unsubscribe@beam.apache.org
For additional commands, e-mail: builds-help@beam.apache.org
Jenkins build is back to normal : beam_PreCommit_Python_Integration_Cron #1136
Posted by Apache Jenkins Server <je...@builds.apache.org>.
See <https://ci-beam.apache.org/job/beam_PreCommit_Python_Integration_Cron/1136/display/redirect>
---------------------------------------------------------------------
To unsubscribe, e-mail: builds-unsubscribe@beam.apache.org
For additional commands, e-mail: builds-help@beam.apache.org