You are viewing a plain text version of this content. The canonical link for it is here.
Posted to dev@poi.apache.org by Apache Jenkins Server <je...@builds.apache.org> on 2022/08/15 13:02:00 UTC

Build failed in Jenkins: POI » POI-DSL-Windows-1.8 #608

See <https://ci-builds.apache.org/job/POI/job/POI-DSL-Windows-1.8/608/display/redirect?page=changes>

Changes:

[PJ Fanning] upgrade woodstox

[PJ Fanning] update changes

[PJ Fanning] update changes

[PJ Fanning] matche log4j-api version

[PJ Fanning] mockito 4.7.0


------------------------------------------
[...truncated 274.74 KB...]
M M STCAL: Call to method of static java.text.DateFormat in org.apache.poi.ss.usermodel.TestExcelStyleDateFormatter.testWithPattern()  At TestExcelStyleDateFormatter.java:[line 137]
M D DLS: Dead store to e2 in org.apache.poi.ss.usermodel.BaseTestSheetUpdateArrayFormulas.testArrayFormulas_illegalCalls()  At BaseTestSheetUpdateArrayFormulas.java:[line 161]
H P Dm: org.apache.poi.util.MemoryLeakVerifier.assertGarbageCollected(WeakReference, int) forces garbage collection; extremely dubious except in benchmarking code  At MemoryLeakVerifier.java:[line 93]
M P UPM: Private method org.apache.poi.ss.formula.functions.TestTDistLt.confirmValue(String, String, String, double) is never called  At TestTDistLt.java:[lines 66-67]
M D RV: Return value of IntList.get(int) ignored, but method has no side effect  At TestIntList.java:[line 278]
M C EC: Using .equals to compare two byte[]'s, (equivalent to ==) in org.apache.poi.ddf.TestEscherBlipRecord.testReadPNG()  At TestEscherBlipRecord.java:[line 77]
M C EC: Using .equals to compare two byte[]'s, (equivalent to ==) in org.apache.poi.ddf.TestEscherBlipRecord.testReadPICT()  At TestEscherBlipRecord.java:[line 129]
M C EC: Using .equals to compare two byte[]'s, (equivalent to ==) in org.apache.poi.ddf.TestEscherBlipRecord.testReadPICT()  At TestEscherBlipRecord.java:[line 130]
M D DLS: Dead store to row in org.apache.poi.ss.usermodel.BaseTestDataValidation$WorkbookFormatter.createDVTypeRow(String)  At BaseTestDataValidation.java:[line 267]
M D DLS: Dead store to row in org.apache.poi.ss.usermodel.BaseTestDataValidation$WorkbookFormatter.createDVDescriptionRow(String)  At BaseTestDataValidation.java:[line 309]
M D RV: Return value of new ShortField(int, short) ignored, but method has no side effect  At TestShortField.java:[line 41]
M D RV: Return value of new ShortField(int) ignored, but method has no side effect  At TestShortField.java:[line 37]
M X OBL: org.apache.poi.hpsf.basic.TestWriteWellKnown.write2ndFile(File, File) may fail to clean up java.io.OutputStream on checked exception  Obligation to clean up resource created at TestWriteWellKnown.java:[line 418] is not discharged
M X OBL: org.apache.poi.hpsf.basic.TestWriteWellKnown.write1stFile(File, File) may fail to clean up java.io.OutputStream on checked exception  Obligation to clean up resource created at TestWriteWellKnown.java:[line 297] is not discharged
M X OBL: org.apache.poi.hpsf.basic.TestWriteWellKnown.testWriteWellKnown() may fail to clean up java.io.InputStream on checked exception  Obligation to clean up resource created at TestWriteWellKnown.java:[line 180] is not discharged
M D DB: org.apache.poi.ss.usermodel.BaseTestCell.checkUnicodeValues(Workbook) uses the same code for two branches  At BaseTestCell.java:[line 936]
M B OS: org.apache.poi.sl.usermodel.BaseTestSlideShowFactory.readExternalFile(String) may fail to close stream  At BaseTestSlideShowFactory.java:[line 136]
M X OBL: org.apache.poi.hssf.usermodel.TestHSSFWorkbook.writeAndCloseWorkbook(Workbook, File) may fail to clean up java.io.OutputStream on checked exception  Obligation to clean up resource created at TestHSSFWorkbook.java:[line 1084] is not discharged
M D SF: Switch statement found in org.apache.poi.ss.formula.functions.BaseTestFunctionsFromSpreadsheet.processFunctionRow(String, String, HSSFSheet, int, HSSFFormulaEvaluator, int) where one case falls through to the next case  At BaseTestFunctionsFromSpreadsheet.java:[lines 174-176]
M D DLS: Dead store to textbox2 in org.apache.poi.hssf.usermodel.TestShapeGroup.testModify()  At TestShapeGroup.java:[line 158]
M D RV: Return value of HSSFShapeGroup.getShapeId() ignored, but method has no side effect  At TestShapeGroup.java:[line 224]
M B OS: org.apache.poi.ss.util.NumberRenderingSpreadsheetGenerator.interpretLong(byte[], int) may fail to close stream  At NumberRenderingSpreadsheetGenerator.java:[line 216]
M D DLS: Dead store to ish in org.apache.poi.hssf.usermodel.TestHSSFPicture.bsePictureRef()  At TestHSSFPicture.java:[line 178]
M D DLS: Dead store to p1 in org.apache.poi.hssf.usermodel.TestHSSFPicture.bsePictureRef()  At TestHSSFPicture.java:[line 184]
M X OBL: org.apache.poi.util.TestTempFile.testCreateTempFile() may fail to clean up java.io.OutputStream on checked exception  Obligation to clean up resource created at TestTempFile.java:[line 92] is not discharged
M D NP: Dereference of the result of readLine() without nullcheck in org.apache.poi.ss.usermodel.TestFractionFormat.testTruthFile()  At TestFractionFormat.java:[line 90]
M D DLS: Dead store to row in org.apache.poi.hssf.record.aggregates.TestValueRecordsAggregate.testRemoveNewRow_bug46312()  At TestValueRecordsAggregate.java:[line 330]
M D DMI: Hard coded reference to an absolute pathname in org.apache.poi.util.TestIOUtils.lambda$testCopyToInvalidFile$6(InputStream)  At TestIOUtils.java:[line 278]
M D DMI: Hard coded reference to an absolute pathname in org.apache.poi.util.TestIOUtils.lambda$testCopyToInvalidFile$6(InputStream)  At TestIOUtils.java:[line 277]
M B OS: org.apache.poi.hssf.record.TestSSTRecord.concatHexDumps(String[]) may fail to close stream  At TestSSTRecord.java:[line 52]
M B OS: org.apache.poi.hssf.record.TestSSTRecord.concatHexDumps(String[]) may fail to close stream  At TestSSTRecord.java:[line 55]
M P WMI: org.apache.poi.hssf.usermodel.TestHSSFPalette.compareToDefaults(TestHSSFPalette$ColorComparator) makes inefficient use of keySet iterator instead of entrySet iterator  At TestHSSFPalette.java:[line 267]
M D NP: Possible null pointer dereference in org.apache.poi.hpsf.basic.TestReadAllFiles.files() due to return value of called method  Method invoked at TestReadAllFiles.java:[line 60]
M D RV: Return value of org.apache.poi.hpsf.PropertySet.getByteOrder() ignored, but method has no side effect  At TestReadAllFiles.java:[line 159]
M B OS: org.apache.poi.hssf.model.TestDrawingAggregate.testIncompleteData() may fail to close stream  At TestDrawingAggregate.java:[line 225]
M B OS: org.apache.poi.hssf.model.TestDrawingAggregate.toByteArray(List) may fail to close stream  At TestDrawingAggregate.java:[line 251]
M B OS: org.apache.poi.hssf.model.TestEscherRecordFactory.toByteArray(List) may fail to close stream  At TestEscherRecordFactory.java:[line 42]
M C DMI: BigDecimal constructed from 15.3 in org.apache.poi.ss.formula.ptg.TestExternalNameReference.testEvaluate()  At TestExternalNameReference.java:[line 128]
M B Nm: Class org.apache.poi.poifs.filesystem.TestNotOLE2Exception is not derived from an Exception, even though it is named as such  At TestNotOLE2Exception.java:[lines 36-78]
M B CNT: Rough value of Math.PI found: 3.14  At TestWorkbookEvaluator.java:[line 301]
M D DLS: Dead store to cellB1 in org.apache.poi.ss.formula.TestWorkbookEvaluator.testRefToBlankCellInArrayFormula()  At TestWorkbookEvaluator.java:[line 613]
M B Nm: Class org.apache.poi.poifs.filesystem.TestOfficeXMLException is not derived from an Exception, even though it is named as such  At TestOfficeXMLException.java:[lines 38-125]
M D SF: Switch statement found in org.apache.poi.ss.formula.eval.TestFormulasFromSpreadsheet.processFunctionRow(String, int, int) where one case falls through to the next case  At TestFormulasFromSpreadsheet.java:[lines 198-200]
M X OBL: org.apache.poi.hssf.usermodel.TestFormulaEvaluatorBugs.test44636() may fail to clean up java.io.OutputStream on checked exception  Obligation to clean up resource created at TestFormulaEvaluatorBugs.java:[line 96] is not discharged
M X OBL: org.apache.poi.hssf.usermodel.TestFormulaEvaluatorBugs.test55747_55324() may fail to clean up java.io.OutputStream on checked exception  Obligation to clean up resource created at TestFormulaEvaluatorBugs.java:[line 556] is not discharged
M D DLS: Dead store to hour in org.apache.poi.hssf.usermodel.TestFormulas.testDateFormulas()  At TestFormulas.java:[line 639]
M D RV: Return value of POIFSMiniStore.getBATBlockAndIndex(int) ignored, but method has no side effect  At TestPOIFSMiniStore.java:[line 250]
M B FS: Format string should use %n rather than \n in org.apache.poi.hssf.dev.TestFormulaViewer.parseFormulaRecord(FormulaRecord)  At TestFormulaViewer.java:[line 111]
M B OS: org.apache.poi.hssf.dev.TestFormulaViewer.runOneFile(File) may fail to close stream  At TestFormulaViewer.java:[line 56]
M D RV: Return value of POIFSFileSystem.getBATBlockAndIndex(int) ignored, but method has no side effect  At TestPOIFSStream.java:[line 1231]
M D RV: Return value of POIFSMiniStore.getBATBlockAndIndex(int) ignored, but method has no side effect  At TestPOIFSStream.java:[line 1273]
M D RV: Return value of POIFSMiniStore.getBATBlockAndIndex(int) ignored, but method has no side effect  At TestPOIFSStream.java:[line 1336]
M D RV: Return value of POIFSFileSystem.getBATBlockAndIndex(int) ignored, but method has no side effect  At TestPOIFSStream.java:[line 1293]
M D RV: Return value of POIFSFileSystem.getBATBlockAndIndex(int) ignored, but method has no side effect  At TestPOIFSStream.java:[line 1625]
M D RV: Return value of POIFSFileSystem.getBATBlockAndIndex(int) ignored, but method has no side effect  At TestPOIFSStream.java:[line 1608]
M D RV: Return value of POIFSFileSystem.getBATBlockAndIndex(int) ignored, but method has no side effect  At TestPOIFSStream.java:[line 1598]
M D RV: Return value of POIFSFileSystem.getBATBlockAndIndex(int) ignored, but method has no side effect  At TestPOIFSStream.java:[line 1577]
M D RV: Return value of POIFSFileSystem.getBATBlockAndIndex(int) ignored, but method has no side effect  At TestPOIFSStream.java:[line 1559]
M D RV: Return value of POIFSFileSystem.getBATBlockAndIndex(int) ignored, but method has no side effect  At TestPOIFSStream.java:[line 1532]
M D RV: Return value of POIFSMiniStore.getBATBlockAndIndex(int) ignored, but method has no side effect  At TestPOIFSStream.java:[line 1339]
M D RV: Return value of POIFSFileSystem.getBATBlockAndIndex(int) ignored, but method has no side effect  At TestPOIFSStream.java:[line 1295]
M D RV: Return value of POIFSMiniStore.getBATBlockAndIndex(int) ignored, but method has no side effect  At TestPOIFSStream.java:[line 1275]
M D RV: Return value of POIFSFileSystem.getBATBlockAndIndex(int) ignored, but method has no side effect  At TestPOIFSStream.java:[line 1233]
M P SS: Unread field: org.apache.poi.hssf.usermodel.TestNonStandardWorkbookStreamNames.xlsA; should this field be static?  At TestNonStandardWorkbookStreamNames.java:[line 37]
M P SS: Unread field: org.apache.poi.hssf.dev.TestFormulaViewer.doListFormula; should this field be static?  At TestFormulaViewer.java:[line 51]
M D UrF: Unread public/protected field: org.apache.poi.ss.usermodel.BaseTestRangeCopier.testDataProvider  At TestHSSFRangeCopier.java:[line 32]
M P SS: Unread field: org.apache.poi.hssf.usermodel.TestNonStandardWorkbookStreamNames.xlsB; should this field be static?  At TestNonStandardWorkbookStreamNames.java:[line 38]
M P UrF: Unread field: org.apache.poi.hssf.record.TestTableRecord.header  At TestTableRecord.java:[line 32]
SpotBugs ended with exit code 1

> Task :poi-ooxml-lite:compileOoxmlLite
> Task :poi:test
> Task :poi-scratchpad:check

> Task :poi-ooxml-lite:compileOoxmlLite
Execution optimizations have been disabled for task ':poi-ooxml-lite:compileOoxmlLite' to ensure correctness due to the following reasons:
  - Gradle detected a problem with the following location: 'F:\jenkins\jenkins-home\712657a4\workspace\POI\POI-DSL-Windows-1.8\poi-ooxml-full\build'. Reason: Task ':poi-ooxml-lite:compileOoxmlLite' uses this output of task ':poi-ooxml-full:compileJava' without declaring an explicit or implicit dependency. This can lead to incorrect results being produced, depending on what order the tasks are executed. Please refer to https://docs.gradle.org/7.5/userguide/validation_problems.html#implicit_dependency for more details about this problem.

> Task :poi-scratchpad:getDeps
> Task :poi:check
> Task :poi-scratchpad:jacocoTestReport
> Task :poi:getDeps
> Task :poi:jacocoTestReport
> Task :poi-ooxml-full:processResources NO-SOURCE
> Task :poi-ooxml-full:classes
> Task :poi-ooxml-full:sourceJar
> Task :poi-ooxml-full:jar
> Task :poi-ooxml-full:compileJava9 SKIPPED
> Task :poi-ooxml-full:cacheJava9 NO-SOURCE
> Task :poi-ooxml-full:javadoc SKIPPED
> Task :poi-ooxml-full:javadocJar SKIPPED
> Task :poi-ooxml-full:sourcesJar
> Task :poi-ooxml-full:assemble
> Task :poi-ooxml-full:forbiddenApisMain UP-TO-DATE
> Task :poi-ooxml-full:compileTestJava NO-SOURCE
> Task :poi-ooxml-full:processTestResources NO-SOURCE
> Task :poi-ooxml-full:testClasses UP-TO-DATE
> Task :poi-ooxml-full:forbiddenApisTest NO-SOURCE
> Task :poi-ooxml-full:forbiddenApis UP-TO-DATE
> Task :poi-ooxml-full:spotbugsMain SKIPPED
> Task :poi-ooxml-full:spotbugsTest SKIPPED
> Task :poi-ooxml-full:test NO-SOURCE
> Task :poi-ooxml-full:check UP-TO-DATE
> Task :poi-ooxml-full:build

> Task :poi-ooxml:compileJava
F:\jenkins\jenkins-home\712657a4\workspace\POI\POI-DSL-Windows-1.8\poi-ooxml\src\main\java\org\apache\poi\xssf\usermodel\BaseXSSFEvaluationWorkbook.java:170: warning: [deprecation] getNameAt(int) in org.apache.poi.xssf.usermodel.XSSFWorkbook has been deprecated
            XSSFName nm = _uBook.getNameAt(i);
                                ^
F:\jenkins\jenkins-home\712657a4\workspace\POI\POI-DSL-Windows-1.8\poi-ooxml\src\main\java\org\apache\poi\xssf\usermodel\BaseXSSFEvaluationWorkbook.java:214: warning: [deprecation] getNameIndex(java.lang.String) in org.apache.poi.xssf.usermodel.XSSFWorkbook has been deprecated
            int nameIdx = _uBook.getNameIndex(nameName);
                                ^
F:\jenkins\jenkins-home\712657a4\workspace\POI\POI-DSL-Windows-1.8\poi-ooxml\src\main\java\org\apache\poi\xssf\usermodel\BaseXSSFEvaluationWorkbook.java:285: warning: [deprecation] getNameAt(int) in org.apache.poi.xssf.usermodel.XSSFWorkbook has been deprecated
        XSSFName xname = _uBook.getNameAt(idx);
                               ^
F:\jenkins\jenkins-home\712657a4\workspace\POI\POI-DSL-Windows-1.8\poi-ooxml\src\main\java\org\apache\poi\xssf\usermodel\BaseXSSFEvaluationWorkbook.java:340: warning: [deprecation] getNameAt(int) in org.apache.poi.xssf.usermodel.XSSFWorkbook has been deprecated
        return _uBook.getNameAt(namePtg.getIndex()).getNameName();
                     ^
F:\jenkins\jenkins-home\712657a4\workspace\POI\POI-DSL-Windows-1.8\poi-ooxml\src\main\java\org\apache\poi\xssf\usermodel\BaseXSSFEvaluationWorkbook.java:345: warning: [deprecation] getNameAt(int) in org.apache.poi.xssf.usermodel.XSSFWorkbook has been deprecated
        return new Name(_uBook.getNameAt(ix), ix, this);
                              ^
F:\jenkins\jenkins-home\712657a4\workspace\POI\POI-DSL-Windows-1.8\poi-ooxml\src\main\java\org\apache\poi\xssf\usermodel\BaseXSSFFormulaEvaluator.java:137: warning: [deprecation] setCellType(org.apache.poi.ss.usermodel.CellType) in org.apache.poi.ss.usermodel.Cell has been deprecated
            cell.setCellType(cellType);
                ^
F:\jenkins\jenkins-home\712657a4\workspace\POI\POI-DSL-Windows-1.8\poi-ooxml\src\main\java\org\apache\poi\xssf\streaming\StreamingSheetWriter.java:53: warning: [deprecation] createTempFile() in org.apache.poi.xssf.streaming.SheetDataWriter has been deprecated
    public File createTempFile() throws IOException {
                ^
F:\jenkins\jenkins-home\712657a4\workspace\POI\POI-DSL-Windows-1.8\poi-ooxml\src\main\java\org\apache\poi\xssf\streaming\StreamingSheetWriter.java:58: warning: [deprecation] createWriter(java.io.File) in org.apache.poi.xssf.streaming.SheetDataWriter has been deprecated
    public Writer createWriter(File fd) throws IOException {
                  ^
8 warnings

> Task :poi-ooxml:classes
> Task :poi-ooxml:jar
> Task :poi-ooxml-lite:compileJava
> Task :poi-ooxml-full:getDeps
> Task :poi:javadoc
> Task :allJavaDoc
> Task :poi-ooxml-lite:processResources
> Task :poi-ooxml-lite:classes
> Task :poi-ooxml-lite:jar
> Task :poi-examples:compileJava
> Task :poi-excelant:compileJava
> Task :poi-ooxml:compileTestJava
> Task :poi-excelant:compileJava9 SKIPPED
> Task :poi-excelant:cacheJava9 NO-SOURCE
> Task :poi-excelant:classes
> Task :poi-ooxml-lite:compileJava9 SKIPPED
> Task :poi-ooxml-lite:cacheJava9 NO-SOURCE

> Task :poi-ooxml:compileTestJava
F:\jenkins\jenkins-home\712657a4\workspace\POI\POI-DSL-Windows-1.8\poi-ooxml\src\test\java\org\apache\poi\xssf\usermodel\TestXSSFFont.java:20: warning: [deprecation] org.apache.poi.ss.usermodel.FontCharset in org.apache.poi.ss.usermodel has been deprecated
import static org.apache.poi.ss.usermodel.FontCharset.*;
                                         ^
F:\jenkins\jenkins-home\712657a4\workspace\POI\POI-DSL-Windows-1.8\poi-ooxml\src\test\java\org\apache\poi\xddf\usermodel\chart\TestXDDFChartRemoveSeries.java:126: warning: [deprecation] getSeries() in org.apache.poi.xddf.usermodel.chart.XDDFChartData has been deprecated
        assertThrows(UnsupportedOperationException.class, () -> chartData.getSeries().remove(0));
                                                                         ^

> Task :poi:javadocJar
> Task :poi:assemble
> Task :poi:build
> Task :poi-excelant:jar
> Task :poi-examples:compileJava9 SKIPPED
> Task :poi-examples:cacheJava9 NO-SOURCE
> Task :poi-examples:classes
> Task :zipJavadocs

> Task :binDistTar FAILED
Execution optimizations have been disabled for task ':binDistTar' to ensure correctness due to the following reasons:
  - Gradle detected a problem with the following location: 'F:\jenkins\jenkins-home\712657a4\workspace\POI\POI-DSL-Windows-1.8\build\dist\maven'. Reason: Task ':binDistTar' uses this output of task ':poi-examples:jar' without declaring an explicit or implicit dependency. This can lead to incorrect results being produced, depending on what order the tasks are executed. Please refer to https://docs.gradle.org/7.5/userguide/validation_problems.html#implicit_dependency for more details about this problem.
  - Gradle detected a problem with the following location: 'F:\jenkins\jenkins-home\712657a4\workspace\POI\POI-DSL-Windows-1.8\build\dist\maven'. Reason: Task ':binDistTar' uses this output of task ':poi-excelant:jar' without declaring an explicit or implicit dependency. This can lead to incorrect results being produced, depending on what order the tasks are executed. Please refer to https://docs.gradle.org/7.5/userguide/validation_problems.html#implicit_dependency for more details about this problem.

> Task :fixDistDir
> Task :poi-examples:jar

> Task :poi-ooxml:compileTestJava
F:\jenkins\jenkins-home\712657a4\workspace\POI\POI-DSL-Windows-1.8\poi-ooxml\src\test\java\org\apache\poi\xssf\usermodel\TestXSSFSheet.java:288: warning: [deprecation] createSplitPane(int,int,int,int,int) in org.apache.poi.xssf.usermodel.XSSFSheet has been deprecated
            sheet.createSplitPane(4, 8, 12, 12, PaneInformation.PANE_LOWER_RIGHT + 1);
                 ^
F:\jenkins\jenkins-home\712657a4\workspace\POI\POI-DSL-Windows-1.8\poi-ooxml\src\test\java\org\apache\poi\xssf\usermodel\TestXSSFWorkbook.java:1362: warning: [deprecation] getCTExternalLink() in org.apache.poi.xssf.model.ExternalLinksTable has been deprecated
                CTExternalLink link = workbook2.getExternalLinksTable().get(0).getCTExternalLink();
                                                                              ^
F:\jenkins\jenkins-home\712657a4\workspace\POI\POI-DSL-Windows-1.8\poi-ooxml\src\test\java\org\apache\poi\xwpf\usermodel\TestXWPFRun.java:204: warning: [deprecation] getFontSize() in org.apache.poi.xwpf.usermodel.XWPFRun has been deprecated
        assertEquals(7, run.getFontSize());
                           ^
F:\jenkins\jenkins-home\712657a4\workspace\POI\POI-DSL-Windows-1.8\poi-ooxml\src\test\java\org\apache\poi\xwpf\usermodel\TestXWPFRun.java:212: warning: [deprecation] getFontSize() in org.apache.poi.xwpf.usermodel.XWPFRun has been deprecated
        assertEquals(25, run.getFontSize());
                            ^
F:\jenkins\jenkins-home\712657a4\workspace\POI\POI-DSL-Windows-1.8\poi-ooxml\src\test\java\org\apache\poi\xwpf\usermodel\TestXWPFRun.java:592: warning: [deprecation] getFontSize() in org.apache.poi.xwpf.usermodel.XWPFRun has been deprecated
            assertEquals(-1, run.getFontSize());
                                ^
F:\jenkins\jenkins-home\712657a4\workspace\POI\POI-DSL-Windows-1.8\poi-ooxml\src\test\java\org\apache\poi\xwpf\usermodel\TestXWPFRun.java:595: warning: [deprecation] getFontSize() in org.apache.poi.xwpf.usermodel.XWPFRun has been deprecated
            assertEquals(10, run.getFontSize());
                                ^
F:\jenkins\jenkins-home\712657a4\workspace\POI\POI-DSL-Windows-1.8\poi-ooxml\src\test\java\org\apache\poi\xwpf\usermodel\TestXWPFRun.java:598: warning: [deprecation] getFontSize() in org.apache.poi.xwpf.usermodel.XWPFRun has been deprecated
            assertEquals(Short.MAX_VALUE - 1, run.getFontSize());
                                                 ^
F:\jenkins\jenkins-home\712657a4\workspace\POI\POI-DSL-Windows-1.8\poi-ooxml\src\test\java\org\apache\poi\xwpf\usermodel\TestXWPFRun.java:601: warning: [deprecation] getFontSize() in org.apache.poi.xwpf.usermodel.XWPFRun has been deprecated
            assertEquals(Short.MAX_VALUE, run.getFontSize());
                                             ^
F:\jenkins\jenkins-home\712657a4\workspace\POI\POI-DSL-Windows-1.8\poi-ooxml\src\test\java\org\apache\poi\xwpf\usermodel\TestXWPFRun.java:604: warning: [deprecation] getFontSize() in org.apache.poi.xwpf.usermodel.XWPFRun has been deprecated
            assertEquals(Short.MAX_VALUE + 1, run.getFontSize());
                                                 ^
F:\jenkins\jenkins-home\712657a4\workspace\POI\POI-DSL-Windows-1.8\poi-ooxml\src\test\java\org\apache\poi\xwpf\usermodel\TestXWPFRun.java:607: warning: [deprecation] getFontSize() in org.apache.poi.xwpf.usermodel.XWPFRun has been deprecated
            assertEquals(Integer.MAX_VALUE - 1, run.getFontSize());
                                                   ^
F:\jenkins\jenkins-home\712657a4\workspace\POI\POI-DSL-Windows-1.8\poi-ooxml\src\test\java\org\apache\poi\xwpf\usermodel\TestXWPFRun.java:610: warning: [deprecation] getFontSize() in org.apache.poi.xwpf.usermodel.XWPFRun has been deprecated
            assertEquals(Integer.MAX_VALUE, run.getFontSize());
                                               ^
F:\jenkins\jenkins-home\712657a4\workspace\POI\POI-DSL-Windows-1.8\poi-ooxml\src\test\java\org\apache\poi\xwpf\usermodel\TestXWPFRun.java:613: warning: [deprecation] getFontSize() in org.apache.poi.xwpf.usermodel.XWPFRun has been deprecated
            assertEquals(-1, run.getFontSize());
                                ^
F:\jenkins\jenkins-home\712657a4\workspace\POI\POI-DSL-Windows-1.8\poi-ooxml\src\test\java\org\apache\poi\xwpf\usermodel\TestXWPFRun.java:661: warning: [deprecation] getFontSize() in org.apache.poi.xwpf.usermodel.XWPFRun has been deprecated
            assertEquals(10, run.getFontSize());
                                ^
15 warnings

> Task :poi-excelant:javadoc

FAILURE: Build failed with an exception.

* What went wrong:
Execution failed for task ':binDistTar'.
> Could not add file 'F:\jenkins\jenkins-home\712657a4\workspace\POI\POI-DSL-Windows-1.8\build\dist\maven\poi-examples\poi-examples-5.2.3-SNAPSHOT.jar' to TAR 'F:\jenkins\jenkins-home\712657a4\workspace\POI\POI-DSL-Windows-1.8\build\distributions\poi-bin-5.2.3-SNAPSHOT-20220815.tgz'.

* Try:
> Run with --stacktrace option to get the stack trace.
> Run with --info or --debug option to get more log output.
> Run with --scan to get full insights.

* Get more help at https://help.gradle.org

Deprecated Gradle features were used in this build, making it incompatible with Gradle 8.0.

You can use '--warning-mode all' to show the individual deprecation warnings and determine if they come from your own scripts or plugins.

See https://docs.gradle.org/7.5/userguide/command_line_interface.html#sec:command_line_warnings

Execution optimizations have been disabled for 2 invalid unit(s) of work during this build to ensure correctness.
Please consult deprecation warnings for more details.

BUILD FAILED in 10m 13s
83 actionable tasks: 78 executed, 5 up-to-date
Build step 'Invoke Gradle script' changed build result to FAILURE
Build step 'Invoke Gradle script' marked build as failure
[SpotBugs] Skipping execution of recorder since overall result is 'FAILURE'
Archiving artifacts
Recording test results
[Checks API] No suitable checks publisher found.

---------------------------------------------------------------------
To unsubscribe, e-mail: dev-unsubscribe@poi.apache.org
For additional commands, e-mail: dev-help@poi.apache.org


Jenkins build is back to normal : POI » POI-DSL-Windows-1.8 #609

Posted by Apache Jenkins Server <je...@builds.apache.org>.
See <https://ci-builds.apache.org/job/POI/job/POI-DSL-Windows-1.8/609/display/redirect?page=changes>


---------------------------------------------------------------------
To unsubscribe, e-mail: dev-unsubscribe@poi.apache.org
For additional commands, e-mail: dev-help@poi.apache.org