You are viewing a plain text version of this content. The canonical link for it is here.
Posted to builds@cassandra.apache.org by Apache Jenkins Server <je...@builds.apache.org> on 2024/09/29 07:14:50 UTC

Build complete: Cassandra-5.0 #314 [ABORTED] 07c1f93b06ff2ec027cea9680557aa2a0f520202

-------------------------------------------------------------------------------
  Build Cassandra-5.0 #314 Aborted
  URL: https://ci-cassandra.apache.org/job/Cassandra-5.0/314/
  -------------------------------------------------------------------------------
  Changes:
  [Stefan Miklosovic] Ensure thread-safety for CommitLogArchiver in CommitLog


  -------------------------------------------------------------------------------
  Failed Tests:
  4 tests failed.
FAILED:  org.apache.cassandra.db.commitlog.CommitLogSegmentManagerCDCTest.Tests / test-latest jdk17 5/8 / testSegmentFlaggingWithNonblockingOnCreation-cassandra.testtag_IS_UNDEFINED
FAILED:  dtest-upgrade-novnode-large.upgrade_tests.upgrade_through_versions_test.TestProtoV3Upgrade_AllVersions_EndsAt_Trunk_HEAD.Tests / dtest-upgrade-novnode-large jdk11 5/32 / test_parallel_upgrade
FAILED:  org.apache.cassandra.db.compaction.CompactionStrategyManagerPendingRepairTest.Tests / test-latest jdk11 4/8 / testFinalizedAndCompactionRace-latest_jdk11_x86_64
FAILED:  org.apache.cassandra.db.compaction.CompactionStrategyManagerPendingRepairTest.Tests / test-latest jdk17 4/8 / testFinalizedAndCompactionRace-latest_jdk17_x86_64

  -------------------------------------------------------------------------------
  For complete test report and logs see https://nightlies.apache.org/cassandra/Cassandra-5.0/314/