You are viewing a plain text version of this content. The canonical link for it is here.
Posted to builds@beam.apache.org by Apache Jenkins Server <je...@builds.apache.org> on 2022/08/20 15:55:19 UTC
Build failed in Jenkins: beam_PostCommit_Go #10221
See <https://ci-beam.apache.org/job/beam_PostCommit_Go/10221/display/redirect>
Changes:
------------------------------------------
[...truncated 887.06 KB...]
capabilities: "beam:coder:iterable:v1"
capabilities: "beam:coder:state_backed_iterable:v1"
capabilities: "beam:coder:windowed_value:v1"
capabilities: "beam:coder:global_window:v1"
capabilities: "beam:coder:interval_window:v1"
capabilities: "beam:coder:row:v1"
capabilities: "beam:coder:nullable:v1"
dependencies: <
type_urn: "beam:artifact:type:url:v1"
type_payload: "\nngs://temp-storage-for-end-to-end-tests/staging-validatesrunner-test/test32220/go-13-1661009774651156981/worker\022@1d10ae38411c476ff3c3266a5d94305e31b27e9200586aea96da64c59efe2479"
role_urn: "beam:artifact:role:go_worker_binary:v1"
>
>
>
>
root_transform_ids: "e1"
root_transform_ids: "e2"
root_transform_ids: "e3"
root_transform_ids: "e4"
root_transform_ids: "e5"
root_transform_ids: "e6"
root_transform_ids: "e7"
root_transform_ids: "s1"
2022/08/20 15:36:19 Staged model pipeline: gs://temp-storage-for-end-to-end-tests/staging-validatesrunner-test/test32220/go-13-1661009774651156981/model
2022/08/20 15:36:19 {
"environment": {
"debugOptions": {},
"experiments": [
"use_unified_worker",
"use_portable_job_submission",
"beam_fn_api",
"use_staged_dataflow_worker_jar"
],
"sdkPipelineOptions": {
"display_data": [
{
"key": "name",
"namespace": "options",
"type": "STRING",
"value": "go-testemitpardoaftergbk-367"
},
{
"key": "experiments",
"namespace": "options",
"type": "STRING",
"value": "use_unified_worker,use_portable_job_submission"
},
{
"key": "project",
"namespace": "options",
"type": "STRING",
"value": "apache-beam-testing"
},
{
"key": "region",
"namespace": "options",
"type": "STRING",
"value": "us-central1"
},
{
"key": "container_images",
"namespace": "options",
"type": "STRING",
"value": "us.gcr.io/apache-beam-testing/jenkins/beam_go_sdk:20220820-143502"
},
{
"key": "temp_location",
"namespace": "options",
"type": "STRING",
"value": "gs://temp-storage-for-end-to-end-tests/temp-validatesrunner-test/test32220"
},
{
"key": "hookOrder",
"namespace": "go_options",
"type": "STRING",
"value": "[\"default_remote_logging\"]"
},
{
"key": "temp_location",
"namespace": "go_options",
"type": "STRING",
"value": "gs://temp-storage-for-end-to-end-tests/temp-validatesrunner-test/test32220"
},
{
"key": "test.paniconexit0",
"namespace": "go_options",
"type": "STRING",
"value": "true"
},
{
"key": "test.timeout",
"namespace": "go_options",
"type": "STRING",
"value": "2h0m0s"
},
{
"key": "test.v",
"namespace": "go_options",
"type": "STRING",
"value": "true"
},
{
"key": "hooks",
"namespace": "go_options",
"type": "STRING",
"value": "{\"default_remote_logging\":null}"
}
],
"options": {
"experiments": [
"use_unified_worker",
"use_portable_job_submission",
"beam_fn_api",
"use_staged_dataflow_worker_jar"
],
"pipelineUrl": "gs://temp-storage-for-end-to-end-tests/staging-validatesrunner-test/test32220/go-13-1661009774651156981/model",
"region": "us-central1",
"tempLocation": "gs://temp-storage-for-end-to-end-tests/temp-validatesrunner-test/test32220"
},
"beam:option:go_options:v1": {
"options": {
"hookOrder": "[\"default_remote_logging\"]",
"hooks": "{\"default_remote_logging\":null}",
"temp_location": "gs://temp-storage-for-end-to-end-tests/temp-validatesrunner-test/test32220",
"test.paniconexit0": "true",
"test.timeout": "2h0m0s",
"test.v": "true"
}
}
},
"tempStoragePrefix": "gs://temp-storage-for-end-to-end-tests/temp-validatesrunner-test/test32220",
"userAgent": {
"name": "Apache Beam SDK for Go",
"version": "2.42.0.dev"
},
"version": {
"job_type": "FNAPI_BATCH",
"major": "6"
},
"workerPools": [
{
"autoscalingSettings": {},
"ipConfiguration": "WORKER_IP_UNSPECIFIED",
"kind": "harness",
"numWorkers": 1,
"packages": [
{
"location": "gs://temp-storage-for-end-to-end-tests/staging-validatesrunner-test/test32220/go-13-1661009774651156981/worker",
"name": "worker"
},
{
"location": "gs://temp-storage-for-end-to-end-tests/staging-validatesrunner-test/test32220/go-13-1661009774651156981/dataflow-worker.jar",
"name": "dataflow-worker.jar"
}
],
"sdkHarnessContainerImages": [
{
"containerImage": "us.gcr.io/apache-beam-testing/jenkins/beam_go_sdk:20220820-143502"
}
],
"workerHarnessContainerImage": "us.gcr.io/apache-beam-testing/jenkins/beam_go_sdk:20220820-143502"
}
]
},
"name": "go-testemitpardoaftergbk-367",
"projectId": "apache-beam-testing",
"type": "JOB_TYPE_BATCH"
}
2022/08/20 15:36:19 Submitted job: 2022-08-20_08_36_19-9571021338690023687
2022/08/20 15:36:19 Console: https://console.cloud.google.com/dataflow/jobs/us-central1/2022-08-20_08_36_19-9571021338690023687?project=apache-beam-testing
2022/08/20 15:36:19 Logs: https://console.cloud.google.com/logs/viewer?project=apache-beam-testing&resource=dataflow_step%2Fjob_id%2F2022-08-20_08_36_19-9571021338690023687
2022/08/20 15:36:19 Job state: JOB_STATE_PENDING ...
2022/08/20 15:36:49 Job still running ...
2022/08/20 15:37:20 Job still running ...
2022/08/20 15:37:50 Job still running ...
2022/08/20 15:38:20 Job still running ...
2022/08/20 15:38:50 Job still running ...
2022/08/20 15:39:20 Job still running ...
2022/08/20 15:39:50 Job still running ...
2022/08/20 15:40:20 Job still running ...
2022/08/20 15:40:50 Job 2022-08-20_08_36_19-9571021338690023687 succeeded!
--- PASS: TestEmitParDoAfterGBK (275.84s)
PASS
ok github.com/apache/beam/sdks/v2/go/test/regression 3345.265s
FAIL
$ TEST_EXIT_CODE=0
$ cd ../..
$ docker rmi us.gcr.io/apache-beam-testing/jenkins/beam_go_sdk:20220820-143502
Untagged: us.gcr.io/apache-beam-testing/jenkins/beam_go_sdk:20220820-143502
Untagged: us.gcr.io/apache-beam-testing/jenkins/beam_go_sdk@sha256:724377d432cd1636675524761fe4eeaef392827d296010b18107bbfd83f41c85
Deleted: sha256:10e36acedb86d892b2d4dc4c4d5efb179fdadbd51ca680cedc22f29bb3cc3124
Deleted: sha256:f03443f8daa1ed8a0317c7ae9619024d102c16b16f59ec52351d514e13975c54
Deleted: sha256:107c5c42716e5a10c48dc289440f4797d19c989023b6df49116b3e1aaf5d91d3
Deleted: sha256:85613d5b05b28fa27c9b81bfd3942895dab7685ebaf7a52d5b9eae4aadf46f3d
Deleted: sha256:b3f5569ee1fac5dd1a502c054320cbe6fab3fae84d32e6ad620edc5742309c1f
Deleted: sha256:919679b1e7b7830d8e87f7c729e61ae8e1985bc55d6187c49572dda9b62b019c
Deleted: sha256:f175d2590c82516913bc593d48a0b1fc2df8898e6144dce15c234e3715b26bfa
Deleted: sha256:f2ac9069d518d9733f8dd1add03e8b360f0dfe6f327d497a878c4eea4595134e
Deleted: sha256:6d9bb95271c3245cdab07622c6895c1510d43797dd177059f136f95c2eeffeba
Deleted: sha256:52c39422624b32b755fcc8ee83c0b7e41c4395d11693c8293570b53da98cff6b
Deleted: sha256:1a6d3988aa26b37e333ea5b3fce072eba9ea6e0b9eb0d631c0150d7a1c510f4c
Deleted: sha256:a566f934ac8b17851e1237e75c05d74c9cad923997f3aadc72208375109da370
Deleted: sha256:f7d856403470b2896971238d3718f42369478cb7ce5fad024351df1d74cbf25a
Deleted: sha256:1dc09f0eccfa6848981ad5cc34220800e169e8b10d94b1de36a8b2046040606d
Deleted: sha256:f381a945609ce5c78306a2ea78ba7d71ba33abfaf9b786a3e2353dd38e70575b
Deleted: sha256:02a89468fae94c8ab85cd8d04061dc3cb00e5d068bf449e40c0a8ddd6ca444d4
Deleted: sha256:19c8d22fd021d6edccc333d922533c0266f2300972f43c72327dd54440d85ae2
$ gcloud --quiet container images delete us.gcr.io/apache-beam-testing/jenkins/beam_go_sdk:20220820-143502
Digests:
- us.gcr.io/apache-beam-testing/jenkins/beam_go_sdk@sha256:724377d432cd1636675524761fe4eeaef392827d296010b18107bbfd83f41c85
Associated tags:
- 20220820-143502
Tags:
- us.gcr.io/apache-beam-testing/jenkins/beam_go_sdk:20220820-143502
Deleted [us.gcr.io/apache-beam-testing/jenkins/beam_go_sdk:20220820-143502].
Deleted [us.gcr.io/apache-beam-testing/jenkins/beam_go_sdk@sha256:724377d432cd1636675524761fe4eeaef392827d296010b18107bbfd83f41c85].
$ rm -rf /tmp/tmp.L9q5Zaxib9
$ exit 1
$ exit 1
> Task :goIntegrationTests FAILED
FAILURE: Build failed with an exception.
* What went wrong:
Execution failed for task ':goIntegrationTests'.
> Process 'command 'sh'' finished with non-zero exit value 1
* Try:
> Run with --stacktrace option to get the stack trace.
> Run with --info or --debug option to get more log output.
> Run with --scan to get full insights.
* Get more help at https://help.gradle.org
Deprecated Gradle features were used in this build, making it incompatible with Gradle 8.0.
You can use '--warning-mode all' to show the individual deprecation warnings and determine if they come from your own scripts or plugins.
See https://docs.gradle.org/7.4/userguide/command_line_interface.html#sec:command_line_warnings
BUILD FAILED in 1h 20m 50s
88 actionable tasks: 53 executed, 33 from cache, 2 up-to-date
Publishing build scan...
https://gradle.com/s/7hoeqpiakpyus
Build step 'Invoke Gradle script' changed build result to FAILURE
Build step 'Invoke Gradle script' marked build as failure
---------------------------------------------------------------------
To unsubscribe, e-mail: builds-unsubscribe@beam.apache.org
For additional commands, e-mail: builds-help@beam.apache.org
Jenkins build is back to normal : beam_PostCommit_Go #10222
Posted by Apache Jenkins Server <je...@builds.apache.org>.
See <https://ci-beam.apache.org/job/beam_PostCommit_Go/10222/display/redirect>
---------------------------------------------------------------------
To unsubscribe, e-mail: builds-unsubscribe@beam.apache.org
For additional commands, e-mail: builds-help@beam.apache.org