You are viewing a plain text version of this content. The canonical link for it is here.
Posted to commits@tomee.apache.org by Apache Jenkins Server <je...@builds.apache.org> on 2023/06/12 18:55:05 UTC
Build failed in Jenkins: TomEE » tomee-8.x-build-full-java8 #92
See <https://ci-builds.apache.org/job/Tomee/job/tomee-8.x-build-full-java8/92/display/redirect>
Changes:
------------------------------------------
[...truncated 68.72 MB...]
[INFO] TomEE :: Examples :: JPA with Hibernate 8.0.16-SNAPSHOT SUCCESS [ 7.251 s]
[INFO] TomEE :: Examples :: JPA with Hibernate and arquillian 8.0.16-SNAPSHOT SUCCESS [ 13.885 s]
[INFO] TomEE :: Examples :: JPA @Enumerated 8.0.16-SNAPSHOT SUCCESS [ 5.187 s]
[INFO] TomEE :: Web Examples :: JSF - ManangedBean and EJB 8.0.16-SNAPSHOT SUCCESS [ 0.868 s]
[INFO] TomEE :: Web Examples :: JSF - CDI and EJB 8.0.16-SNAPSHOT SUCCESS [ 0.670 s]
[INFO] TomEE :: Examples :: JUnit 5 :: Application Composer 8.0.16-SNAPSHOT SUCCESS [ 6.178 s]
[INFO] TomEE :: Examples :: JUnit 5 :: Multiple TomEE with Arquillian 8.0.16-SNAPSHOT SUCCESS [ 12.722 s]
[INFO] TomEE :: Examples :: JUnit 5 :: Simple Websockets with Arquillian 8.0.16-SNAPSHOT SUCCESS [ 8.858 s]
[INFO] TomEE :: Examples :: @EJB Lookup 8.0.16-SNAPSHOT ... SUCCESS [ 2.341 s]
[INFO] TomEE :: Examples :: EJB Lookup with descriptor 8.0.16-SNAPSHOT SUCCESS [ 2.568 s]
[INFO] TomEE :: Examples :: Movies Complete (Meta) 8.0.16-SNAPSHOT SUCCESS [ 5.042 s]
[INFO] TomEE :: Examples :: Movies Complete 8.0.16-SNAPSHOT SUCCESS [ 5.066 s]
[INFO] MicroProfile :: Examples :: Config 8.0.16-SNAPSHOT . SUCCESS [ 12.395 s]
[INFO] MicroProfile :: Examples :: Config Source Database 8.0.16-SNAPSHOT SUCCESS [ 13.259 s]
[INFO] TomEE :: Examples :: Microprofile Fault Tolerance :: Fallback 8.0.16-SNAPSHOT SUCCESS [ 11.933 s]
[INFO] TomEE :: Examples :: Microprofile Fault Tolerance :: Retry 8.0.16-SNAPSHOT SUCCESS [ 15.121 s]
[INFO] TomEE :: Examples :: Microprofile JSONB Configuration 8.0.16-SNAPSHOT SUCCESS [ 3.356 s]
[INFO] Apache TomEE + MicroProfile JWT Bean Validation 8.0.16-SNAPSHOT SUCCESS [ 12.844 s]
[INFO] Apache TomEE + MicroProfile JWT Bean Validation, Strongly-typed Annotations 8.0.16-SNAPSHOT SUCCESS [ 12.362 s]
[INFO] TomEE :: Examples :: Microprofile Metrics Counted 8.0.16-SNAPSHOT SUCCESS [ 11.403 s]
[INFO] TomEE :: Examples :: Microprofile Metrics Histogram 8.0.16-SNAPSHOT SUCCESS [ 12.106 s]
[INFO] TomEE :: Examples :: Microprofile Metrics Timed 8.0.16-SNAPSHOT SUCCESS [ 12.018 s]
[INFO] mp-metrics-gauge 8.0.16-SNAPSHOT ................... SUCCESS [ 12.231 s]
[INFO] mp-metrics-metered 8.0.16-SNAPSHOT ................. SUCCESS [ 0.186 s]
[INFO] mp-opentracing.traced 8.0.16-SNAPSHOT .............. SUCCESS [ 0.075 s]
[INFO] TomEE :: Examples :: MP REST JWT 8.0.16-SNAPSHOT ... SUCCESS [ 12.367 s]
[INFO] TomEE :: Examples :: MP REST JWT JWK 8.0.16-SNAPSHOT SUCCESS [ 13.873 s]
[INFO] TomEE :: Examples :: MP REST JWT PRINCIPAL 8.0.16-SNAPSHOT SUCCESS [ 14.795 s]
[INFO] TomEE :: Examples :: MP REST JWT Public Key 8.0.16-SNAPSHOT SUCCESS [ 11.791 s]
[INFO] TomEE :: Utils :: Mockito 8.0.16-SNAPSHOT .......... SUCCESS [ 8.851 s]
[INFO] TomEE :: Examples :: MTOM 8.0.16-SNAPSHOT .......... SUCCESS [ 6.137 s]
[INFO] TomEE :: Examples :: Multiple JPA providers 8.0.16-SNAPSHOT SUCCESS [ 12.209 s]
[INFO] TomEE :: Examples :: Multiple Arquillian Adapters 8.0.16-SNAPSHOT SUCCESS [ 24.918 s]
[INFO] TomEE :: Examples :: Multiple TomEE with Arquillian 8.0.16-SNAPSHOT SUCCESS [ 10.065 s]
[INFO] TomEE :: Examples :: JSF2/CDI/BV/JPA/CODI 8.0.16-SNAPSHOT SUCCESS [ 0.865 s]
[INFO] TomEE :: Examples :: Persistence Fragment 8.0.16-SNAPSHOT SUCCESS [ 3.008 s]
[INFO] TomEE :: Web Examples :: Pojo WS 8.0.16-SNAPSHOT ... SUCCESS [ 0.100 s]
[INFO] TomEE :: Examples :: Polling 8.0.16-SNAPSHOT ....... SUCCESS [ 0.142 s]
[INFO] TomEE :: Examples :: Polling :: Domain 8.0.16-SNAPSHOT SUCCESS [ 1.011 s]
[INFO] TomEE :: Examples :: Polling :: Core 8.0.16-SNAPSHOT SUCCESS [ 7.734 s]
[INFO] TomEE :: Examples :: Polling :: Web 8.0.16-SNAPSHOT SUCCESS [ 21.575 s]
[INFO] TomEE :: Examples :: Polling :: Client 8.0.16-SNAPSHOT SUCCESS [ 0.374 s]
[INFO] TomEE :: Examples :: DeltaSpike ProjectStage 8.0.16-SNAPSHOT SUCCESS [ 15.851 s]
[INFO] TomEE :: Examples :: Quartz 8.0.16-SNAPSHOT ........ SUCCESS [ 0.028 s]
[INFO] TomEE :: Examples :: Quartz :: Quartz Resource Adapter 8.0.16-SNAPSHOT SUCCESS [ 0.085 s]
[INFO] TomEE :: Examples :: Quartz :: Quartz Beans 8.0.16-SNAPSHOT SUCCESS [ 8.185 s]
[INFO] TomEE :: Examples :: DataSource Realm 8.0.16-SNAPSHOT SUCCESS [ 0.081 s]
[INFO] TomEE :: Examples :: Reloadable Persistence Unit Properties 8.0.16-SNAPSHOT SUCCESS [ 5.089 s]
[INFO] TomEE :: Web Examples :: Resource Declared In A Webapp 8.0.16-SNAPSHOT SUCCESS [ 0.187 s]
[INFO] TomEE :: Examples :: REST, Mockito and Application Composer 8.0.16-SNAPSHOT SUCCESS [ 4.458 s]
[INFO] TomEE :: Examples :: REST and Application Composer 8.0.16-SNAPSHOT SUCCESS [ 3.368 s]
[INFO] TomEE :: Examples :: REST CDI 8.0.16-SNAPSHOT ...... SUCCESS [ 5.048 s]
[INFO] TomEE :: Examples :: JAXRS and JAAS 8.0.16-SNAPSHOT SUCCESS [ 0.086 s]
[INFO] TomEE :: Examples :: REST and EJB 8.0.16-SNAPSHOT .. SUCCESS [ 7.443 s]
[INFO] TomEE :: Web Examples :: REST Example 8.0.16-SNAPSHOT SUCCESS [ 13.860 s]
[INFO] TomEE :: Web Examples :: REST Example With Application 8.0.16-SNAPSHOT SUCCESS [ 0.547 s]
[INFO] TomEE :: Web Examples :: REST SSE Example 8.0.16-SNAPSHOT SUCCESS [ 0.361 s]
[INFO] TomEE :: Examples :: REST XML JSON 8.0.16-SNAPSHOT . SUCCESS [ 4.466 s]
[INFO] TomEE :: Examples :: Basic Scala 8.0.16-SNAPSHOT ... SUCCESS [ 14.689 s]
[INFO] TomEE :: Examples :: ScheduleExpression 8.0.16-SNAPSHOT SUCCESS [ 7.560 s]
[INFO] TomEE :: Examples :: @Schedule Events 8.0.16-SNAPSHOT SUCCESS [ 11.888 s]
[INFO] TomEE :: Examples :: @Schedule Methods (Meta) 8.0.16-SNAPSHOT SUCCESS [ 7.740 s]
[INFO] TomEE :: Examples :: @Schedule Methods 8.0.16-SNAPSHOT SUCCESS [ 7.684 s]
[INFO] TomEE :: Examples :: Server Events 8.0.16-SNAPSHOT . SUCCESS [ 3.225 s]
[INFO] TomEE :: Examples :: Serverless Apache TomEE WebProfile 8.0.16-SNAPSHOT SUCCESS [ 6.225 s]
[INFO] TomEE :: Examples :: Serverless Apache TomEE WebProfile 8.0.16-SNAPSHOT SUCCESS [ 5.939 s]
[INFO] TomEE :: Examples :: Serverless Apache TomEE MicroProfile 8.0.16-SNAPSHOT SUCCESS [ 8.061 s]
[INFO] TomEE :: Examples :: Serverless Apache TomEE Plume 8.0.16-SNAPSHOT SUCCESS [ 6.230 s]
[INFO] TomEE :: Examples :: Serverless Apache TomEE Plus 8.0.16-SNAPSHOT SUCCESS [ 7.050 s]
[INFO] TomEE :: Examples :: Singleton startup ordering 8.0.16-SNAPSHOT SUCCESS [ 10.448 s]
[INFO] TomEE :: Examples :: Simple CDI Interceptor 8.0.16-SNAPSHOT SUCCESS [ 2.483 s]
[INFO] TomEE :: Examples :: Simple EAR 8.0.16-SNAPSHOT .... SUCCESS [ 0.007 s]
[INFO] TomEE :: Examples :: Simple EAR :: Business Model 8.0.16-SNAPSHOT SUCCESS [ 0.107 s]
[INFO] TomEE :: Examples :: Simple EAR :: Business Logic 8.0.16-SNAPSHOT SUCCESS [ 4.527 s]
[INFO] TomEE :: Examples :: Simple EAR :: Webapp 8.0.16-SNAPSHOT SUCCESS [ 0.687 s]
[INFO] TomEE :: Examples :: Simple EAR :: EAR Packaging 8.0.16-SNAPSHOT SUCCESS [ 0.111 s]
[INFO] TomEE :: Examples :: Simple EAR :: Functional Tests 8.0.16-SNAPSHOT SUCCESS [ 19.102 s]
[INFO] TomEE :: Examples :: Simple CMP2 Entity 8.0.16-SNAPSHOT SUCCESS [ 4.555 s]
[INFO] TomEE :: Examples :: Simple JMS 8.0.16-SNAPSHOT .... SUCCESS [ 18.002 s]
[INFO] TomEE :: Examples :: Simple JMS Context 8.0.16-SNAPSHOT SUCCESS [ 17.531 s]
[INFO] TomEE :: Examples :: Simple MDB With a CDI Injection 8.0.16-SNAPSHOT SUCCESS [ 6.485 s]
[INFO] TomEE :: Examples :: Simple MDB Example 8.0.16-SNAPSHOT SUCCESS [ 5.961 s]
[INFO] TomEE :: Examples :: Simple MDB Using Deployment Descriptor Example 8.0.16-SNAPSHOT SUCCESS [ 6.083 s]
[INFO] TomEE :: Examples :: Simple Remote tomcat-users.xml 8.0.16-SNAPSHOT SUCCESS [ 7.510 s]
[INFO] TomEE :: Examples :: Simple REST 8.0.16-SNAPSHOT ... SUCCESS [ 3.378 s]
[INFO] TomEE :: Examples :: Simple Singleton 8.0.16-SNAPSHOT SUCCESS [ 2.403 s]
[INFO] TomEE :: Examples :: Simple Stateful Pojo 8.0.16-SNAPSHOT SUCCESS [ 2.294 s]
[INFO] TomEE :: Examples :: Simple Stateful Pojo Callbacks 8.0.16-SNAPSHOT FAILURE [ 6.782 s]
[INFO] TomEE :: Examples :: Simple Stateless Pojo 8.0.16-SNAPSHOT SUCCESS [ 2.289 s]
[INFO] TomEE :: Examples :: Simple Stateless Pojo Callbacks 8.0.16-SNAPSHOT SUCCESS [ 2.274 s]
[INFO] TomEE :: Examples :: Simple Stateless With Deployment Descriptor 8.0.16-SNAPSHOT SUCCESS [ 2.236 s]
[INFO] TomEE :: Examples :: Simple Webservice 8.0.16-SNAPSHOT SUCCESS [ 6.806 s]
[INFO] TomEE :: Examples :: Simple Webservice Without Interface 8.0.16-SNAPSHOT SUCCESS [ 6.318 s]
[INFO] OpenEJB :: Examples :: Async Servlet 8.0.16-SNAPSHOT SUCCESS [ 25.124 s]
[INFO] TomEE :: Examples :: Spring Data 8.0.16-SNAPSHOT ... SUCCESS [ 6.012 s]
[INFO] TomEE :: Examples :: Spring Data Meta 8.0.16-SNAPSHOT SUCCESS [ 6.187 s]
[INFO] TomEE :: Web Examples :: Struts 8.0.16-SNAPSHOT .... SUCCESS [ 1.168 s]
[INFO] TomEE :: Examples :: Telephone Stateful Pojo 8.0.16-SNAPSHOT SUCCESS [ 3.339 s]
[INFO] TomEE :: Examples :: TestCase Injection 8.0.16-SNAPSHOT SUCCESS [ 4.623 s]
[INFO] TomEE :: Examples :: Testing Security (Meta) 8.0.16-SNAPSHOT SUCCESS [ 5.040 s]
[INFO] TomEE :: Examples :: Testing Security 8.0.16-SNAPSHOT SUCCESS [ 5.986 s]
[INFO] TomEE :: Examples :: Testing Security 8.0.16-SNAPSHOT SUCCESS [ 5.734 s]
[INFO] TomEE :: Examples :: Testing Security Service Provider 8.0.16-SNAPSHOT SUCCESS [ 5.795 s]
[INFO] TomEE :: Examples :: Testing Security Script Service Provider 8.0.16-SNAPSHOT SUCCESS [ 6.711 s]
[INFO] TomEE :: Examples :: Testing Transactions 8.0.16-SNAPSHOT SUCCESS [ 4.884 s]
[INFO] TomEE :: Examples :: Testing Transactions BMT 8.0.16-SNAPSHOT SUCCESS [ 4.767 s]
[INFO] TomEE :: Examples :: TomEE, Jersey, Eclipselink 8.0.16-SNAPSHOT SUCCESS [ 11.420 s]
[INFO] TomEE :: TomEE :: IBM MQ AMQ Portability Examples :: MDB Example 1.0 SUCCESS [ 0.476 s]
[INFO] TomEE :: Examples :: Transaction Rollback 8.0.16-SNAPSHOT SUCCESS [ 6.571 s]
[INFO] TomEE :: Examples :: Troubleshooting 8.0.16-SNAPSHOT SUCCESS [ 4.971 s]
[INFO] TomEE :: Examples :: Webservice Attachments 8.0.16-SNAPSHOT SUCCESS [ 5.140 s]
[INFO] TomEE :: Examples :: Webservice Inheritance 8.0.16-SNAPSHOT SUCCESS [ 8.424 s]
[INFO] TomEE :: Web Examples :: EJB WebService with Security 8.0.16-SNAPSHOT SUCCESS [ 6.168 s]
[INFO] TomEE :: Web Examples :: EJB WebService with SSL Client Certificate 8.0.16-SNAPSHOT SUCCESS [ 20.064 s]
[INFO] TomEE :: Web Examples :: EJB WebService with WS-Security 8.0.16-SNAPSHOT SUCCESS [ 14.428 s]
[INFO] TomEE :: Web Examples :: EJB WebService WS Security with resources.xml 8.0.16-SNAPSHOT SUCCESS [ 6.924 s]
[INFO] TomEE :: Examples :: Web Service Handlers 8.0.16-SNAPSHOT SUCCESS [ 6.817 s]
[INFO] TomEE :: Examples :: @WebService Holder 8.0.16-SNAPSHOT SUCCESS [ 6.816 s]
[INFO] TomEE :: Web Examples :: Moviefun 8.0.16-SNAPSHOT .. SUCCESS [ 50.331 s]
[INFO] TomEE :: Web Examples :: Moviefun Rest 8.0.16-SNAPSHOT SUCCESS [ 24.941 s]
[INFO] TomEE :: Utils :: Provisionning 8.0.16-SNAPSHOT .... SUCCESS [ 3.294 s]
[INFO] TomEE :: Examples :: Resources/JMX Example 8.0.16-SNAPSHOT SUCCESS [ 0.082 s]
[INFO] TomEE :: Examples :: Resources/JMX Example :: EJB Module 8.0.16-SNAPSHOT SUCCESS [ 12.444 s]
[INFO] TomEE :: Examples :: Resources/JMX Example :: EAR Module 8.0.16-SNAPSHOT SUCCESS [ 0.329 s]
[INFO] TomEE :: Examples :: WebSocket with tls and basic auth Example 8.0.16-SNAPSHOT SUCCESS [ 8.050 s]
[INFO] TomEE :: Examples :: Concurrency utilities example 8.0.16-SNAPSHOT SUCCESS [ 13.606 s]
[INFO] TomEE :: Examples :: MVC (CXF-based) 8.0.16-SNAPSHOT SUCCESS [ 39.946 s]
[INFO] TomEE :: Examples :: MVC (CXF-based) with Hibernate 8.0.16-SNAPSHOT SUCCESS [ 30.375 s]
[INFO] TomEE :: Examples :: Microprofile REST Client 8.0.16-SNAPSHOT SUCCESS [ 12.016 s]
[INFO] TomEE :: Examples :: MVC (RestEasy-based) 8.0.16-SNAPSHOT SUCCESS [ 17.860 s]
[INFO] TomEE :: Examples :: Custom HealthCheck 8.0.16-SNAPSHOT SUCCESS [ 10.169 s]
[INFO] TomEE :: Examples :: Microprofile JSONB Configuration 8.0.16-SNAPSHOT SUCCESS [ 3.414 s]
[INFO] TomEE :: Examples :: Microprofile JSONB Custom Serializer/Deserializer 8.0.16-SNAPSHOT SUCCESS [ 3.872 s]
[INFO] TomEE :: Examples :: Vaadin LTS V08 8.0.16-SNAPSHOT SUCCESS [ 2.477 s]
[INFO] TomEE :: Examples :: Vaadin LTS V10 8.0.16-SNAPSHOT SUCCESS [ 3.712 s]
[INFO] TomEE :: Examples :: Vaadin LATEST 8.0.16-SNAPSHOT . SUCCESS [ 1.774 s]
[INFO] TomEE :: Examples :: Azure deployment example 8.0.16-SNAPSHOT SUCCESS [ 6.118 s]
[INFO] TomEE :: Examples :: Microprofile Fault Tolerance :: Timeout 8.0.16-SNAPSHOT SUCCESS [ 10.501 s]
[INFO] TomEE :: Examples :: XA Datasource configuration and usage 8.0.16-SNAPSHOT SUCCESS [ 44.515 s]
[INFO] TomEE :: Examples :: Websocket JMS 8.0.16-SNAPSHOT . SUCCESS [ 9.765 s]
[INFO] TomEE :: Examples :: Properties Provider 8.0.16-SNAPSHOT SUCCESS [ 0.102 s]
[INFO] TomEE :: Examples :: Properties Provider :: Implementation 8.0.16-SNAPSHOT SUCCESS [ 0.114 s]
[INFO] TomEE :: Examples :: Properties Provider :: Sample Webapp 8.0.16-SNAPSHOT SUCCESS [ 5.959 s]
[INFO] TomEE :: Examples :: Jakarta Security tomcat-user.xml Identity Store 8.0.16-SNAPSHOT SUCCESS [ 7.812 s]
[INFO] TomEE :: Examples :: Jakarta Security custom Identity Store 8.0.16-SNAPSHOT SUCCESS [ 9.737 s]
[INFO] TomEE :: Examples 8.0.16-SNAPSHOT .................. SUCCESS [ 0.636 s]
[INFO] TomEE :: Assembly :: All In One EJB Lite jar 8.0.16-SNAPSHOT SUCCESS [ 29.512 s]
[INFO] TomEE :: Utils :: TomEE Webapps-based Deployer EJB 8.0.16-SNAPSHOT SUCCESS [ 0.796 s]
[INFO] TomEE :: TCK 8.0.16-SNAPSHOT ....................... SUCCESS [ 0.021 s]
[INFO] TomEE :: TCK :: Common 8.0.16-SNAPSHOT ............. SUCCESS [ 1.268 s]
[INFO] TomEE :: TCK :: CDI Embedded 8.0.16-SNAPSHOT ....... SUCCESS [04:27 min]
[INFO] TomEE :: TCK :: CDI TomEE 8.0.16-SNAPSHOT .......... SUCCESS [52:08 min]
[INFO] TomEE :: TCK :: CDI TCK Signature Tests 8.0.16-SNAPSHOT SUCCESS [ 4.093 s]
[INFO] TomEE :: TCK :: Bean Validation Embedded 8.0.16-SNAPSHOT SUCCESS [01:50 min]
[INFO] TomEE :: TCK :: Bean Validation TomEE 8.0.16-SNAPSHOT SUCCESS [09:43 min]
[INFO] TomEE :: TCK :: Bean Validation TCK Signature tests 8.0.16-SNAPSHOT SUCCESS [ 1.924 s]
[INFO] TomEE :: TCK :: MicroProfile 8.0.16-SNAPSHOT ....... SUCCESS [ 0.141 s]
[INFO] TomEE :: TCK :: MicroProfile Config TCK 8.0.16-SNAPSHOT SUCCESS [04:08 min]
[INFO] TomEE :: TCK :: MicroProfile JWT TCK 8.0.16-SNAPSHOT SUCCESS [01:47 min]
[INFO] TomEE :: TCK :: MicroProfile Fault Tolerance TCK 8.0.16-SNAPSHOT SUCCESS [13:08 min]
[INFO] TomEE :: TCK :: MicroProfile Health TCK 8.0.16-SNAPSHOT SUCCESS [01:40 min]
[INFO] TomEE :: TCK :: MicroProfile Metrics TCK 8.0.16-SNAPSHOT SUCCESS [11:08 min]
[INFO] TomEE :: TCK :: MicroProfile Rest Client TCK 8.0.16-SNAPSHOT SUCCESS [13:42 min]
[INFO] TomEE :: TCK :: MicroProfile Open API TCK 8.0.16-SNAPSHOT SUCCESS [03:55 min]
[INFO] TomEE :: TCK :: MicroProfile Open Tracing TCK 8.0.16-SNAPSHOT SUCCESS [ 35.304 s]
[INFO] TomEE :: Arquillian Adaptors Parent :: Webapp Remote 8.0.16-SNAPSHOT SUCCESS [01:07 min]
[INFO] TomEE :: Arquillian Adaptors Parent :: Tests 8.0.16-SNAPSHOT SUCCESS [ 6.965 s]
[INFO] TomEE :: Arquillian Adaptors Parent :: Tests :: Web Profile 8.0.16-SNAPSHOT SUCCESS [07:36 min]
[INFO] TomEE :: Arquillian Adaptors Parent :: Tests :: JAXRS 8.0.16-SNAPSHOT SUCCESS [02:59 min]
[INFO] TomEE :: Arquillian Adaptors Parent :: Tests :: JAXWS 8.0.16-SNAPSHOT SUCCESS [ 53.356 s]
[INFO] TomEE :: Arquillian Adaptors Parent :: Tests :: JMS 8.0.16-SNAPSHOT SUCCESS [ 41.977 s]
[INFO] TomEE :: Arquillian Adaptors Parent :: Tests :: CODI 8.0.16-SNAPSHOT SUCCESS [01:00 min]
[INFO] TomEE :: Arquillian Adaptors Parent :: Tests :: Configuration Tests 8.0.16-SNAPSHOT SUCCESS [ 58.464 s]
[INFO] TomEE :: Arquillian Adaptors Parent :: Sample :: Moviefun 8.0.16-SNAPSHOT SUCCESS [ 42.641 s]
[INFO] TomEE :: Arquillian Adaptors Parent :: Arquillian TCK 8.0.16-SNAPSHOT SUCCESS [ 1.390 s]
[INFO] TomEE :: Utils :: Log4j2 8.0.16-SNAPSHOT ........... SUCCESS [ 1.295 s]
[INFO] TomEE :: TomEE :: webaccess 8.0.16-SNAPSHOT ........ SUCCESS [ 18.421 s]
[INFO] TomEE :: TomEE :: Overlay Runner 8.0.16-SNAPSHOT ... SUCCESS [ 1.042 s]
[INFO] ------------------------------------------------------------------------
[INFO] BUILD FAILURE
[INFO] ------------------------------------------------------------------------
[INFO] Total time: 04:16 h
[INFO] Finished at: 2023-06-12T18:54:21Z
[INFO] ------------------------------------------------------------------------
[ERROR] Failed to execute goal org.apache.maven.plugins:maven-surefire-plugin:2.12.4:test (default-test) on project simple-stateful-callbacks: There are test failures.
[ERROR]
[ERROR] Please refer to <https://ci-builds.apache.org/job/Tomee/job/tomee-8.x-build-full-java8/ws/examples/simple-stateful-callbacks/target/surefire-reports> for the individual test results.
[ERROR] -> [Help 1]
[ERROR]
[ERROR] To see the full stack trace of the errors, re-run Maven with the -e switch.
[ERROR] Re-run Maven using the -X switch to enable full debug logging.
[ERROR]
[ERROR] For more information about the errors and possible solutions, please read the following articles:
[ERROR] [Help 1] http://cwiki.apache.org/confluence/display/MAVEN/MojoFailureException
[ERROR]
[ERROR] After correcting the problems, you can resume the build with the command
[ERROR] mvn <args> -rf :simple-stateful-callbacks
Build step 'Invoke top-level Maven targets' marked build as failure
INFO: Processing JUnit
INFO: [JUnit] - 1,350 test report file(s) were found with the pattern '**/target/surefire-reports/TEST-*.xml' relative to '<https://ci-builds.apache.org/job/Tomee/job/tomee-8.x-build-full-java8/ws/'> for the testing framework 'JUnit'.
WARNING: The file '<https://ci-builds.apache.org/job/Tomee/job/tomee-8.x-build-full-java8/ws/examples/scala-basic/target/surefire-reports/TEST-org.scalatest.tools.DiscoverySuite-7e13c9ad-7538-4fe2-904b-ecfdf18d509c.xml'> is an invalid file.
WARNING: At line 8 of <https://ci-builds.apache.org/job/Tomee/job/tomee-8.x-build-full-java8/ws/examples/scala-basic/target/surefire-reports/TEST-org.scalatest.tools.DiscoverySuite-7e13c9ad-7538-4fe2-904b-ecfdf18d509c.xml>:cvc-complex-type.2.1: Element 'property' must have no character or element information item [children], because the type's content type is empty.
WARNING: At line 14 of <https://ci-builds.apache.org/job/Tomee/job/tomee-8.x-build-full-java8/ws/examples/scala-basic/target/surefire-reports/TEST-org.scalatest.tools.DiscoverySuite-7e13c9ad-7538-4fe2-904b-ecfdf18d509c.xml>:cvc-complex-type.2.1: Element 'property' must have no character or element information item [children], because the type's content type is empty.
WARNING: At line 25 of <https://ci-builds.apache.org/job/Tomee/job/tomee-8.x-build-full-java8/ws/examples/scala-basic/target/surefire-reports/TEST-org.scalatest.tools.DiscoverySuite-7e13c9ad-7538-4fe2-904b-ecfdf18d509c.xml>:cvc-complex-type.2.1: Element 'property' must have no character or element information item [children], because the type's content type is empty.
WARNING: At line 28 of <https://ci-builds.apache.org/job/Tomee/job/tomee-8.x-build-full-java8/ws/examples/scala-basic/target/surefire-reports/TEST-org.scalatest.tools.DiscoverySuite-7e13c9ad-7538-4fe2-904b-ecfdf18d509c.xml>:cvc-complex-type.2.1: Element 'property' must have no character or element information item [children], because the type's content type is empty.
WARNING: At line 33 of <https://ci-builds.apache.org/job/Tomee/job/tomee-8.x-build-full-java8/ws/examples/scala-basic/target/surefire-reports/TEST-org.scalatest.tools.DiscoverySuite-7e13c9ad-7538-4fe2-904b-ecfdf18d509c.xml>:cvc-complex-type.2.1: Element 'property' must have no character or element information item [children], because the type's content type is empty.
WARNING: At line 36 of <https://ci-builds.apache.org/job/Tomee/job/tomee-8.x-build-full-java8/ws/examples/scala-basic/target/surefire-reports/TEST-org.scalatest.tools.DiscoverySuite-7e13c9ad-7538-4fe2-904b-ecfdf18d509c.xml>:cvc-complex-type.2.1: Element 'property' must have no character or element information item [children], because the type's content type is empty.
WARNING: At line 39 of <https://ci-builds.apache.org/job/Tomee/job/tomee-8.x-build-full-java8/ws/examples/scala-basic/target/surefire-reports/TEST-org.scalatest.tools.DiscoverySuite-7e13c9ad-7538-4fe2-904b-ecfdf18d509c.xml>:cvc-complex-type.2.1: Element 'property' must have no character or element information item [children], because the type's content type is empty.
WARNING: At line 47 of <https://ci-builds.apache.org/job/Tomee/job/tomee-8.x-build-full-java8/ws/examples/scala-basic/target/surefire-reports/TEST-org.scalatest.tools.DiscoverySuite-7e13c9ad-7538-4fe2-904b-ecfdf18d509c.xml>:cvc-complex-type.2.1: Element 'property' must have no character or element information item [children], because the type's content type is empty.
WARNING: At line 51 of <https://ci-builds.apache.org/job/Tomee/job/tomee-8.x-build-full-java8/ws/examples/scala-basic/target/surefire-reports/TEST-org.scalatest.tools.DiscoverySuite-7e13c9ad-7538-4fe2-904b-ecfdf18d509c.xml>:cvc-complex-type.2.1: Element 'property' must have no character or element information item [children], because the type's content type is empty.
WARNING: At line 55 of <https://ci-builds.apache.org/job/Tomee/job/tomee-8.x-build-full-java8/ws/examples/scala-basic/target/surefire-reports/TEST-org.scalatest.tools.DiscoverySuite-7e13c9ad-7538-4fe2-904b-ecfdf18d509c.xml>:cvc-complex-type.2.1: Element 'property' must have no character or element information item [children], because the type's content type is empty.
WARNING: At line 58 of <https://ci-builds.apache.org/job/Tomee/job/tomee-8.x-build-full-java8/ws/examples/scala-basic/target/surefire-reports/TEST-org.scalatest.tools.DiscoverySuite-7e13c9ad-7538-4fe2-904b-ecfdf18d509c.xml>:cvc-complex-type.2.1: Element 'property' must have no character or element information item [children], because the type's content type is empty.
WARNING: At line 62 of <https://ci-builds.apache.org/job/Tomee/job/tomee-8.x-build-full-java8/ws/examples/scala-basic/target/surefire-reports/TEST-org.scalatest.tools.DiscoverySuite-7e13c9ad-7538-4fe2-904b-ecfdf18d509c.xml>:cvc-complex-type.2.1: Element 'property' must have no character or element information item [children], because the type's content type is empty.
WARNING: At line 66 of <https://ci-builds.apache.org/job/Tomee/job/tomee-8.x-build-full-java8/ws/examples/scala-basic/target/surefire-reports/TEST-org.scalatest.tools.DiscoverySuite-7e13c9ad-7538-4fe2-904b-ecfdf18d509c.xml>:cvc-complex-type.2.1: Element 'property' must have no character or element information item [children], because the type's content type is empty.
WARNING: At line 74 of <https://ci-builds.apache.org/job/Tomee/job/tomee-8.x-build-full-java8/ws/examples/scala-basic/target/surefire-reports/TEST-org.scalatest.tools.DiscoverySuite-7e13c9ad-7538-4fe2-904b-ecfdf18d509c.xml>:cvc-complex-type.2.1: Element 'property' must have no character or element information item [children], because the type's content type is empty.
WARNING: At line 78 of <https://ci-builds.apache.org/job/Tomee/job/tomee-8.x-build-full-java8/ws/examples/scala-basic/target/surefire-reports/TEST-org.scalatest.tools.DiscoverySuite-7e13c9ad-7538-4fe2-904b-ecfdf18d509c.xml>:cvc-complex-type.2.1: Element 'property' must have no character or element information item [children], because the type's content type is empty.
WARNING: At line 83 of <https://ci-builds.apache.org/job/Tomee/job/tomee-8.x-build-full-java8/ws/examples/scala-basic/target/surefire-reports/TEST-org.scalatest.tools.DiscoverySuite-7e13c9ad-7538-4fe2-904b-ecfdf18d509c.xml>:cvc-complex-type.2.1: Element 'property' must have no character or element information item [children], because the type's content type is empty.
WARNING: At line 86 of <https://ci-builds.apache.org/job/Tomee/job/tomee-8.x-build-full-java8/ws/examples/scala-basic/target/surefire-reports/TEST-org.scalatest.tools.DiscoverySuite-7e13c9ad-7538-4fe2-904b-ecfdf18d509c.xml>:cvc-complex-type.2.1: Element 'property' must have no character or element information item [children], because the type's content type is empty.
WARNING: At line 94 of <https://ci-builds.apache.org/job/Tomee/job/tomee-8.x-build-full-java8/ws/examples/scala-basic/target/surefire-reports/TEST-org.scalatest.tools.DiscoverySuite-7e13c9ad-7538-4fe2-904b-ecfdf18d509c.xml>:cvc-complex-type.2.1: Element 'property' must have no character or element information item [children], because the type's content type is empty.
WARNING: At line 98 of <https://ci-builds.apache.org/job/Tomee/job/tomee-8.x-build-full-java8/ws/examples/scala-basic/target/surefire-reports/TEST-org.scalatest.tools.DiscoverySuite-7e13c9ad-7538-4fe2-904b-ecfdf18d509c.xml>:cvc-complex-type.2.1: Element 'property' must have no character or element information item [children], because the type's content type is empty.
WARNING: At line 103 of <https://ci-builds.apache.org/job/Tomee/job/tomee-8.x-build-full-java8/ws/examples/scala-basic/target/surefire-reports/TEST-org.scalatest.tools.DiscoverySuite-7e13c9ad-7538-4fe2-904b-ecfdf18d509c.xml>:cvc-complex-type.2.1: Element 'property' must have no character or element information item [children], because the type's content type is empty.
WARNING: At line 106 of <https://ci-builds.apache.org/job/Tomee/job/tomee-8.x-build-full-java8/ws/examples/scala-basic/target/surefire-reports/TEST-org.scalatest.tools.DiscoverySuite-7e13c9ad-7538-4fe2-904b-ecfdf18d509c.xml>:cvc-complex-type.2.1: Element 'property' must have no character or element information item [children], because the type's content type is empty.
WARNING: At line 110 of <https://ci-builds.apache.org/job/Tomee/job/tomee-8.x-build-full-java8/ws/examples/scala-basic/target/surefire-reports/TEST-org.scalatest.tools.DiscoverySuite-7e13c9ad-7538-4fe2-904b-ecfdf18d509c.xml>:cvc-complex-type.2.1: Element 'property' must have no character or element information item [children], because the type's content type is empty.
WARNING: The result file '<https://ci-builds.apache.org/job/Tomee/job/tomee-8.x-build-full-java8/ws/examples/scala-basic/target/surefire-reports/TEST-org.scalatest.tools.DiscoverySuite-7e13c9ad-7538-4fe2-904b-ecfdf18d509c.xml'> for the metric 'JUnit' is not valid. The result file has been skipped.
WARNING: The file '<https://ci-builds.apache.org/job/Tomee/job/tomee-8.x-build-full-java8/ws/examples/scala-basic/target/surefire-reports/TEST-org.superbiz.GreetingServiceTest.xml'> is an invalid file.
WARNING: At line 8 of <https://ci-builds.apache.org/job/Tomee/job/tomee-8.x-build-full-java8/ws/examples/scala-basic/target/surefire-reports/TEST-org.superbiz.GreetingServiceTest.xml>:cvc-complex-type.2.1: Element 'property' must have no character or element information item [children], because the type's content type is empty.
WARNING: At line 14 of <https://ci-builds.apache.org/job/Tomee/job/tomee-8.x-build-full-java8/ws/examples/scala-basic/target/surefire-reports/TEST-org.superbiz.GreetingServiceTest.xml>:cvc-complex-type.2.1: Element 'property' must have no character or element information item [children], because the type's content type is empty.
WARNING: At line 25 of <https://ci-builds.apache.org/job/Tomee/job/tomee-8.x-build-full-java8/ws/examples/scala-basic/target/surefire-reports/TEST-org.superbiz.GreetingServiceTest.xml>:cvc-complex-type.2.1: Element 'property' must have no character or element information item [children], because the type's content type is empty.
WARNING: At line 28 of <https://ci-builds.apache.org/job/Tomee/job/tomee-8.x-build-full-java8/ws/examples/scala-basic/target/surefire-reports/TEST-org.superbiz.GreetingServiceTest.xml>:cvc-complex-type.2.1: Element 'property' must have no character or element information item [children], because the type's content type is empty.
WARNING: At line 33 of <https://ci-builds.apache.org/job/Tomee/job/tomee-8.x-build-full-java8/ws/examples/scala-basic/target/surefire-reports/TEST-org.superbiz.GreetingServiceTest.xml>:cvc-complex-type.2.1: Element 'property' must have no character or element information item [children], because the type's content type is empty.
WARNING: At line 36 of <https://ci-builds.apache.org/job/Tomee/job/tomee-8.x-build-full-java8/ws/examples/scala-basic/target/surefire-reports/TEST-org.superbiz.GreetingServiceTest.xml>:cvc-complex-type.2.1: Element 'property' must have no character or element information item [children], because the type's content type is empty.
WARNING: At line 39 of <https://ci-builds.apache.org/job/Tomee/job/tomee-8.x-build-full-java8/ws/examples/scala-basic/target/surefire-reports/TEST-org.superbiz.GreetingServiceTest.xml>:cvc-complex-type.2.1: Element 'property' must have no character or element information item [children], because the type's content type is empty.
WARNING: At line 47 of <https://ci-builds.apache.org/job/Tomee/job/tomee-8.x-build-full-java8/ws/examples/scala-basic/target/surefire-reports/TEST-org.superbiz.GreetingServiceTest.xml>:cvc-complex-type.2.1: Element 'property' must have no character or element information item [children], because the type's content type is empty.
WARNING: At line 51 of <https://ci-builds.apache.org/job/Tomee/job/tomee-8.x-build-full-java8/ws/examples/scala-basic/target/surefire-reports/TEST-org.superbiz.GreetingServiceTest.xml>:cvc-complex-type.2.1: Element 'property' must have no character or element information item [children], because the type's content type is empty.
WARNING: At line 55 of <https://ci-builds.apache.org/job/Tomee/job/tomee-8.x-build-full-java8/ws/examples/scala-basic/target/surefire-reports/TEST-org.superbiz.GreetingServiceTest.xml>:cvc-complex-type.2.1: Element 'property' must have no character or element information item [children], because the type's content type is empty.
WARNING: At line 58 of <https://ci-builds.apache.org/job/Tomee/job/tomee-8.x-build-full-java8/ws/examples/scala-basic/target/surefire-reports/TEST-org.superbiz.GreetingServiceTest.xml>:cvc-complex-type.2.1: Element 'property' must have no character or element information item [children], because the type's content type is empty.
WARNING: At line 62 of <https://ci-builds.apache.org/job/Tomee/job/tomee-8.x-build-full-java8/ws/examples/scala-basic/target/surefire-reports/TEST-org.superbiz.GreetingServiceTest.xml>:cvc-complex-type.2.1: Element 'property' must have no character or element information item [children], because the type's content type is empty.
WARNING: At line 66 of <https://ci-builds.apache.org/job/Tomee/job/tomee-8.x-build-full-java8/ws/examples/scala-basic/target/surefire-reports/TEST-org.superbiz.GreetingServiceTest.xml>:cvc-complex-type.2.1: Element 'property' must have no character or element information item [children], because the type's content type is empty.
WARNING: At line 74 of <https://ci-builds.apache.org/job/Tomee/job/tomee-8.x-build-full-java8/ws/examples/scala-basic/target/surefire-reports/TEST-org.superbiz.GreetingServiceTest.xml>:cvc-complex-type.2.1: Element 'property' must have no character or element information item [children], because the type's content type is empty.
WARNING: At line 78 of <https://ci-builds.apache.org/job/Tomee/job/tomee-8.x-build-full-java8/ws/examples/scala-basic/target/surefire-reports/TEST-org.superbiz.GreetingServiceTest.xml>:cvc-complex-type.2.1: Element 'property' must have no character or element information item [children], because the type's content type is empty.
WARNING: At line 83 of <https://ci-builds.apache.org/job/Tomee/job/tomee-8.x-build-full-java8/ws/examples/scala-basic/target/surefire-reports/TEST-org.superbiz.GreetingServiceTest.xml>:cvc-complex-type.2.1: Element 'property' must have no character or element information item [children], because the type's content type is empty.
WARNING: At line 86 of <https://ci-builds.apache.org/job/Tomee/job/tomee-8.x-build-full-java8/ws/examples/scala-basic/target/surefire-reports/TEST-org.superbiz.GreetingServiceTest.xml>:cvc-complex-type.2.1: Element 'property' must have no character or element information item [children], because the type's content type is empty.
WARNING: At line 94 of <https://ci-builds.apache.org/job/Tomee/job/tomee-8.x-build-full-java8/ws/examples/scala-basic/target/surefire-reports/TEST-org.superbiz.GreetingServiceTest.xml>:cvc-complex-type.2.1: Element 'property' must have no character or element information item [children], because the type's content type is empty.
WARNING: At line 98 of <https://ci-builds.apache.org/job/Tomee/job/tomee-8.x-build-full-java8/ws/examples/scala-basic/target/surefire-reports/TEST-org.superbiz.GreetingServiceTest.xml>:cvc-complex-type.2.1: Element 'property' must have no character or element information item [children], because the type's content type is empty.
WARNING: At line 103 of <https://ci-builds.apache.org/job/Tomee/job/tomee-8.x-build-full-java8/ws/examples/scala-basic/target/surefire-reports/TEST-org.superbiz.GreetingServiceTest.xml>:cvc-complex-type.2.1: Element 'property' must have no character or element information item [children], because the type's content type is empty.
WARNING: At line 106 of <https://ci-builds.apache.org/job/Tomee/job/tomee-8.x-build-full-java8/ws/examples/scala-basic/target/surefire-reports/TEST-org.superbiz.GreetingServiceTest.xml>:cvc-complex-type.2.1: Element 'property' must have no character or element information item [children], because the type's content type is empty.
WARNING: At line 110 of <https://ci-builds.apache.org/job/Tomee/job/tomee-8.x-build-full-java8/ws/examples/scala-basic/target/surefire-reports/TEST-org.superbiz.GreetingServiceTest.xml>:cvc-complex-type.2.1: Element 'property' must have no character or element information item [children], because the type's content type is empty.
WARNING: The result file '<https://ci-builds.apache.org/job/Tomee/job/tomee-8.x-build-full-java8/ws/examples/scala-basic/target/surefire-reports/TEST-org.superbiz.GreetingServiceTest.xml'> for the metric 'JUnit' is not valid. The result file has been skipped.
INFO: Setting the build status to org.jenkinsci.plugins.xunit.XUnitProcessorResult@a4ad4a9
Jenkins build is back to normal : TomEE » tomee-8.x-build-full-java8 #96
Posted by Apache Jenkins Server <je...@builds.apache.org>.
See <https://ci-builds.apache.org/job/Tomee/job/tomee-8.x-build-full-java8/96/display/redirect>
Build failed in Jenkins: TomEE » tomee-8.x-build-full-java8 #95
Posted by Apache Jenkins Server <je...@builds.apache.org>.
See <https://ci-builds.apache.org/job/Tomee/job/tomee-8.x-build-full-java8/95/display/redirect>
Changes:
------------------------------------------
[...truncated 68.82 MB...]
[INFO] TomEE :: Examples :: JPA with Hibernate 8.0.16-SNAPSHOT SUCCESS [ 5.089 s]
[INFO] TomEE :: Examples :: JPA with Hibernate and arquillian 8.0.16-SNAPSHOT SUCCESS [ 13.370 s]
[INFO] TomEE :: Examples :: JPA @Enumerated 8.0.16-SNAPSHOT SUCCESS [ 4.779 s]
[INFO] TomEE :: Web Examples :: JSF - ManangedBean and EJB 8.0.16-SNAPSHOT SUCCESS [ 1.318 s]
[INFO] TomEE :: Web Examples :: JSF - CDI and EJB 8.0.16-SNAPSHOT SUCCESS [ 0.433 s]
[INFO] TomEE :: Examples :: JUnit 5 :: Application Composer 8.0.16-SNAPSHOT SUCCESS [ 5.294 s]
[INFO] TomEE :: Examples :: JUnit 5 :: Multiple TomEE with Arquillian 8.0.16-SNAPSHOT SUCCESS [ 10.870 s]
[INFO] TomEE :: Examples :: JUnit 5 :: Simple Websockets with Arquillian 8.0.16-SNAPSHOT SUCCESS [ 9.160 s]
[INFO] TomEE :: Examples :: @EJB Lookup 8.0.16-SNAPSHOT ... SUCCESS [ 2.251 s]
[INFO] TomEE :: Examples :: EJB Lookup with descriptor 8.0.16-SNAPSHOT SUCCESS [ 2.203 s]
[INFO] TomEE :: Examples :: Movies Complete (Meta) 8.0.16-SNAPSHOT SUCCESS [ 5.040 s]
[INFO] TomEE :: Examples :: Movies Complete 8.0.16-SNAPSHOT SUCCESS [ 4.901 s]
[INFO] MicroProfile :: Examples :: Config 8.0.16-SNAPSHOT . SUCCESS [ 12.959 s]
[INFO] MicroProfile :: Examples :: Config Source Database 8.0.16-SNAPSHOT SUCCESS [ 13.003 s]
[INFO] TomEE :: Examples :: Microprofile Fault Tolerance :: Fallback 8.0.16-SNAPSHOT SUCCESS [ 11.894 s]
[INFO] TomEE :: Examples :: Microprofile Fault Tolerance :: Retry 8.0.16-SNAPSHOT SUCCESS [ 14.866 s]
[INFO] TomEE :: Examples :: Microprofile JSONB Configuration 8.0.16-SNAPSHOT SUCCESS [ 3.675 s]
[INFO] Apache TomEE + MicroProfile JWT Bean Validation 8.0.16-SNAPSHOT SUCCESS [ 12.111 s]
[INFO] Apache TomEE + MicroProfile JWT Bean Validation, Strongly-typed Annotations 8.0.16-SNAPSHOT SUCCESS [ 13.768 s]
[INFO] TomEE :: Examples :: Microprofile Metrics Counted 8.0.16-SNAPSHOT SUCCESS [ 11.858 s]
[INFO] TomEE :: Examples :: Microprofile Metrics Histogram 8.0.16-SNAPSHOT SUCCESS [ 11.098 s]
[INFO] TomEE :: Examples :: Microprofile Metrics Timed 8.0.16-SNAPSHOT SUCCESS [ 10.789 s]
[INFO] mp-metrics-gauge 8.0.16-SNAPSHOT ................... SUCCESS [ 11.730 s]
[INFO] mp-metrics-metered 8.0.16-SNAPSHOT ................. SUCCESS [ 0.134 s]
[INFO] mp-opentracing.traced 8.0.16-SNAPSHOT .............. SUCCESS [ 0.046 s]
[INFO] TomEE :: Examples :: MP REST JWT 8.0.16-SNAPSHOT ... SUCCESS [ 12.006 s]
[INFO] TomEE :: Examples :: MP REST JWT JWK 8.0.16-SNAPSHOT SUCCESS [ 13.206 s]
[INFO] TomEE :: Examples :: MP REST JWT PRINCIPAL 8.0.16-SNAPSHOT SUCCESS [ 14.617 s]
[INFO] TomEE :: Examples :: MP REST JWT Public Key 8.0.16-SNAPSHOT SUCCESS [ 11.330 s]
[INFO] TomEE :: Utils :: Mockito 8.0.16-SNAPSHOT .......... SUCCESS [ 7.412 s]
[INFO] TomEE :: Examples :: MTOM 8.0.16-SNAPSHOT .......... SUCCESS [ 5.694 s]
[INFO] TomEE :: Examples :: Multiple JPA providers 8.0.16-SNAPSHOT SUCCESS [ 11.730 s]
[INFO] TomEE :: Examples :: Multiple Arquillian Adapters 8.0.16-SNAPSHOT SUCCESS [ 24.288 s]
[INFO] TomEE :: Examples :: Multiple TomEE with Arquillian 8.0.16-SNAPSHOT SUCCESS [ 10.037 s]
[INFO] TomEE :: Examples :: JSF2/CDI/BV/JPA/CODI 8.0.16-SNAPSHOT SUCCESS [ 1.826 s]
[INFO] TomEE :: Examples :: Persistence Fragment 8.0.16-SNAPSHOT SUCCESS [ 2.957 s]
[INFO] TomEE :: Web Examples :: Pojo WS 8.0.16-SNAPSHOT ... SUCCESS [ 0.104 s]
[INFO] TomEE :: Examples :: Polling 8.0.16-SNAPSHOT ....... SUCCESS [ 0.062 s]
[INFO] TomEE :: Examples :: Polling :: Domain 8.0.16-SNAPSHOT SUCCESS [ 1.002 s]
[INFO] TomEE :: Examples :: Polling :: Core 8.0.16-SNAPSHOT SUCCESS [ 7.126 s]
[INFO] TomEE :: Examples :: Polling :: Web 8.0.16-SNAPSHOT SUCCESS [ 21.081 s]
[INFO] TomEE :: Examples :: Polling :: Client 8.0.16-SNAPSHOT SUCCESS [ 0.416 s]
[INFO] TomEE :: Examples :: DeltaSpike ProjectStage 8.0.16-SNAPSHOT SUCCESS [ 15.395 s]
[INFO] TomEE :: Examples :: Quartz 8.0.16-SNAPSHOT ........ SUCCESS [ 0.021 s]
[INFO] TomEE :: Examples :: Quartz :: Quartz Resource Adapter 8.0.16-SNAPSHOT SUCCESS [ 0.154 s]
[INFO] TomEE :: Examples :: Quartz :: Quartz Beans 8.0.16-SNAPSHOT SUCCESS [ 8.020 s]
[INFO] TomEE :: Examples :: DataSource Realm 8.0.16-SNAPSHOT SUCCESS [ 0.038 s]
[INFO] TomEE :: Examples :: Reloadable Persistence Unit Properties 8.0.16-SNAPSHOT SUCCESS [ 4.889 s]
[INFO] TomEE :: Web Examples :: Resource Declared In A Webapp 8.0.16-SNAPSHOT SUCCESS [ 0.070 s]
[INFO] TomEE :: Examples :: REST, Mockito and Application Composer 8.0.16-SNAPSHOT SUCCESS [ 3.853 s]
[INFO] TomEE :: Examples :: REST and Application Composer 8.0.16-SNAPSHOT SUCCESS [ 3.092 s]
[INFO] TomEE :: Examples :: REST CDI 8.0.16-SNAPSHOT ...... SUCCESS [ 4.890 s]
[INFO] TomEE :: Examples :: JAXRS and JAAS 8.0.16-SNAPSHOT SUCCESS [ 0.053 s]
[INFO] TomEE :: Examples :: REST and EJB 8.0.16-SNAPSHOT .. SUCCESS [ 6.773 s]
[INFO] TomEE :: Web Examples :: REST Example 8.0.16-SNAPSHOT SUCCESS [ 13.840 s]
[INFO] TomEE :: Web Examples :: REST Example With Application 8.0.16-SNAPSHOT SUCCESS [ 0.451 s]
[INFO] TomEE :: Web Examples :: REST SSE Example 8.0.16-SNAPSHOT SUCCESS [ 0.259 s]
[INFO] TomEE :: Examples :: REST XML JSON 8.0.16-SNAPSHOT . SUCCESS [ 4.248 s]
[INFO] TomEE :: Examples :: Basic Scala 8.0.16-SNAPSHOT ... SUCCESS [ 11.108 s]
[INFO] TomEE :: Examples :: ScheduleExpression 8.0.16-SNAPSHOT SUCCESS [ 7.269 s]
[INFO] TomEE :: Examples :: @Schedule Events 8.0.16-SNAPSHOT SUCCESS [ 12.156 s]
[INFO] TomEE :: Examples :: @Schedule Methods (Meta) 8.0.16-SNAPSHOT SUCCESS [ 7.311 s]
[INFO] TomEE :: Examples :: @Schedule Methods 8.0.16-SNAPSHOT SUCCESS [ 7.312 s]
[INFO] TomEE :: Examples :: Server Events 8.0.16-SNAPSHOT . SUCCESS [ 3.044 s]
[INFO] TomEE :: Examples :: Serverless Apache TomEE WebProfile 8.0.16-SNAPSHOT SUCCESS [ 5.700 s]
[INFO] TomEE :: Examples :: Serverless Apache TomEE WebProfile 8.0.16-SNAPSHOT SUCCESS [ 5.826 s]
[INFO] TomEE :: Examples :: Serverless Apache TomEE MicroProfile 8.0.16-SNAPSHOT SUCCESS [ 7.761 s]
[INFO] TomEE :: Examples :: Serverless Apache TomEE Plume 8.0.16-SNAPSHOT SUCCESS [ 5.935 s]
[INFO] TomEE :: Examples :: Serverless Apache TomEE Plus 8.0.16-SNAPSHOT SUCCESS [ 6.650 s]
[INFO] TomEE :: Examples :: Singleton startup ordering 8.0.16-SNAPSHOT SUCCESS [ 10.322 s]
[INFO] TomEE :: Examples :: Simple CDI Interceptor 8.0.16-SNAPSHOT SUCCESS [ 2.513 s]
[INFO] TomEE :: Examples :: Simple EAR 8.0.16-SNAPSHOT .... SUCCESS [ 0.018 s]
[INFO] TomEE :: Examples :: Simple EAR :: Business Model 8.0.16-SNAPSHOT SUCCESS [ 0.312 s]
[INFO] TomEE :: Examples :: Simple EAR :: Business Logic 8.0.16-SNAPSHOT SUCCESS [ 4.401 s]
[INFO] TomEE :: Examples :: Simple EAR :: Webapp 8.0.16-SNAPSHOT SUCCESS [ 0.437 s]
[INFO] TomEE :: Examples :: Simple EAR :: EAR Packaging 8.0.16-SNAPSHOT SUCCESS [ 0.093 s]
[INFO] TomEE :: Examples :: Simple EAR :: Functional Tests 8.0.16-SNAPSHOT SUCCESS [ 19.830 s]
[INFO] TomEE :: Examples :: Simple CMP2 Entity 8.0.16-SNAPSHOT SUCCESS [ 4.469 s]
[INFO] TomEE :: Examples :: Simple JMS 8.0.16-SNAPSHOT .... SUCCESS [ 19.744 s]
[INFO] TomEE :: Examples :: Simple JMS Context 8.0.16-SNAPSHOT SUCCESS [ 17.302 s]
[INFO] TomEE :: Examples :: Simple MDB With a CDI Injection 8.0.16-SNAPSHOT SUCCESS [ 6.182 s]
[INFO] TomEE :: Examples :: Simple MDB Example 8.0.16-SNAPSHOT SUCCESS [ 6.153 s]
[INFO] TomEE :: Examples :: Simple MDB Using Deployment Descriptor Example 8.0.16-SNAPSHOT SUCCESS [ 6.309 s]
[INFO] TomEE :: Examples :: Simple Remote tomcat-users.xml 8.0.16-SNAPSHOT SUCCESS [ 7.602 s]
[INFO] TomEE :: Examples :: Simple REST 8.0.16-SNAPSHOT ... SUCCESS [ 3.541 s]
[INFO] TomEE :: Examples :: Simple Singleton 8.0.16-SNAPSHOT SUCCESS [ 2.464 s]
[INFO] TomEE :: Examples :: Simple Stateful Pojo 8.0.16-SNAPSHOT SUCCESS [ 2.304 s]
[INFO] TomEE :: Examples :: Simple Stateful Pojo Callbacks 8.0.16-SNAPSHOT FAILURE [ 6.366 s]
[INFO] TomEE :: Examples :: Simple Stateless Pojo 8.0.16-SNAPSHOT SUCCESS [ 2.248 s]
[INFO] TomEE :: Examples :: Simple Stateless Pojo Callbacks 8.0.16-SNAPSHOT SUCCESS [ 2.346 s]
[INFO] TomEE :: Examples :: Simple Stateless With Deployment Descriptor 8.0.16-SNAPSHOT SUCCESS [ 1.867 s]
[INFO] TomEE :: Examples :: Simple Webservice 8.0.16-SNAPSHOT SUCCESS [ 6.957 s]
[INFO] TomEE :: Examples :: Simple Webservice Without Interface 8.0.16-SNAPSHOT SUCCESS [ 6.201 s]
[INFO] OpenEJB :: Examples :: Async Servlet 8.0.16-SNAPSHOT SUCCESS [ 25.141 s]
[INFO] TomEE :: Examples :: Spring Data 8.0.16-SNAPSHOT ... SUCCESS [ 7.936 s]
[INFO] TomEE :: Examples :: Spring Data Meta 8.0.16-SNAPSHOT SUCCESS [ 5.523 s]
[INFO] TomEE :: Web Examples :: Struts 8.0.16-SNAPSHOT .... SUCCESS [ 1.214 s]
[INFO] TomEE :: Examples :: Telephone Stateful Pojo 8.0.16-SNAPSHOT SUCCESS [ 3.474 s]
[INFO] TomEE :: Examples :: TestCase Injection 8.0.16-SNAPSHOT SUCCESS [ 4.807 s]
[INFO] TomEE :: Examples :: Testing Security (Meta) 8.0.16-SNAPSHOT SUCCESS [ 4.883 s]
[INFO] TomEE :: Examples :: Testing Security 8.0.16-SNAPSHOT SUCCESS [ 5.710 s]
[INFO] TomEE :: Examples :: Testing Security 8.0.16-SNAPSHOT SUCCESS [ 5.776 s]
[INFO] TomEE :: Examples :: Testing Security Service Provider 8.0.16-SNAPSHOT SUCCESS [ 6.176 s]
[INFO] TomEE :: Examples :: Testing Security Script Service Provider 8.0.16-SNAPSHOT SUCCESS [ 7.511 s]
[INFO] TomEE :: Examples :: Testing Transactions 8.0.16-SNAPSHOT SUCCESS [ 4.958 s]
[INFO] TomEE :: Examples :: Testing Transactions BMT 8.0.16-SNAPSHOT SUCCESS [ 5.034 s]
[INFO] TomEE :: Examples :: TomEE, Jersey, Eclipselink 8.0.16-SNAPSHOT SUCCESS [ 12.889 s]
[INFO] TomEE :: TomEE :: IBM MQ AMQ Portability Examples :: MDB Example 1.0 SUCCESS [ 1.045 s]
[INFO] TomEE :: Examples :: Transaction Rollback 8.0.16-SNAPSHOT SUCCESS [ 6.347 s]
[INFO] TomEE :: Examples :: Troubleshooting 8.0.16-SNAPSHOT SUCCESS [ 4.732 s]
[INFO] TomEE :: Examples :: Webservice Attachments 8.0.16-SNAPSHOT SUCCESS [ 5.548 s]
[INFO] TomEE :: Examples :: Webservice Inheritance 8.0.16-SNAPSHOT SUCCESS [ 8.460 s]
[INFO] TomEE :: Web Examples :: EJB WebService with Security 8.0.16-SNAPSHOT SUCCESS [ 6.091 s]
[INFO] TomEE :: Web Examples :: EJB WebService with SSL Client Certificate 8.0.16-SNAPSHOT SUCCESS [ 19.338 s]
[INFO] TomEE :: Web Examples :: EJB WebService with WS-Security 8.0.16-SNAPSHOT SUCCESS [ 14.311 s]
[INFO] TomEE :: Web Examples :: EJB WebService WS Security with resources.xml 8.0.16-SNAPSHOT SUCCESS [ 7.046 s]
[INFO] TomEE :: Examples :: Web Service Handlers 8.0.16-SNAPSHOT SUCCESS [ 6.863 s]
[INFO] TomEE :: Examples :: @WebService Holder 8.0.16-SNAPSHOT SUCCESS [ 6.720 s]
[INFO] TomEE :: Web Examples :: Moviefun 8.0.16-SNAPSHOT .. SUCCESS [ 49.088 s]
[INFO] TomEE :: Web Examples :: Moviefun Rest 8.0.16-SNAPSHOT SUCCESS [ 23.762 s]
[INFO] TomEE :: Utils :: Provisionning 8.0.16-SNAPSHOT .... SUCCESS [ 3.362 s]
[INFO] TomEE :: Examples :: Resources/JMX Example 8.0.16-SNAPSHOT SUCCESS [ 0.312 s]
[INFO] TomEE :: Examples :: Resources/JMX Example :: EJB Module 8.0.16-SNAPSHOT SUCCESS [ 12.200 s]
[INFO] TomEE :: Examples :: Resources/JMX Example :: EAR Module 8.0.16-SNAPSHOT SUCCESS [ 0.221 s]
[INFO] TomEE :: Examples :: WebSocket with tls and basic auth Example 8.0.16-SNAPSHOT SUCCESS [ 7.896 s]
[INFO] TomEE :: Examples :: Concurrency utilities example 8.0.16-SNAPSHOT SUCCESS [ 13.865 s]
[INFO] TomEE :: Examples :: MVC (CXF-based) 8.0.16-SNAPSHOT SUCCESS [ 38.603 s]
[INFO] TomEE :: Examples :: MVC (CXF-based) with Hibernate 8.0.16-SNAPSHOT SUCCESS [ 29.295 s]
[INFO] TomEE :: Examples :: Microprofile REST Client 8.0.16-SNAPSHOT SUCCESS [ 11.420 s]
[INFO] TomEE :: Examples :: MVC (RestEasy-based) 8.0.16-SNAPSHOT SUCCESS [ 19.177 s]
[INFO] TomEE :: Examples :: Custom HealthCheck 8.0.16-SNAPSHOT SUCCESS [ 10.467 s]
[INFO] TomEE :: Examples :: Microprofile JSONB Configuration 8.0.16-SNAPSHOT SUCCESS [ 3.498 s]
[INFO] TomEE :: Examples :: Microprofile JSONB Custom Serializer/Deserializer 8.0.16-SNAPSHOT SUCCESS [ 3.590 s]
[INFO] TomEE :: Examples :: Vaadin LTS V08 8.0.16-SNAPSHOT SUCCESS [ 1.837 s]
[INFO] TomEE :: Examples :: Vaadin LTS V10 8.0.16-SNAPSHOT SUCCESS [ 3.315 s]
[INFO] TomEE :: Examples :: Vaadin LATEST 8.0.16-SNAPSHOT . SUCCESS [ 1.998 s]
[INFO] TomEE :: Examples :: Azure deployment example 8.0.16-SNAPSHOT SUCCESS [ 5.707 s]
[INFO] TomEE :: Examples :: Microprofile Fault Tolerance :: Timeout 8.0.16-SNAPSHOT SUCCESS [ 9.670 s]
[INFO] TomEE :: Examples :: XA Datasource configuration and usage 8.0.16-SNAPSHOT SUCCESS [ 46.953 s]
[INFO] TomEE :: Examples :: Websocket JMS 8.0.16-SNAPSHOT . SUCCESS [ 8.221 s]
[INFO] TomEE :: Examples :: Properties Provider 8.0.16-SNAPSHOT SUCCESS [ 0.019 s]
[INFO] TomEE :: Examples :: Properties Provider :: Implementation 8.0.16-SNAPSHOT SUCCESS [ 0.084 s]
[INFO] TomEE :: Examples :: Properties Provider :: Sample Webapp 8.0.16-SNAPSHOT SUCCESS [ 5.965 s]
[INFO] TomEE :: Examples :: Jakarta Security tomcat-user.xml Identity Store 8.0.16-SNAPSHOT SUCCESS [ 8.019 s]
[INFO] TomEE :: Examples :: Jakarta Security custom Identity Store 8.0.16-SNAPSHOT SUCCESS [ 10.094 s]
[INFO] TomEE :: Examples 8.0.16-SNAPSHOT .................. SUCCESS [ 0.499 s]
[INFO] TomEE :: Assembly :: All In One EJB Lite jar 8.0.16-SNAPSHOT SUCCESS [ 28.287 s]
[INFO] TomEE :: Utils :: TomEE Webapps-based Deployer EJB 8.0.16-SNAPSHOT SUCCESS [ 0.682 s]
[INFO] TomEE :: TCK 8.0.16-SNAPSHOT ....................... SUCCESS [ 0.060 s]
[INFO] TomEE :: TCK :: Common 8.0.16-SNAPSHOT ............. SUCCESS [ 1.314 s]
[INFO] TomEE :: TCK :: CDI Embedded 8.0.16-SNAPSHOT ....... SUCCESS [04:27 min]
[INFO] TomEE :: TCK :: CDI TomEE 8.0.16-SNAPSHOT .......... SUCCESS [49:05 min]
[INFO] TomEE :: TCK :: CDI TCK Signature Tests 8.0.16-SNAPSHOT SUCCESS [ 2.323 s]
[INFO] TomEE :: TCK :: Bean Validation Embedded 8.0.16-SNAPSHOT SUCCESS [01:19 min]
[INFO] TomEE :: TCK :: Bean Validation TomEE 8.0.16-SNAPSHOT SUCCESS [08:24 min]
[INFO] TomEE :: TCK :: Bean Validation TCK Signature tests 8.0.16-SNAPSHOT SUCCESS [ 1.725 s]
[INFO] TomEE :: TCK :: MicroProfile 8.0.16-SNAPSHOT ....... SUCCESS [ 0.038 s]
[INFO] TomEE :: TCK :: MicroProfile Config TCK 8.0.16-SNAPSHOT SUCCESS [03:10 min]
[INFO] TomEE :: TCK :: MicroProfile JWT TCK 8.0.16-SNAPSHOT SUCCESS [01:23 min]
[INFO] TomEE :: TCK :: MicroProfile Fault Tolerance TCK 8.0.16-SNAPSHOT SUCCESS [10:44 min]
[INFO] TomEE :: TCK :: MicroProfile Health TCK 8.0.16-SNAPSHOT SUCCESS [01:25 min]
[INFO] TomEE :: TCK :: MicroProfile Metrics TCK 8.0.16-SNAPSHOT SUCCESS [10:07 min]
[INFO] TomEE :: TCK :: MicroProfile Rest Client TCK 8.0.16-SNAPSHOT SUCCESS [11:56 min]
[INFO] TomEE :: TCK :: MicroProfile Open API TCK 8.0.16-SNAPSHOT SUCCESS [03:32 min]
[INFO] TomEE :: TCK :: MicroProfile Open Tracing TCK 8.0.16-SNAPSHOT SUCCESS [ 32.497 s]
[INFO] TomEE :: Arquillian Adaptors Parent :: Webapp Remote 8.0.16-SNAPSHOT SUCCESS [ 55.236 s]
[INFO] TomEE :: Arquillian Adaptors Parent :: Tests 8.0.16-SNAPSHOT SUCCESS [ 3.397 s]
[INFO] TomEE :: Arquillian Adaptors Parent :: Tests :: Web Profile 8.0.16-SNAPSHOT SUCCESS [06:40 min]
[INFO] TomEE :: Arquillian Adaptors Parent :: Tests :: JAXRS 8.0.16-SNAPSHOT SUCCESS [02:39 min]
[INFO] TomEE :: Arquillian Adaptors Parent :: Tests :: JAXWS 8.0.16-SNAPSHOT SUCCESS [ 50.803 s]
[INFO] TomEE :: Arquillian Adaptors Parent :: Tests :: JMS 8.0.16-SNAPSHOT SUCCESS [ 36.775 s]
[INFO] TomEE :: Arquillian Adaptors Parent :: Tests :: CODI 8.0.16-SNAPSHOT SUCCESS [ 55.593 s]
[INFO] TomEE :: Arquillian Adaptors Parent :: Tests :: Configuration Tests 8.0.16-SNAPSHOT SUCCESS [ 55.867 s]
[INFO] TomEE :: Arquillian Adaptors Parent :: Sample :: Moviefun 8.0.16-SNAPSHOT SUCCESS [ 35.180 s]
[INFO] TomEE :: Arquillian Adaptors Parent :: Arquillian TCK 8.0.16-SNAPSHOT SUCCESS [ 1.087 s]
[INFO] TomEE :: Utils :: Log4j2 8.0.16-SNAPSHOT ........... SUCCESS [ 0.788 s]
[INFO] TomEE :: TomEE :: webaccess 8.0.16-SNAPSHOT ........ SUCCESS [ 15.610 s]
[INFO] TomEE :: TomEE :: Overlay Runner 8.0.16-SNAPSHOT ... SUCCESS [ 0.739 s]
[INFO] ------------------------------------------------------------------------
[INFO] BUILD FAILURE
[INFO] ------------------------------------------------------------------------
[INFO] Total time: 03:40 h
[INFO] Finished at: 2023-06-13T21:44:27Z
[INFO] ------------------------------------------------------------------------
[ERROR] Failed to execute goal org.apache.maven.plugins:maven-surefire-plugin:2.12.4:test (default-test) on project simple-stateful-callbacks: There are test failures.
[ERROR]
[ERROR] Please refer to <https://ci-builds.apache.org/job/Tomee/job/tomee-8.x-build-full-java8/ws/examples/simple-stateful-callbacks/target/surefire-reports> for the individual test results.
[ERROR] -> [Help 1]
[ERROR]
[ERROR] To see the full stack trace of the errors, re-run Maven with the -e switch.
[ERROR] Re-run Maven using the -X switch to enable full debug logging.
[ERROR]
[ERROR] For more information about the errors and possible solutions, please read the following articles:
[ERROR] [Help 1] http://cwiki.apache.org/confluence/display/MAVEN/MojoFailureException
[ERROR]
[ERROR] After correcting the problems, you can resume the build with the command
[ERROR] mvn <args> -rf :simple-stateful-callbacks
Build step 'Invoke top-level Maven targets' marked build as failure
INFO: Processing JUnit
INFO: [JUnit] - 1,350 test report file(s) were found with the pattern '**/target/surefire-reports/TEST-*.xml' relative to '<https://ci-builds.apache.org/job/Tomee/job/tomee-8.x-build-full-java8/ws/'> for the testing framework 'JUnit'.
WARNING: The file '<https://ci-builds.apache.org/job/Tomee/job/tomee-8.x-build-full-java8/ws/examples/scala-basic/target/surefire-reports/TEST-org.scalatest.tools.DiscoverySuite-b07e95f8-ed69-4e77-a55c-33b959f3571a.xml'> is an invalid file.
WARNING: At line 8 of <https://ci-builds.apache.org/job/Tomee/job/tomee-8.x-build-full-java8/ws/examples/scala-basic/target/surefire-reports/TEST-org.scalatest.tools.DiscoverySuite-b07e95f8-ed69-4e77-a55c-33b959f3571a.xml>:cvc-complex-type.2.1: Element 'property' must have no character or element information item [children], because the type's content type is empty.
WARNING: At line 14 of <https://ci-builds.apache.org/job/Tomee/job/tomee-8.x-build-full-java8/ws/examples/scala-basic/target/surefire-reports/TEST-org.scalatest.tools.DiscoverySuite-b07e95f8-ed69-4e77-a55c-33b959f3571a.xml>:cvc-complex-type.2.1: Element 'property' must have no character or element information item [children], because the type's content type is empty.
WARNING: At line 25 of <https://ci-builds.apache.org/job/Tomee/job/tomee-8.x-build-full-java8/ws/examples/scala-basic/target/surefire-reports/TEST-org.scalatest.tools.DiscoverySuite-b07e95f8-ed69-4e77-a55c-33b959f3571a.xml>:cvc-complex-type.2.1: Element 'property' must have no character or element information item [children], because the type's content type is empty.
WARNING: At line 28 of <https://ci-builds.apache.org/job/Tomee/job/tomee-8.x-build-full-java8/ws/examples/scala-basic/target/surefire-reports/TEST-org.scalatest.tools.DiscoverySuite-b07e95f8-ed69-4e77-a55c-33b959f3571a.xml>:cvc-complex-type.2.1: Element 'property' must have no character or element information item [children], because the type's content type is empty.
WARNING: At line 33 of <https://ci-builds.apache.org/job/Tomee/job/tomee-8.x-build-full-java8/ws/examples/scala-basic/target/surefire-reports/TEST-org.scalatest.tools.DiscoverySuite-b07e95f8-ed69-4e77-a55c-33b959f3571a.xml>:cvc-complex-type.2.1: Element 'property' must have no character or element information item [children], because the type's content type is empty.
WARNING: At line 36 of <https://ci-builds.apache.org/job/Tomee/job/tomee-8.x-build-full-java8/ws/examples/scala-basic/target/surefire-reports/TEST-org.scalatest.tools.DiscoverySuite-b07e95f8-ed69-4e77-a55c-33b959f3571a.xml>:cvc-complex-type.2.1: Element 'property' must have no character or element information item [children], because the type's content type is empty.
WARNING: At line 39 of <https://ci-builds.apache.org/job/Tomee/job/tomee-8.x-build-full-java8/ws/examples/scala-basic/target/surefire-reports/TEST-org.scalatest.tools.DiscoverySuite-b07e95f8-ed69-4e77-a55c-33b959f3571a.xml>:cvc-complex-type.2.1: Element 'property' must have no character or element information item [children], because the type's content type is empty.
WARNING: At line 47 of <https://ci-builds.apache.org/job/Tomee/job/tomee-8.x-build-full-java8/ws/examples/scala-basic/target/surefire-reports/TEST-org.scalatest.tools.DiscoverySuite-b07e95f8-ed69-4e77-a55c-33b959f3571a.xml>:cvc-complex-type.2.1: Element 'property' must have no character or element information item [children], because the type's content type is empty.
WARNING: At line 51 of <https://ci-builds.apache.org/job/Tomee/job/tomee-8.x-build-full-java8/ws/examples/scala-basic/target/surefire-reports/TEST-org.scalatest.tools.DiscoverySuite-b07e95f8-ed69-4e77-a55c-33b959f3571a.xml>:cvc-complex-type.2.1: Element 'property' must have no character or element information item [children], because the type's content type is empty.
WARNING: At line 55 of <https://ci-builds.apache.org/job/Tomee/job/tomee-8.x-build-full-java8/ws/examples/scala-basic/target/surefire-reports/TEST-org.scalatest.tools.DiscoverySuite-b07e95f8-ed69-4e77-a55c-33b959f3571a.xml>:cvc-complex-type.2.1: Element 'property' must have no character or element information item [children], because the type's content type is empty.
WARNING: At line 58 of <https://ci-builds.apache.org/job/Tomee/job/tomee-8.x-build-full-java8/ws/examples/scala-basic/target/surefire-reports/TEST-org.scalatest.tools.DiscoverySuite-b07e95f8-ed69-4e77-a55c-33b959f3571a.xml>:cvc-complex-type.2.1: Element 'property' must have no character or element information item [children], because the type's content type is empty.
WARNING: At line 62 of <https://ci-builds.apache.org/job/Tomee/job/tomee-8.x-build-full-java8/ws/examples/scala-basic/target/surefire-reports/TEST-org.scalatest.tools.DiscoverySuite-b07e95f8-ed69-4e77-a55c-33b959f3571a.xml>:cvc-complex-type.2.1: Element 'property' must have no character or element information item [children], because the type's content type is empty.
WARNING: At line 66 of <https://ci-builds.apache.org/job/Tomee/job/tomee-8.x-build-full-java8/ws/examples/scala-basic/target/surefire-reports/TEST-org.scalatest.tools.DiscoverySuite-b07e95f8-ed69-4e77-a55c-33b959f3571a.xml>:cvc-complex-type.2.1: Element 'property' must have no character or element information item [children], because the type's content type is empty.
WARNING: At line 74 of <https://ci-builds.apache.org/job/Tomee/job/tomee-8.x-build-full-java8/ws/examples/scala-basic/target/surefire-reports/TEST-org.scalatest.tools.DiscoverySuite-b07e95f8-ed69-4e77-a55c-33b959f3571a.xml>:cvc-complex-type.2.1: Element 'property' must have no character or element information item [children], because the type's content type is empty.
WARNING: At line 78 of <https://ci-builds.apache.org/job/Tomee/job/tomee-8.x-build-full-java8/ws/examples/scala-basic/target/surefire-reports/TEST-org.scalatest.tools.DiscoverySuite-b07e95f8-ed69-4e77-a55c-33b959f3571a.xml>:cvc-complex-type.2.1: Element 'property' must have no character or element information item [children], because the type's content type is empty.
WARNING: At line 83 of <https://ci-builds.apache.org/job/Tomee/job/tomee-8.x-build-full-java8/ws/examples/scala-basic/target/surefire-reports/TEST-org.scalatest.tools.DiscoverySuite-b07e95f8-ed69-4e77-a55c-33b959f3571a.xml>:cvc-complex-type.2.1: Element 'property' must have no character or element information item [children], because the type's content type is empty.
WARNING: At line 86 of <https://ci-builds.apache.org/job/Tomee/job/tomee-8.x-build-full-java8/ws/examples/scala-basic/target/surefire-reports/TEST-org.scalatest.tools.DiscoverySuite-b07e95f8-ed69-4e77-a55c-33b959f3571a.xml>:cvc-complex-type.2.1: Element 'property' must have no character or element information item [children], because the type's content type is empty.
WARNING: At line 94 of <https://ci-builds.apache.org/job/Tomee/job/tomee-8.x-build-full-java8/ws/examples/scala-basic/target/surefire-reports/TEST-org.scalatest.tools.DiscoverySuite-b07e95f8-ed69-4e77-a55c-33b959f3571a.xml>:cvc-complex-type.2.1: Element 'property' must have no character or element information item [children], because the type's content type is empty.
WARNING: At line 98 of <https://ci-builds.apache.org/job/Tomee/job/tomee-8.x-build-full-java8/ws/examples/scala-basic/target/surefire-reports/TEST-org.scalatest.tools.DiscoverySuite-b07e95f8-ed69-4e77-a55c-33b959f3571a.xml>:cvc-complex-type.2.1: Element 'property' must have no character or element information item [children], because the type's content type is empty.
WARNING: At line 103 of <https://ci-builds.apache.org/job/Tomee/job/tomee-8.x-build-full-java8/ws/examples/scala-basic/target/surefire-reports/TEST-org.scalatest.tools.DiscoverySuite-b07e95f8-ed69-4e77-a55c-33b959f3571a.xml>:cvc-complex-type.2.1: Element 'property' must have no character or element information item [children], because the type's content type is empty.
WARNING: At line 106 of <https://ci-builds.apache.org/job/Tomee/job/tomee-8.x-build-full-java8/ws/examples/scala-basic/target/surefire-reports/TEST-org.scalatest.tools.DiscoverySuite-b07e95f8-ed69-4e77-a55c-33b959f3571a.xml>:cvc-complex-type.2.1: Element 'property' must have no character or element information item [children], because the type's content type is empty.
WARNING: At line 110 of <https://ci-builds.apache.org/job/Tomee/job/tomee-8.x-build-full-java8/ws/examples/scala-basic/target/surefire-reports/TEST-org.scalatest.tools.DiscoverySuite-b07e95f8-ed69-4e77-a55c-33b959f3571a.xml>:cvc-complex-type.2.1: Element 'property' must have no character or element information item [children], because the type's content type is empty.
WARNING: The result file '<https://ci-builds.apache.org/job/Tomee/job/tomee-8.x-build-full-java8/ws/examples/scala-basic/target/surefire-reports/TEST-org.scalatest.tools.DiscoverySuite-b07e95f8-ed69-4e77-a55c-33b959f3571a.xml'> for the metric 'JUnit' is not valid. The result file has been skipped.
WARNING: The file '<https://ci-builds.apache.org/job/Tomee/job/tomee-8.x-build-full-java8/ws/examples/scala-basic/target/surefire-reports/TEST-org.superbiz.GreetingServiceTest.xml'> is an invalid file.
WARNING: At line 8 of <https://ci-builds.apache.org/job/Tomee/job/tomee-8.x-build-full-java8/ws/examples/scala-basic/target/surefire-reports/TEST-org.superbiz.GreetingServiceTest.xml>:cvc-complex-type.2.1: Element 'property' must have no character or element information item [children], because the type's content type is empty.
WARNING: At line 14 of <https://ci-builds.apache.org/job/Tomee/job/tomee-8.x-build-full-java8/ws/examples/scala-basic/target/surefire-reports/TEST-org.superbiz.GreetingServiceTest.xml>:cvc-complex-type.2.1: Element 'property' must have no character or element information item [children], because the type's content type is empty.
WARNING: At line 25 of <https://ci-builds.apache.org/job/Tomee/job/tomee-8.x-build-full-java8/ws/examples/scala-basic/target/surefire-reports/TEST-org.superbiz.GreetingServiceTest.xml>:cvc-complex-type.2.1: Element 'property' must have no character or element information item [children], because the type's content type is empty.
WARNING: At line 28 of <https://ci-builds.apache.org/job/Tomee/job/tomee-8.x-build-full-java8/ws/examples/scala-basic/target/surefire-reports/TEST-org.superbiz.GreetingServiceTest.xml>:cvc-complex-type.2.1: Element 'property' must have no character or element information item [children], because the type's content type is empty.
WARNING: At line 33 of <https://ci-builds.apache.org/job/Tomee/job/tomee-8.x-build-full-java8/ws/examples/scala-basic/target/surefire-reports/TEST-org.superbiz.GreetingServiceTest.xml>:cvc-complex-type.2.1: Element 'property' must have no character or element information item [children], because the type's content type is empty.
WARNING: At line 36 of <https://ci-builds.apache.org/job/Tomee/job/tomee-8.x-build-full-java8/ws/examples/scala-basic/target/surefire-reports/TEST-org.superbiz.GreetingServiceTest.xml>:cvc-complex-type.2.1: Element 'property' must have no character or element information item [children], because the type's content type is empty.
WARNING: At line 39 of <https://ci-builds.apache.org/job/Tomee/job/tomee-8.x-build-full-java8/ws/examples/scala-basic/target/surefire-reports/TEST-org.superbiz.GreetingServiceTest.xml>:cvc-complex-type.2.1: Element 'property' must have no character or element information item [children], because the type's content type is empty.
WARNING: At line 47 of <https://ci-builds.apache.org/job/Tomee/job/tomee-8.x-build-full-java8/ws/examples/scala-basic/target/surefire-reports/TEST-org.superbiz.GreetingServiceTest.xml>:cvc-complex-type.2.1: Element 'property' must have no character or element information item [children], because the type's content type is empty.
WARNING: At line 51 of <https://ci-builds.apache.org/job/Tomee/job/tomee-8.x-build-full-java8/ws/examples/scala-basic/target/surefire-reports/TEST-org.superbiz.GreetingServiceTest.xml>:cvc-complex-type.2.1: Element 'property' must have no character or element information item [children], because the type's content type is empty.
WARNING: At line 55 of <https://ci-builds.apache.org/job/Tomee/job/tomee-8.x-build-full-java8/ws/examples/scala-basic/target/surefire-reports/TEST-org.superbiz.GreetingServiceTest.xml>:cvc-complex-type.2.1: Element 'property' must have no character or element information item [children], because the type's content type is empty.
WARNING: At line 58 of <https://ci-builds.apache.org/job/Tomee/job/tomee-8.x-build-full-java8/ws/examples/scala-basic/target/surefire-reports/TEST-org.superbiz.GreetingServiceTest.xml>:cvc-complex-type.2.1: Element 'property' must have no character or element information item [children], because the type's content type is empty.
WARNING: At line 62 of <https://ci-builds.apache.org/job/Tomee/job/tomee-8.x-build-full-java8/ws/examples/scala-basic/target/surefire-reports/TEST-org.superbiz.GreetingServiceTest.xml>:cvc-complex-type.2.1: Element 'property' must have no character or element information item [children], because the type's content type is empty.
WARNING: At line 66 of <https://ci-builds.apache.org/job/Tomee/job/tomee-8.x-build-full-java8/ws/examples/scala-basic/target/surefire-reports/TEST-org.superbiz.GreetingServiceTest.xml>:cvc-complex-type.2.1: Element 'property' must have no character or element information item [children], because the type's content type is empty.
WARNING: At line 74 of <https://ci-builds.apache.org/job/Tomee/job/tomee-8.x-build-full-java8/ws/examples/scala-basic/target/surefire-reports/TEST-org.superbiz.GreetingServiceTest.xml>:cvc-complex-type.2.1: Element 'property' must have no character or element information item [children], because the type's content type is empty.
WARNING: At line 78 of <https://ci-builds.apache.org/job/Tomee/job/tomee-8.x-build-full-java8/ws/examples/scala-basic/target/surefire-reports/TEST-org.superbiz.GreetingServiceTest.xml>:cvc-complex-type.2.1: Element 'property' must have no character or element information item [children], because the type's content type is empty.
WARNING: At line 83 of <https://ci-builds.apache.org/job/Tomee/job/tomee-8.x-build-full-java8/ws/examples/scala-basic/target/surefire-reports/TEST-org.superbiz.GreetingServiceTest.xml>:cvc-complex-type.2.1: Element 'property' must have no character or element information item [children], because the type's content type is empty.
WARNING: At line 86 of <https://ci-builds.apache.org/job/Tomee/job/tomee-8.x-build-full-java8/ws/examples/scala-basic/target/surefire-reports/TEST-org.superbiz.GreetingServiceTest.xml>:cvc-complex-type.2.1: Element 'property' must have no character or element information item [children], because the type's content type is empty.
WARNING: At line 94 of <https://ci-builds.apache.org/job/Tomee/job/tomee-8.x-build-full-java8/ws/examples/scala-basic/target/surefire-reports/TEST-org.superbiz.GreetingServiceTest.xml>:cvc-complex-type.2.1: Element 'property' must have no character or element information item [children], because the type's content type is empty.
WARNING: At line 98 of <https://ci-builds.apache.org/job/Tomee/job/tomee-8.x-build-full-java8/ws/examples/scala-basic/target/surefire-reports/TEST-org.superbiz.GreetingServiceTest.xml>:cvc-complex-type.2.1: Element 'property' must have no character or element information item [children], because the type's content type is empty.
WARNING: At line 103 of <https://ci-builds.apache.org/job/Tomee/job/tomee-8.x-build-full-java8/ws/examples/scala-basic/target/surefire-reports/TEST-org.superbiz.GreetingServiceTest.xml>:cvc-complex-type.2.1: Element 'property' must have no character or element information item [children], because the type's content type is empty.
WARNING: At line 106 of <https://ci-builds.apache.org/job/Tomee/job/tomee-8.x-build-full-java8/ws/examples/scala-basic/target/surefire-reports/TEST-org.superbiz.GreetingServiceTest.xml>:cvc-complex-type.2.1: Element 'property' must have no character or element information item [children], because the type's content type is empty.
WARNING: At line 110 of <https://ci-builds.apache.org/job/Tomee/job/tomee-8.x-build-full-java8/ws/examples/scala-basic/target/surefire-reports/TEST-org.superbiz.GreetingServiceTest.xml>:cvc-complex-type.2.1: Element 'property' must have no character or element information item [children], because the type's content type is empty.
WARNING: The result file '<https://ci-builds.apache.org/job/Tomee/job/tomee-8.x-build-full-java8/ws/examples/scala-basic/target/surefire-reports/TEST-org.superbiz.GreetingServiceTest.xml'> for the metric 'JUnit' is not valid. The result file has been skipped.
INFO: Setting the build status to org.jenkinsci.plugins.xunit.XUnitProcessorResult@5ebeef5c
Build failed in Jenkins: TomEE » tomee-8.x-build-full-java8 #94
Posted by Apache Jenkins Server <je...@builds.apache.org>.
See <https://ci-builds.apache.org/job/Tomee/job/tomee-8.x-build-full-java8/94/display/redirect>
Changes:
------------------------------------------
[...truncated 76.00 MB...]
[INFO] TomEE :: Examples :: JUnit 5 :: Multiple TomEE with Arquillian 8.0.16-SNAPSHOT SUCCESS [ 10.957 s]
[INFO] TomEE :: Examples :: JUnit 5 :: Simple Websockets with Arquillian 8.0.16-SNAPSHOT SUCCESS [ 7.624 s]
[INFO] TomEE :: Examples :: @EJB Lookup 8.0.16-SNAPSHOT ... SUCCESS [ 1.466 s]
[INFO] TomEE :: Examples :: EJB Lookup with descriptor 8.0.16-SNAPSHOT SUCCESS [ 1.433 s]
[INFO] TomEE :: Examples :: Movies Complete (Meta) 8.0.16-SNAPSHOT SUCCESS [ 3.581 s]
[INFO] TomEE :: Examples :: Movies Complete 8.0.16-SNAPSHOT SUCCESS [ 3.662 s]
[INFO] MicroProfile :: Examples :: Config 8.0.16-SNAPSHOT . SUCCESS [ 8.794 s]
[INFO] MicroProfile :: Examples :: Config Source Database 8.0.16-SNAPSHOT SUCCESS [ 10.057 s]
[INFO] TomEE :: Examples :: Microprofile Fault Tolerance :: Fallback 8.0.16-SNAPSHOT SUCCESS [ 8.561 s]
[INFO] TomEE :: Examples :: Microprofile Fault Tolerance :: Retry 8.0.16-SNAPSHOT SUCCESS [ 10.497 s]
[INFO] TomEE :: Examples :: Microprofile JSONB Configuration 8.0.16-SNAPSHOT SUCCESS [ 2.258 s]
[INFO] Apache TomEE + MicroProfile JWT Bean Validation 8.0.16-SNAPSHOT SUCCESS [ 9.051 s]
[INFO] Apache TomEE + MicroProfile JWT Bean Validation, Strongly-typed Annotations 8.0.16-SNAPSHOT SUCCESS [ 9.090 s]
[INFO] TomEE :: Examples :: Microprofile Metrics Counted 8.0.16-SNAPSHOT SUCCESS [ 7.836 s]
[INFO] TomEE :: Examples :: Microprofile Metrics Histogram 8.0.16-SNAPSHOT SUCCESS [ 7.901 s]
[INFO] TomEE :: Examples :: Microprofile Metrics Timed 8.0.16-SNAPSHOT SUCCESS [ 7.790 s]
[INFO] mp-metrics-gauge 8.0.16-SNAPSHOT ................... SUCCESS [ 8.557 s]
[INFO] mp-metrics-metered 8.0.16-SNAPSHOT ................. SUCCESS [ 0.144 s]
[INFO] mp-opentracing.traced 8.0.16-SNAPSHOT .............. SUCCESS [ 0.024 s]
[INFO] TomEE :: Examples :: MP REST JWT 8.0.16-SNAPSHOT ... SUCCESS [ 8.686 s]
[INFO] TomEE :: Examples :: MP REST JWT JWK 8.0.16-SNAPSHOT SUCCESS [ 9.972 s]
[INFO] TomEE :: Examples :: MP REST JWT PRINCIPAL 8.0.16-SNAPSHOT SUCCESS [ 11.973 s]
[INFO] TomEE :: Examples :: MP REST JWT Public Key 8.0.16-SNAPSHOT SUCCESS [ 8.598 s]
[INFO] TomEE :: Utils :: Mockito 8.0.16-SNAPSHOT .......... SUCCESS [ 6.381 s]
[INFO] TomEE :: Examples :: MTOM 8.0.16-SNAPSHOT .......... SUCCESS [ 3.944 s]
[INFO] TomEE :: Examples :: Multiple JPA providers 8.0.16-SNAPSHOT SUCCESS [ 8.759 s]
[INFO] TomEE :: Examples :: Multiple Arquillian Adapters 8.0.16-SNAPSHOT SUCCESS [ 17.483 s]
[INFO] TomEE :: Examples :: Multiple TomEE with Arquillian 8.0.16-SNAPSHOT SUCCESS [ 7.128 s]
[INFO] TomEE :: Examples :: JSF2/CDI/BV/JPA/CODI 8.0.16-SNAPSHOT SUCCESS [ 2.606 s]
[INFO] TomEE :: Examples :: Persistence Fragment 8.0.16-SNAPSHOT SUCCESS [ 2.164 s]
[INFO] TomEE :: Web Examples :: Pojo WS 8.0.16-SNAPSHOT ... SUCCESS [ 0.038 s]
[INFO] TomEE :: Examples :: Polling 8.0.16-SNAPSHOT ....... SUCCESS [ 0.030 s]
[INFO] TomEE :: Examples :: Polling :: Domain 8.0.16-SNAPSHOT SUCCESS [ 0.629 s]
[INFO] TomEE :: Examples :: Polling :: Core 8.0.16-SNAPSHOT SUCCESS [ 4.987 s]
[INFO] TomEE :: Examples :: Polling :: Web 8.0.16-SNAPSHOT SUCCESS [ 14.576 s]
[INFO] TomEE :: Examples :: Polling :: Client 8.0.16-SNAPSHOT SUCCESS [ 0.380 s]
[INFO] TomEE :: Examples :: DeltaSpike ProjectStage 8.0.16-SNAPSHOT SUCCESS [ 11.441 s]
[INFO] TomEE :: Examples :: Quartz 8.0.16-SNAPSHOT ........ SUCCESS [ 0.003 s]
[INFO] TomEE :: Examples :: Quartz :: Quartz Resource Adapter 8.0.16-SNAPSHOT SUCCESS [ 0.851 s]
[INFO] TomEE :: Examples :: Quartz :: Quartz Beans 8.0.16-SNAPSHOT SUCCESS [ 6.641 s]
[INFO] TomEE :: Examples :: DataSource Realm 8.0.16-SNAPSHOT SUCCESS [ 0.152 s]
[INFO] TomEE :: Examples :: Reloadable Persistence Unit Properties 8.0.16-SNAPSHOT SUCCESS [ 3.846 s]
[INFO] TomEE :: Web Examples :: Resource Declared In A Webapp 8.0.16-SNAPSHOT SUCCESS [ 0.039 s]
[INFO] TomEE :: Examples :: REST, Mockito and Application Composer 8.0.16-SNAPSHOT SUCCESS [ 2.649 s]
[INFO] TomEE :: Examples :: REST and Application Composer 8.0.16-SNAPSHOT SUCCESS [ 2.083 s]
[INFO] TomEE :: Examples :: REST CDI 8.0.16-SNAPSHOT ...... SUCCESS [ 3.416 s]
[INFO] TomEE :: Examples :: JAXRS and JAAS 8.0.16-SNAPSHOT SUCCESS [ 0.033 s]
[INFO] TomEE :: Examples :: REST and EJB 8.0.16-SNAPSHOT .. SUCCESS [ 4.964 s]
[INFO] TomEE :: Web Examples :: REST Example 8.0.16-SNAPSHOT SUCCESS [ 13.681 s]
[INFO] TomEE :: Web Examples :: REST Example With Application 8.0.16-SNAPSHOT SUCCESS [ 0.299 s]
[INFO] TomEE :: Web Examples :: REST SSE Example 8.0.16-SNAPSHOT SUCCESS [ 0.156 s]
[INFO] TomEE :: Examples :: REST XML JSON 8.0.16-SNAPSHOT . SUCCESS [ 2.934 s]
[INFO] TomEE :: Examples :: Basic Scala 8.0.16-SNAPSHOT ... SUCCESS [ 10.551 s]
[INFO] TomEE :: Examples :: ScheduleExpression 8.0.16-SNAPSHOT SUCCESS [ 6.641 s]
[INFO] TomEE :: Examples :: @Schedule Events 8.0.16-SNAPSHOT SUCCESS [ 11.591 s]
[INFO] TomEE :: Examples :: @Schedule Methods (Meta) 8.0.16-SNAPSHOT SUCCESS [ 6.676 s]
[INFO] TomEE :: Examples :: @Schedule Methods 8.0.16-SNAPSHOT SUCCESS [ 6.686 s]
[INFO] TomEE :: Examples :: Server Events 8.0.16-SNAPSHOT . SUCCESS [ 2.291 s]
[INFO] TomEE :: Examples :: Serverless Apache TomEE WebProfile 8.0.16-SNAPSHOT SUCCESS [ 4.261 s]
[INFO] TomEE :: Examples :: Serverless Apache TomEE WebProfile 8.0.16-SNAPSHOT SUCCESS [ 4.037 s]
[INFO] TomEE :: Examples :: Serverless Apache TomEE MicroProfile 8.0.16-SNAPSHOT SUCCESS [ 5.540 s]
[INFO] TomEE :: Examples :: Serverless Apache TomEE Plume 8.0.16-SNAPSHOT SUCCESS [ 4.165 s]
[INFO] TomEE :: Examples :: Serverless Apache TomEE Plus 8.0.16-SNAPSHOT SUCCESS [ 4.902 s]
[INFO] TomEE :: Examples :: Singleton startup ordering 8.0.16-SNAPSHOT SUCCESS [ 7.849 s]
[INFO] TomEE :: Examples :: Simple CDI Interceptor 8.0.16-SNAPSHOT SUCCESS [ 1.712 s]
[INFO] TomEE :: Examples :: Simple EAR 8.0.16-SNAPSHOT .... SUCCESS [ 0.003 s]
[INFO] TomEE :: Examples :: Simple EAR :: Business Model 8.0.16-SNAPSHOT SUCCESS [ 0.668 s]
[INFO] TomEE :: Examples :: Simple EAR :: Business Logic 8.0.16-SNAPSHOT SUCCESS [ 3.271 s]
[INFO] TomEE :: Examples :: Simple EAR :: Webapp 8.0.16-SNAPSHOT SUCCESS [ 2.798 s]
[INFO] TomEE :: Examples :: Simple EAR :: EAR Packaging 8.0.16-SNAPSHOT SUCCESS [ 0.028 s]
[INFO] TomEE :: Examples :: Simple EAR :: Functional Tests 8.0.16-SNAPSHOT SUCCESS [ 12.430 s]
[INFO] TomEE :: Examples :: Simple CMP2 Entity 8.0.16-SNAPSHOT SUCCESS [ 3.035 s]
[INFO] TomEE :: Examples :: Simple JMS 8.0.16-SNAPSHOT .... SUCCESS [ 12.815 s]
[INFO] TomEE :: Examples :: Simple JMS Context 8.0.16-SNAPSHOT SUCCESS [ 12.506 s]
[INFO] TomEE :: Examples :: Simple MDB With a CDI Injection 8.0.16-SNAPSHOT SUCCESS [ 4.339 s]
[INFO] TomEE :: Examples :: Simple MDB Example 8.0.16-SNAPSHOT SUCCESS [ 4.114 s]
[INFO] TomEE :: Examples :: Simple MDB Using Deployment Descriptor Example 8.0.16-SNAPSHOT SUCCESS [ 4.186 s]
[INFO] TomEE :: Examples :: Simple Remote tomcat-users.xml 8.0.16-SNAPSHOT SUCCESS [ 5.591 s]
[INFO] TomEE :: Examples :: Simple REST 8.0.16-SNAPSHOT ... SUCCESS [ 2.184 s]
[INFO] TomEE :: Examples :: Simple Singleton 8.0.16-SNAPSHOT SUCCESS [ 1.574 s]
[INFO] TomEE :: Examples :: Simple Stateful Pojo 8.0.16-SNAPSHOT SUCCESS [ 1.424 s]
[INFO] TomEE :: Examples :: Simple Stateful Pojo Callbacks 8.0.16-SNAPSHOT SUCCESS [ 5.477 s]
[INFO] TomEE :: Examples :: Simple Stateless Pojo 8.0.16-SNAPSHOT SUCCESS [ 1.564 s]
[INFO] TomEE :: Examples :: Simple Stateless Pojo Callbacks 8.0.16-SNAPSHOT SUCCESS [ 1.521 s]
[INFO] TomEE :: Examples :: Simple Stateless With Deployment Descriptor 8.0.16-SNAPSHOT SUCCESS [ 1.394 s]
[INFO] TomEE :: Examples :: Simple Webservice 8.0.16-SNAPSHOT SUCCESS [ 4.764 s]
[INFO] TomEE :: Examples :: Simple Webservice Without Interface 8.0.16-SNAPSHOT SUCCESS [ 4.194 s]
[INFO] OpenEJB :: Examples :: Async Servlet 8.0.16-SNAPSHOT SUCCESS [ 22.159 s]
[INFO] TomEE :: Examples :: Spring Data 8.0.16-SNAPSHOT ... SUCCESS [ 6.402 s]
[INFO] TomEE :: Examples :: Spring Data Meta 8.0.16-SNAPSHOT SUCCESS [ 3.790 s]
[INFO] TomEE :: Web Examples :: Struts 8.0.16-SNAPSHOT .... SUCCESS [ 2.753 s]
[INFO] TomEE :: Examples :: Telephone Stateful Pojo 8.0.16-SNAPSHOT SUCCESS [ 2.231 s]
[INFO] TomEE :: Examples :: TestCase Injection 8.0.16-SNAPSHOT SUCCESS [ 3.312 s]
[INFO] TomEE :: Examples :: Testing Security (Meta) 8.0.16-SNAPSHOT SUCCESS [ 3.426 s]
[INFO] TomEE :: Examples :: Testing Security 8.0.16-SNAPSHOT SUCCESS [ 4.189 s]
[INFO] TomEE :: Examples :: Testing Security 8.0.16-SNAPSHOT SUCCESS [ 4.027 s]
[INFO] TomEE :: Examples :: Testing Security Service Provider 8.0.16-SNAPSHOT SUCCESS [ 4.318 s]
[INFO] TomEE :: Examples :: Testing Security Script Service Provider 8.0.16-SNAPSHOT SUCCESS [ 4.702 s]
[INFO] TomEE :: Examples :: Testing Transactions 8.0.16-SNAPSHOT SUCCESS [ 3.450 s]
[INFO] TomEE :: Examples :: Testing Transactions BMT 8.0.16-SNAPSHOT SUCCESS [ 3.409 s]
[INFO] TomEE :: Examples :: TomEE, Jersey, Eclipselink 8.0.16-SNAPSHOT SUCCESS [ 13.612 s]
[INFO] TomEE :: TomEE :: IBM MQ AMQ Portability Examples :: MDB Example 1.0 SUCCESS [ 1.184 s]
[INFO] TomEE :: Examples :: Transaction Rollback 8.0.16-SNAPSHOT SUCCESS [ 4.606 s]
[INFO] TomEE :: Examples :: Troubleshooting 8.0.16-SNAPSHOT SUCCESS [ 3.471 s]
[INFO] TomEE :: Examples :: Webservice Attachments 8.0.16-SNAPSHOT SUCCESS [ 4.618 s]
[INFO] TomEE :: Examples :: Webservice Inheritance 8.0.16-SNAPSHOT SUCCESS [ 6.042 s]
[INFO] TomEE :: Web Examples :: EJB WebService with Security 8.0.16-SNAPSHOT SUCCESS [ 4.159 s]
[INFO] TomEE :: Web Examples :: EJB WebService with SSL Client Certificate 8.0.16-SNAPSHOT SUCCESS [ 14.163 s]
[INFO] TomEE :: Web Examples :: EJB WebService with WS-Security 8.0.16-SNAPSHOT SUCCESS [ 10.834 s]
[INFO] TomEE :: Web Examples :: EJB WebService WS Security with resources.xml 8.0.16-SNAPSHOT SUCCESS [ 5.022 s]
[INFO] TomEE :: Examples :: Web Service Handlers 8.0.16-SNAPSHOT SUCCESS [ 4.950 s]
[INFO] TomEE :: Examples :: @WebService Holder 8.0.16-SNAPSHOT SUCCESS [ 4.693 s]
[INFO] TomEE :: Web Examples :: Moviefun 8.0.16-SNAPSHOT .. SUCCESS [ 36.404 s]
[INFO] TomEE :: Web Examples :: Moviefun Rest 8.0.16-SNAPSHOT SUCCESS [ 20.249 s]
[INFO] TomEE :: Utils :: Provisionning 8.0.16-SNAPSHOT .... SUCCESS [ 1.917 s]
[INFO] TomEE :: Examples :: Resources/JMX Example 8.0.16-SNAPSHOT SUCCESS [ 0.037 s]
[INFO] TomEE :: Examples :: Resources/JMX Example :: EJB Module 8.0.16-SNAPSHOT SUCCESS [ 12.438 s]
[INFO] TomEE :: Examples :: Resources/JMX Example :: EAR Module 8.0.16-SNAPSHOT SUCCESS [ 0.381 s]
[INFO] TomEE :: Examples :: WebSocket with tls and basic auth Example 8.0.16-SNAPSHOT SUCCESS [ 5.844 s]
[INFO] TomEE :: Examples :: Concurrency utilities example 8.0.16-SNAPSHOT SUCCESS [ 10.171 s]
[INFO] TomEE :: Examples :: MVC (CXF-based) 8.0.16-SNAPSHOT SUCCESS [01:44 min]
[INFO] TomEE :: Examples :: MVC (CXF-based) with Hibernate 8.0.16-SNAPSHOT SUCCESS [ 23.221 s]
[INFO] TomEE :: Examples :: Microprofile REST Client 8.0.16-SNAPSHOT SUCCESS [ 8.850 s]
[INFO] TomEE :: Examples :: MVC (RestEasy-based) 8.0.16-SNAPSHOT SUCCESS [ 14.990 s]
[INFO] TomEE :: Examples :: Custom HealthCheck 8.0.16-SNAPSHOT SUCCESS [ 8.312 s]
[INFO] TomEE :: Examples :: Microprofile JSONB Configuration 8.0.16-SNAPSHOT SUCCESS [ 2.264 s]
[INFO] TomEE :: Examples :: Microprofile JSONB Custom Serializer/Deserializer 8.0.16-SNAPSHOT SUCCESS [ 2.475 s]
[INFO] TomEE :: Examples :: Vaadin LTS V08 8.0.16-SNAPSHOT SUCCESS [ 3.154 s]
[INFO] TomEE :: Examples :: Vaadin LTS V10 8.0.16-SNAPSHOT SUCCESS [01:02 min]
[INFO] TomEE :: Examples :: Vaadin LATEST 8.0.16-SNAPSHOT . SUCCESS [01:18 min]
[INFO] TomEE :: Examples :: Azure deployment example 8.0.16-SNAPSHOT SUCCESS [ 3.997 s]
[INFO] TomEE :: Examples :: Microprofile Fault Tolerance :: Timeout 8.0.16-SNAPSHOT SUCCESS [ 8.073 s]
[INFO] TomEE :: Examples :: XA Datasource configuration and usage 8.0.16-SNAPSHOT SUCCESS [ 13.789 s]
[INFO] TomEE :: Examples :: Websocket JMS 8.0.16-SNAPSHOT . SUCCESS [ 5.909 s]
[INFO] TomEE :: Examples :: Properties Provider 8.0.16-SNAPSHOT SUCCESS [ 0.003 s]
[INFO] TomEE :: Examples :: Properties Provider :: Implementation 8.0.16-SNAPSHOT SUCCESS [ 0.055 s]
[INFO] TomEE :: Examples :: Properties Provider :: Sample Webapp 8.0.16-SNAPSHOT SUCCESS [ 4.547 s]
[INFO] TomEE :: Examples :: Jakarta Security tomcat-user.xml Identity Store 8.0.16-SNAPSHOT SUCCESS [ 6.116 s]
[INFO] TomEE :: Examples :: Jakarta Security custom Identity Store 8.0.16-SNAPSHOT SUCCESS [ 7.691 s]
[INFO] TomEE :: Examples 8.0.16-SNAPSHOT .................. SUCCESS [ 0.287 s]
[INFO] TomEE :: Assembly :: All In One EJB Lite jar 8.0.16-SNAPSHOT SUCCESS [ 25.611 s]
[INFO] TomEE :: Utils :: TomEE Webapps-based Deployer EJB 8.0.16-SNAPSHOT SUCCESS [ 0.497 s]
[INFO] TomEE :: TCK 8.0.16-SNAPSHOT ....................... SUCCESS [ 0.017 s]
[INFO] TomEE :: TCK :: Common 8.0.16-SNAPSHOT ............. SUCCESS [ 2.258 s]
[INFO] TomEE :: TCK :: CDI Embedded 8.0.16-SNAPSHOT ....... SUCCESS [04:41 min]
[INFO] TomEE :: TCK :: CDI TomEE 8.0.16-SNAPSHOT .......... SUCCESS [32:58 min]
[INFO] TomEE :: TCK :: CDI TCK Signature Tests 8.0.16-SNAPSHOT SUCCESS [ 3.114 s]
[INFO] TomEE :: TCK :: Bean Validation Embedded 8.0.16-SNAPSHOT SUCCESS [ 52.295 s]
[INFO] TomEE :: TCK :: Bean Validation TomEE 8.0.16-SNAPSHOT SUCCESS [04:36 min]
[INFO] TomEE :: TCK :: Bean Validation TCK Signature tests 8.0.16-SNAPSHOT SUCCESS [ 0.829 s]
[INFO] TomEE :: TCK :: MicroProfile 8.0.16-SNAPSHOT ....... SUCCESS [ 0.014 s]
[INFO] TomEE :: TCK :: MicroProfile Config TCK 8.0.16-SNAPSHOT SUCCESS [02:12 min]
[INFO] TomEE :: TCK :: MicroProfile JWT TCK 8.0.16-SNAPSHOT SUCCESS [01:01 min]
[INFO] TomEE :: TCK :: MicroProfile Fault Tolerance TCK 8.0.16-SNAPSHOT SUCCESS [07:48 min]
[INFO] TomEE :: TCK :: MicroProfile Health TCK 8.0.16-SNAPSHOT SUCCESS [01:04 min]
[INFO] TomEE :: TCK :: MicroProfile Metrics TCK 8.0.16-SNAPSHOT SUCCESS [07:41 min]
[INFO] TomEE :: TCK :: MicroProfile Rest Client TCK 8.0.16-SNAPSHOT SUCCESS [08:50 min]
[INFO] TomEE :: TCK :: MicroProfile Open API TCK 8.0.16-SNAPSHOT SUCCESS [02:38 min]
[INFO] TomEE :: TCK :: MicroProfile Open Tracing TCK 8.0.16-SNAPSHOT SUCCESS [ 36.930 s]
[INFO] TomEE :: Arquillian Adaptors Parent :: Webapp Remote 8.0.16-SNAPSHOT SUCCESS [ 40.339 s]
[INFO] TomEE :: Arquillian Adaptors Parent :: Tests 8.0.16-SNAPSHOT SUCCESS [ 5.632 s]
[INFO] TomEE :: Arquillian Adaptors Parent :: Tests :: Web Profile 8.0.16-SNAPSHOT SUCCESS [04:38 min]
[INFO] TomEE :: Arquillian Adaptors Parent :: Tests :: JAXRS 8.0.16-SNAPSHOT SUCCESS [01:54 min]
[INFO] TomEE :: Arquillian Adaptors Parent :: Tests :: JAXWS 8.0.16-SNAPSHOT FAILURE [ 13.228 s]
[INFO] TomEE :: Arquillian Adaptors Parent :: Tests :: JMS 8.0.16-SNAPSHOT SUCCESS [ 26.440 s]
[INFO] TomEE :: Arquillian Adaptors Parent :: Tests :: CODI 8.0.16-SNAPSHOT SUCCESS [ 39.945 s]
[INFO] TomEE :: Arquillian Adaptors Parent :: Tests :: Configuration Tests 8.0.16-SNAPSHOT SUCCESS [ 39.448 s]
[INFO] TomEE :: Arquillian Adaptors Parent :: Sample :: Moviefun 8.0.16-SNAPSHOT SUCCESS [ 43.978 s]
[INFO] TomEE :: Arquillian Adaptors Parent :: Arquillian TCK 8.0.16-SNAPSHOT SUCCESS [ 2.878 s]
[INFO] TomEE :: Utils :: Log4j2 8.0.16-SNAPSHOT ........... SUCCESS [ 1.017 s]
[INFO] TomEE :: TomEE :: webaccess 8.0.16-SNAPSHOT ........ SUCCESS [ 14.971 s]
[INFO] TomEE :: TomEE :: Overlay Runner 8.0.16-SNAPSHOT ... SUCCESS [ 0.412 s]
[INFO] ------------------------------------------------------------------------
[INFO] BUILD FAILURE
[INFO] ------------------------------------------------------------------------
[INFO] Total time: 02:39 h
[INFO] Finished at: 2023-06-13T17:28:08Z
[INFO] ------------------------------------------------------------------------
[ERROR] Failed to execute goal org.apache.maven.plugins:maven-surefire-plugin:3.0.0-M5:test (default-test) on project legacy-server: There are test failures.
[ERROR]
[ERROR] Please refer to <https://ci-builds.apache.org/job/Tomee/job/tomee-8.x-build-full-java8/ws/itests/legacy-server/target/surefire-reports> for the individual test results.
[ERROR] Please refer to dump files (if any exist) [date].dump, [date]-jvmRun[N].dump and [date].dumpstream.
[ERROR] -> [Help 1]
[ERROR] Failed to execute goal org.apache.maven.plugins:maven-surefire-plugin:3.0.0-M5:test (test-tomee-embedded) on project arquillian-tomee-jaxws-tests: There are test failures.
[ERROR]
[ERROR] Please refer to <https://ci-builds.apache.org/job/Tomee/job/tomee-8.x-build-full-java8/ws/arquillian/arquillian-tomee-tests/arquillian-tomee-jaxws-tests/target/surefire-reports> for the individual test results.
[ERROR] Please refer to dump files (if any exist) [date].dump, [date]-jvmRun[N].dump and [date].dumpstream.
[ERROR] -> [Help 1]
[ERROR]
[ERROR] To see the full stack trace of the errors, re-run Maven with the -e switch.
[ERROR] Re-run Maven using the -X switch to enable full debug logging.
[ERROR]
[ERROR] For more information about the errors and possible solutions, please read the following articles:
[ERROR] [Help 1] http://cwiki.apache.org/confluence/display/MAVEN/MojoFailureException
[ERROR]
[ERROR] After correcting the problems, you can resume the build with the command
[ERROR] mvn <args> -rf :legacy-server
Build step 'Invoke top-level Maven targets' marked build as failure
INFO: Processing JUnit
INFO: [JUnit] - 1,350 test report file(s) were found with the pattern '**/target/surefire-reports/TEST-*.xml' relative to '<https://ci-builds.apache.org/job/Tomee/job/tomee-8.x-build-full-java8/ws/'> for the testing framework 'JUnit'.
WARNING: The file '<https://ci-builds.apache.org/job/Tomee/job/tomee-8.x-build-full-java8/ws/examples/scala-basic/target/surefire-reports/TEST-org.scalatest.tools.DiscoverySuite-ab30ad03-5af1-44cf-92f7-96c2be4adfe6.xml'> is an invalid file.
WARNING: At line 8 of <https://ci-builds.apache.org/job/Tomee/job/tomee-8.x-build-full-java8/ws/examples/scala-basic/target/surefire-reports/TEST-org.scalatest.tools.DiscoverySuite-ab30ad03-5af1-44cf-92f7-96c2be4adfe6.xml>:cvc-complex-type.2.1: Element 'property' must have no character or element information item [children], because the type's content type is empty.
WARNING: At line 14 of <https://ci-builds.apache.org/job/Tomee/job/tomee-8.x-build-full-java8/ws/examples/scala-basic/target/surefire-reports/TEST-org.scalatest.tools.DiscoverySuite-ab30ad03-5af1-44cf-92f7-96c2be4adfe6.xml>:cvc-complex-type.2.1: Element 'property' must have no character or element information item [children], because the type's content type is empty.
WARNING: At line 24 of <https://ci-builds.apache.org/job/Tomee/job/tomee-8.x-build-full-java8/ws/examples/scala-basic/target/surefire-reports/TEST-org.scalatest.tools.DiscoverySuite-ab30ad03-5af1-44cf-92f7-96c2be4adfe6.xml>:cvc-complex-type.2.1: Element 'property' must have no character or element information item [children], because the type's content type is empty.
WARNING: At line 27 of <https://ci-builds.apache.org/job/Tomee/job/tomee-8.x-build-full-java8/ws/examples/scala-basic/target/surefire-reports/TEST-org.scalatest.tools.DiscoverySuite-ab30ad03-5af1-44cf-92f7-96c2be4adfe6.xml>:cvc-complex-type.2.1: Element 'property' must have no character or element information item [children], because the type's content type is empty.
WARNING: At line 32 of <https://ci-builds.apache.org/job/Tomee/job/tomee-8.x-build-full-java8/ws/examples/scala-basic/target/surefire-reports/TEST-org.scalatest.tools.DiscoverySuite-ab30ad03-5af1-44cf-92f7-96c2be4adfe6.xml>:cvc-complex-type.2.1: Element 'property' must have no character or element information item [children], because the type's content type is empty.
WARNING: At line 35 of <https://ci-builds.apache.org/job/Tomee/job/tomee-8.x-build-full-java8/ws/examples/scala-basic/target/surefire-reports/TEST-org.scalatest.tools.DiscoverySuite-ab30ad03-5af1-44cf-92f7-96c2be4adfe6.xml>:cvc-complex-type.2.1: Element 'property' must have no character or element information item [children], because the type's content type is empty.
WARNING: At line 38 of <https://ci-builds.apache.org/job/Tomee/job/tomee-8.x-build-full-java8/ws/examples/scala-basic/target/surefire-reports/TEST-org.scalatest.tools.DiscoverySuite-ab30ad03-5af1-44cf-92f7-96c2be4adfe6.xml>:cvc-complex-type.2.1: Element 'property' must have no character or element information item [children], because the type's content type is empty.
WARNING: At line 46 of <https://ci-builds.apache.org/job/Tomee/job/tomee-8.x-build-full-java8/ws/examples/scala-basic/target/surefire-reports/TEST-org.scalatest.tools.DiscoverySuite-ab30ad03-5af1-44cf-92f7-96c2be4adfe6.xml>:cvc-complex-type.2.1: Element 'property' must have no character or element information item [children], because the type's content type is empty.
WARNING: At line 50 of <https://ci-builds.apache.org/job/Tomee/job/tomee-8.x-build-full-java8/ws/examples/scala-basic/target/surefire-reports/TEST-org.scalatest.tools.DiscoverySuite-ab30ad03-5af1-44cf-92f7-96c2be4adfe6.xml>:cvc-complex-type.2.1: Element 'property' must have no character or element information item [children], because the type's content type is empty.
WARNING: At line 54 of <https://ci-builds.apache.org/job/Tomee/job/tomee-8.x-build-full-java8/ws/examples/scala-basic/target/surefire-reports/TEST-org.scalatest.tools.DiscoverySuite-ab30ad03-5af1-44cf-92f7-96c2be4adfe6.xml>:cvc-complex-type.2.1: Element 'property' must have no character or element information item [children], because the type's content type is empty.
WARNING: At line 57 of <https://ci-builds.apache.org/job/Tomee/job/tomee-8.x-build-full-java8/ws/examples/scala-basic/target/surefire-reports/TEST-org.scalatest.tools.DiscoverySuite-ab30ad03-5af1-44cf-92f7-96c2be4adfe6.xml>:cvc-complex-type.2.1: Element 'property' must have no character or element information item [children], because the type's content type is empty.
WARNING: At line 61 of <https://ci-builds.apache.org/job/Tomee/job/tomee-8.x-build-full-java8/ws/examples/scala-basic/target/surefire-reports/TEST-org.scalatest.tools.DiscoverySuite-ab30ad03-5af1-44cf-92f7-96c2be4adfe6.xml>:cvc-complex-type.2.1: Element 'property' must have no character or element information item [children], because the type's content type is empty.
WARNING: At line 65 of <https://ci-builds.apache.org/job/Tomee/job/tomee-8.x-build-full-java8/ws/examples/scala-basic/target/surefire-reports/TEST-org.scalatest.tools.DiscoverySuite-ab30ad03-5af1-44cf-92f7-96c2be4adfe6.xml>:cvc-complex-type.2.1: Element 'property' must have no character or element information item [children], because the type's content type is empty.
WARNING: At line 73 of <https://ci-builds.apache.org/job/Tomee/job/tomee-8.x-build-full-java8/ws/examples/scala-basic/target/surefire-reports/TEST-org.scalatest.tools.DiscoverySuite-ab30ad03-5af1-44cf-92f7-96c2be4adfe6.xml>:cvc-complex-type.2.1: Element 'property' must have no character or element information item [children], because the type's content type is empty.
WARNING: At line 77 of <https://ci-builds.apache.org/job/Tomee/job/tomee-8.x-build-full-java8/ws/examples/scala-basic/target/surefire-reports/TEST-org.scalatest.tools.DiscoverySuite-ab30ad03-5af1-44cf-92f7-96c2be4adfe6.xml>:cvc-complex-type.2.1: Element 'property' must have no character or element information item [children], because the type's content type is empty.
WARNING: At line 82 of <https://ci-builds.apache.org/job/Tomee/job/tomee-8.x-build-full-java8/ws/examples/scala-basic/target/surefire-reports/TEST-org.scalatest.tools.DiscoverySuite-ab30ad03-5af1-44cf-92f7-96c2be4adfe6.xml>:cvc-complex-type.2.1: Element 'property' must have no character or element information item [children], because the type's content type is empty.
WARNING: At line 85 of <https://ci-builds.apache.org/job/Tomee/job/tomee-8.x-build-full-java8/ws/examples/scala-basic/target/surefire-reports/TEST-org.scalatest.tools.DiscoverySuite-ab30ad03-5af1-44cf-92f7-96c2be4adfe6.xml>:cvc-complex-type.2.1: Element 'property' must have no character or element information item [children], because the type's content type is empty.
WARNING: At line 93 of <https://ci-builds.apache.org/job/Tomee/job/tomee-8.x-build-full-java8/ws/examples/scala-basic/target/surefire-reports/TEST-org.scalatest.tools.DiscoverySuite-ab30ad03-5af1-44cf-92f7-96c2be4adfe6.xml>:cvc-complex-type.2.1: Element 'property' must have no character or element information item [children], because the type's content type is empty.
WARNING: At line 97 of <https://ci-builds.apache.org/job/Tomee/job/tomee-8.x-build-full-java8/ws/examples/scala-basic/target/surefire-reports/TEST-org.scalatest.tools.DiscoverySuite-ab30ad03-5af1-44cf-92f7-96c2be4adfe6.xml>:cvc-complex-type.2.1: Element 'property' must have no character or element information item [children], because the type's content type is empty.
WARNING: At line 102 of <https://ci-builds.apache.org/job/Tomee/job/tomee-8.x-build-full-java8/ws/examples/scala-basic/target/surefire-reports/TEST-org.scalatest.tools.DiscoverySuite-ab30ad03-5af1-44cf-92f7-96c2be4adfe6.xml>:cvc-complex-type.2.1: Element 'property' must have no character or element information item [children], because the type's content type is empty.
WARNING: At line 105 of <https://ci-builds.apache.org/job/Tomee/job/tomee-8.x-build-full-java8/ws/examples/scala-basic/target/surefire-reports/TEST-org.scalatest.tools.DiscoverySuite-ab30ad03-5af1-44cf-92f7-96c2be4adfe6.xml>:cvc-complex-type.2.1: Element 'property' must have no character or element information item [children], because the type's content type is empty.
WARNING: At line 109 of <https://ci-builds.apache.org/job/Tomee/job/tomee-8.x-build-full-java8/ws/examples/scala-basic/target/surefire-reports/TEST-org.scalatest.tools.DiscoverySuite-ab30ad03-5af1-44cf-92f7-96c2be4adfe6.xml>:cvc-complex-type.2.1: Element 'property' must have no character or element information item [children], because the type's content type is empty.
WARNING: The result file '<https://ci-builds.apache.org/job/Tomee/job/tomee-8.x-build-full-java8/ws/examples/scala-basic/target/surefire-reports/TEST-org.scalatest.tools.DiscoverySuite-ab30ad03-5af1-44cf-92f7-96c2be4adfe6.xml'> for the metric 'JUnit' is not valid. The result file has been skipped.
WARNING: The file '<https://ci-builds.apache.org/job/Tomee/job/tomee-8.x-build-full-java8/ws/examples/scala-basic/target/surefire-reports/TEST-org.superbiz.GreetingServiceTest.xml'> is an invalid file.
WARNING: At line 8 of <https://ci-builds.apache.org/job/Tomee/job/tomee-8.x-build-full-java8/ws/examples/scala-basic/target/surefire-reports/TEST-org.superbiz.GreetingServiceTest.xml>:cvc-complex-type.2.1: Element 'property' must have no character or element information item [children], because the type's content type is empty.
WARNING: At line 14 of <https://ci-builds.apache.org/job/Tomee/job/tomee-8.x-build-full-java8/ws/examples/scala-basic/target/surefire-reports/TEST-org.superbiz.GreetingServiceTest.xml>:cvc-complex-type.2.1: Element 'property' must have no character or element information item [children], because the type's content type is empty.
WARNING: At line 24 of <https://ci-builds.apache.org/job/Tomee/job/tomee-8.x-build-full-java8/ws/examples/scala-basic/target/surefire-reports/TEST-org.superbiz.GreetingServiceTest.xml>:cvc-complex-type.2.1: Element 'property' must have no character or element information item [children], because the type's content type is empty.
WARNING: At line 27 of <https://ci-builds.apache.org/job/Tomee/job/tomee-8.x-build-full-java8/ws/examples/scala-basic/target/surefire-reports/TEST-org.superbiz.GreetingServiceTest.xml>:cvc-complex-type.2.1: Element 'property' must have no character or element information item [children], because the type's content type is empty.
WARNING: At line 32 of <https://ci-builds.apache.org/job/Tomee/job/tomee-8.x-build-full-java8/ws/examples/scala-basic/target/surefire-reports/TEST-org.superbiz.GreetingServiceTest.xml>:cvc-complex-type.2.1: Element 'property' must have no character or element information item [children], because the type's content type is empty.
WARNING: At line 35 of <https://ci-builds.apache.org/job/Tomee/job/tomee-8.x-build-full-java8/ws/examples/scala-basic/target/surefire-reports/TEST-org.superbiz.GreetingServiceTest.xml>:cvc-complex-type.2.1: Element 'property' must have no character or element information item [children], because the type's content type is empty.
WARNING: At line 38 of <https://ci-builds.apache.org/job/Tomee/job/tomee-8.x-build-full-java8/ws/examples/scala-basic/target/surefire-reports/TEST-org.superbiz.GreetingServiceTest.xml>:cvc-complex-type.2.1: Element 'property' must have no character or element information item [children], because the type's content type is empty.
WARNING: At line 46 of <https://ci-builds.apache.org/job/Tomee/job/tomee-8.x-build-full-java8/ws/examples/scala-basic/target/surefire-reports/TEST-org.superbiz.GreetingServiceTest.xml>:cvc-complex-type.2.1: Element 'property' must have no character or element information item [children], because the type's content type is empty.
WARNING: At line 50 of <https://ci-builds.apache.org/job/Tomee/job/tomee-8.x-build-full-java8/ws/examples/scala-basic/target/surefire-reports/TEST-org.superbiz.GreetingServiceTest.xml>:cvc-complex-type.2.1: Element 'property' must have no character or element information item [children], because the type's content type is empty.
WARNING: At line 54 of <https://ci-builds.apache.org/job/Tomee/job/tomee-8.x-build-full-java8/ws/examples/scala-basic/target/surefire-reports/TEST-org.superbiz.GreetingServiceTest.xml>:cvc-complex-type.2.1: Element 'property' must have no character or element information item [children], because the type's content type is empty.
WARNING: At line 57 of <https://ci-builds.apache.org/job/Tomee/job/tomee-8.x-build-full-java8/ws/examples/scala-basic/target/surefire-reports/TEST-org.superbiz.GreetingServiceTest.xml>:cvc-complex-type.2.1: Element 'property' must have no character or element information item [children], because the type's content type is empty.
WARNING: At line 61 of <https://ci-builds.apache.org/job/Tomee/job/tomee-8.x-build-full-java8/ws/examples/scala-basic/target/surefire-reports/TEST-org.superbiz.GreetingServiceTest.xml>:cvc-complex-type.2.1: Element 'property' must have no character or element information item [children], because the type's content type is empty.
WARNING: At line 65 of <https://ci-builds.apache.org/job/Tomee/job/tomee-8.x-build-full-java8/ws/examples/scala-basic/target/surefire-reports/TEST-org.superbiz.GreetingServiceTest.xml>:cvc-complex-type.2.1: Element 'property' must have no character or element information item [children], because the type's content type is empty.
WARNING: At line 73 of <https://ci-builds.apache.org/job/Tomee/job/tomee-8.x-build-full-java8/ws/examples/scala-basic/target/surefire-reports/TEST-org.superbiz.GreetingServiceTest.xml>:cvc-complex-type.2.1: Element 'property' must have no character or element information item [children], because the type's content type is empty.
WARNING: At line 77 of <https://ci-builds.apache.org/job/Tomee/job/tomee-8.x-build-full-java8/ws/examples/scala-basic/target/surefire-reports/TEST-org.superbiz.GreetingServiceTest.xml>:cvc-complex-type.2.1: Element 'property' must have no character or element information item [children], because the type's content type is empty.
WARNING: At line 82 of <https://ci-builds.apache.org/job/Tomee/job/tomee-8.x-build-full-java8/ws/examples/scala-basic/target/surefire-reports/TEST-org.superbiz.GreetingServiceTest.xml>:cvc-complex-type.2.1: Element 'property' must have no character or element information item [children], because the type's content type is empty.
WARNING: At line 85 of <https://ci-builds.apache.org/job/Tomee/job/tomee-8.x-build-full-java8/ws/examples/scala-basic/target/surefire-reports/TEST-org.superbiz.GreetingServiceTest.xml>:cvc-complex-type.2.1: Element 'property' must have no character or element information item [children], because the type's content type is empty.
WARNING: At line 93 of <https://ci-builds.apache.org/job/Tomee/job/tomee-8.x-build-full-java8/ws/examples/scala-basic/target/surefire-reports/TEST-org.superbiz.GreetingServiceTest.xml>:cvc-complex-type.2.1: Element 'property' must have no character or element information item [children], because the type's content type is empty.
WARNING: At line 97 of <https://ci-builds.apache.org/job/Tomee/job/tomee-8.x-build-full-java8/ws/examples/scala-basic/target/surefire-reports/TEST-org.superbiz.GreetingServiceTest.xml>:cvc-complex-type.2.1: Element 'property' must have no character or element information item [children], because the type's content type is empty.
WARNING: At line 102 of <https://ci-builds.apache.org/job/Tomee/job/tomee-8.x-build-full-java8/ws/examples/scala-basic/target/surefire-reports/TEST-org.superbiz.GreetingServiceTest.xml>:cvc-complex-type.2.1: Element 'property' must have no character or element information item [children], because the type's content type is empty.
WARNING: At line 105 of <https://ci-builds.apache.org/job/Tomee/job/tomee-8.x-build-full-java8/ws/examples/scala-basic/target/surefire-reports/TEST-org.superbiz.GreetingServiceTest.xml>:cvc-complex-type.2.1: Element 'property' must have no character or element information item [children], because the type's content type is empty.
WARNING: At line 109 of <https://ci-builds.apache.org/job/Tomee/job/tomee-8.x-build-full-java8/ws/examples/scala-basic/target/surefire-reports/TEST-org.superbiz.GreetingServiceTest.xml>:cvc-complex-type.2.1: Element 'property' must have no character or element information item [children], because the type's content type is empty.
WARNING: The result file '<https://ci-builds.apache.org/job/Tomee/job/tomee-8.x-build-full-java8/ws/examples/scala-basic/target/surefire-reports/TEST-org.superbiz.GreetingServiceTest.xml'> for the metric 'JUnit' is not valid. The result file has been skipped.
INFO: Setting the build status to org.jenkinsci.plugins.xunit.XUnitProcessorResult@7b1d4444
Build failed in Jenkins: TomEE » tomee-8.x-build-full-java8 #93
Posted by Apache Jenkins Server <je...@builds.apache.org>.
See <https://ci-builds.apache.org/job/Tomee/job/tomee-8.x-build-full-java8/93/display/redirect>
Changes:
------------------------------------------
[...truncated 12.39 MB...]
[INFO] TomEE :: Web Examples :: Resource Declared In A Webapp 8.0.16-SNAPSHOT SUCCESS [ 0.688 s]
[INFO] TomEE :: Examples :: REST, Mockito and Application Composer 8.0.16-SNAPSHOT SUCCESS [ 4.880 s]
[INFO] TomEE :: Examples :: REST and Application Composer 8.0.16-SNAPSHOT SUCCESS [ 3.547 s]
[INFO] TomEE :: Examples :: REST CDI 8.0.16-SNAPSHOT ...... SUCCESS [ 5.591 s]
[INFO] TomEE :: Examples :: JAXRS and JAAS 8.0.16-SNAPSHOT SKIPPED
[INFO] TomEE :: Examples :: REST and EJB 8.0.16-SNAPSHOT .. SUCCESS [ 6.477 s]
[INFO] TomEE :: Web Examples :: REST Example 8.0.16-SNAPSHOT SKIPPED
[INFO] TomEE :: Web Examples :: REST Example With Application 8.0.16-SNAPSHOT SUCCESS [ 0.652 s]
[INFO] TomEE :: Web Examples :: REST SSE Example 8.0.16-SNAPSHOT SKIPPED
[INFO] TomEE :: Examples :: REST XML JSON 8.0.16-SNAPSHOT . SUCCESS [ 4.316 s]
[INFO] TomEE :: Examples :: Basic Scala 8.0.16-SNAPSHOT ... SUCCESS [ 24.390 s]
[INFO] TomEE :: Examples :: ScheduleExpression 8.0.16-SNAPSHOT SUCCESS [ 7.682 s]
[INFO] TomEE :: Examples :: @Schedule Events 8.0.16-SNAPSHOT SUCCESS [ 12.772 s]
[INFO] TomEE :: Examples :: @Schedule Methods (Meta) 8.0.16-SNAPSHOT SUCCESS [ 7.515 s]
[INFO] TomEE :: Examples :: @Schedule Methods 8.0.16-SNAPSHOT SUCCESS [ 7.595 s]
[INFO] TomEE :: Examples :: Server Events 8.0.16-SNAPSHOT . SUCCESS [ 3.351 s]
[INFO] TomEE :: Examples :: Serverless Apache TomEE WebProfile 8.0.16-SNAPSHOT SKIPPED
[INFO] TomEE :: Examples :: Serverless Apache TomEE WebProfile 8.0.16-SNAPSHOT SKIPPED
[INFO] TomEE :: Examples :: Serverless Apache TomEE MicroProfile 8.0.16-SNAPSHOT SKIPPED
[INFO] TomEE :: Examples :: Serverless Apache TomEE Plume 8.0.16-SNAPSHOT SKIPPED
[INFO] TomEE :: Examples :: Serverless Apache TomEE Plus 8.0.16-SNAPSHOT SKIPPED
[INFO] TomEE :: Examples :: Singleton startup ordering 8.0.16-SNAPSHOT SKIPPED
[INFO] TomEE :: Examples :: Simple CDI Interceptor 8.0.16-SNAPSHOT SUCCESS [ 3.213 s]
[INFO] TomEE :: Examples :: Simple EAR 8.0.16-SNAPSHOT .... SUCCESS [ 0.071 s]
[INFO] TomEE :: Examples :: Simple EAR :: Business Model 8.0.16-SNAPSHOT SUCCESS [ 1.967 s]
[INFO] TomEE :: Examples :: Simple EAR :: Business Logic 8.0.16-SNAPSHOT SUCCESS [ 5.263 s]
[INFO] TomEE :: Examples :: Simple EAR :: Webapp 8.0.16-SNAPSHOT SUCCESS [ 0.285 s]
[INFO] TomEE :: Examples :: Simple EAR :: EAR Packaging 8.0.16-SNAPSHOT SUCCESS [ 0.122 s]
[INFO] TomEE :: Examples :: Simple EAR :: Functional Tests 8.0.16-SNAPSHOT SKIPPED
[INFO] TomEE :: Examples :: Simple CMP2 Entity 8.0.16-SNAPSHOT SUCCESS [ 5.384 s]
[INFO] TomEE :: Examples :: Simple JMS 8.0.16-SNAPSHOT .... SKIPPED
[INFO] TomEE :: Examples :: Simple JMS Context 8.0.16-SNAPSHOT SKIPPED
[INFO] TomEE :: Examples :: Simple MDB With a CDI Injection 8.0.16-SNAPSHOT SKIPPED
[INFO] TomEE :: Examples :: Simple MDB Example 8.0.16-SNAPSHOT SKIPPED
[INFO] TomEE :: Examples :: Simple MDB Using Deployment Descriptor Example 8.0.16-SNAPSHOT SKIPPED
[INFO] TomEE :: Examples :: Simple Remote tomcat-users.xml 8.0.16-SNAPSHOT SKIPPED
[INFO] TomEE :: Examples :: Simple REST 8.0.16-SNAPSHOT ... SUCCESS [ 4.071 s]
[INFO] TomEE :: Examples :: Simple Singleton 8.0.16-SNAPSHOT SUCCESS [ 3.398 s]
[INFO] TomEE :: Examples :: Simple Stateful Pojo 8.0.16-SNAPSHOT SUCCESS [ 2.592 s]
[INFO] TomEE :: Examples :: Simple Stateful Pojo Callbacks 8.0.16-SNAPSHOT SUCCESS [ 6.427 s]
[INFO] TomEE :: Examples :: Simple Stateless Pojo 8.0.16-SNAPSHOT SUCCESS [ 2.484 s]
[INFO] TomEE :: Examples :: Simple Stateless Pojo Callbacks 8.0.16-SNAPSHOT SUCCESS [ 2.472 s]
[INFO] TomEE :: Examples :: Simple Stateless With Deployment Descriptor 8.0.16-SNAPSHOT SUCCESS [ 1.999 s]
[INFO] TomEE :: Examples :: Simple Webservice 8.0.16-SNAPSHOT SKIPPED
[INFO] TomEE :: Examples :: Simple Webservice Without Interface 8.0.16-SNAPSHOT SKIPPED
[INFO] OpenEJB :: Examples :: Async Servlet 8.0.16-SNAPSHOT SKIPPED
[INFO] TomEE :: Examples :: Spring Data 8.0.16-SNAPSHOT ... SUCCESS [ 7.692 s]
[INFO] TomEE :: Examples :: Spring Data Meta 8.0.16-SNAPSHOT SUCCESS [ 5.497 s]
[INFO] TomEE :: Web Examples :: Struts 8.0.16-SNAPSHOT .... SUCCESS [ 0.392 s]
[INFO] TomEE :: Examples :: Telephone Stateful Pojo 8.0.16-SNAPSHOT SUCCESS [ 3.336 s]
[INFO] TomEE :: Examples :: TestCase Injection 8.0.16-SNAPSHOT SUCCESS [ 5.597 s]
[INFO] TomEE :: Examples :: Testing Security (Meta) 8.0.16-SNAPSHOT SUCCESS [ 6.086 s]
[INFO] TomEE :: Examples :: Testing Security 8.0.16-SNAPSHOT SUCCESS [ 6.157 s]
[INFO] TomEE :: Examples :: Testing Security 8.0.16-SNAPSHOT SUCCESS [ 6.328 s]
[INFO] TomEE :: Examples :: Testing Security Service Provider 8.0.16-SNAPSHOT SUCCESS [ 7.208 s]
[INFO] TomEE :: Examples :: Testing Security Script Service Provider 8.0.16-SNAPSHOT SUCCESS [ 9.382 s]
[INFO] TomEE :: Examples :: Testing Transactions 8.0.16-SNAPSHOT SUCCESS [ 6.955 s]
[INFO] TomEE :: Examples :: Testing Transactions BMT 8.0.16-SNAPSHOT SUCCESS [ 6.405 s]
[INFO] TomEE :: Examples :: TomEE, Jersey, Eclipselink 8.0.16-SNAPSHOT SKIPPED
[INFO] TomEE :: TomEE :: IBM MQ AMQ Portability Examples :: MDB Example 1.0 SUCCESS [ 0.254 s]
[INFO] TomEE :: Examples :: Transaction Rollback 8.0.16-SNAPSHOT SUCCESS [ 7.934 s]
[INFO] TomEE :: Examples :: Troubleshooting 8.0.16-SNAPSHOT SUCCESS [ 5.905 s]
[INFO] TomEE :: Examples :: Webservice Attachments 8.0.16-SNAPSHOT SUCCESS [ 6.339 s]
[INFO] TomEE :: Examples :: Webservice Inheritance 8.0.16-SNAPSHOT SKIPPED
[INFO] TomEE :: Web Examples :: EJB WebService with Security 8.0.16-SNAPSHOT SKIPPED
[INFO] TomEE :: Web Examples :: EJB WebService with SSL Client Certificate 8.0.16-SNAPSHOT SKIPPED
[INFO] TomEE :: Web Examples :: EJB WebService with WS-Security 8.0.16-SNAPSHOT SKIPPED
[INFO] TomEE :: Web Examples :: EJB WebService WS Security with resources.xml 8.0.16-SNAPSHOT SKIPPED
[INFO] TomEE :: Examples :: Web Service Handlers 8.0.16-SNAPSHOT SKIPPED
[INFO] TomEE :: Examples :: @WebService Holder 8.0.16-SNAPSHOT SKIPPED
[INFO] TomEE :: Web Examples :: Moviefun 8.0.16-SNAPSHOT .. SKIPPED
[INFO] TomEE :: Web Examples :: Moviefun Rest 8.0.16-SNAPSHOT SKIPPED
[INFO] TomEE :: Utils :: Provisionning 8.0.16-SNAPSHOT .... SUCCESS [ 3.625 s]
[INFO] TomEE :: Examples :: Resources/JMX Example 8.0.16-SNAPSHOT SUCCESS [ 0.104 s]
[INFO] TomEE :: Examples :: Resources/JMX Example :: EJB Module 8.0.16-SNAPSHOT SKIPPED
[INFO] TomEE :: Examples :: Resources/JMX Example :: EAR Module 8.0.16-SNAPSHOT SKIPPED
[INFO] TomEE :: Examples :: WebSocket with tls and basic auth Example 8.0.16-SNAPSHOT SKIPPED
[INFO] TomEE :: Examples :: Concurrency utilities example 8.0.16-SNAPSHOT SKIPPED
[INFO] TomEE :: Examples :: MVC (CXF-based) 8.0.16-SNAPSHOT SKIPPED
[INFO] TomEE :: Examples :: MVC (CXF-based) with Hibernate 8.0.16-SNAPSHOT SKIPPED
[INFO] TomEE :: Examples :: Microprofile REST Client 8.0.16-SNAPSHOT SKIPPED
[INFO] TomEE :: Examples :: MVC (RestEasy-based) 8.0.16-SNAPSHOT SKIPPED
[INFO] TomEE :: Examples :: Custom HealthCheck 8.0.16-SNAPSHOT SKIPPED
[INFO] TomEE :: Examples :: Microprofile JSONB Configuration 8.0.16-SNAPSHOT SKIPPED
[INFO] TomEE :: Examples :: Microprofile JSONB Custom Serializer/Deserializer 8.0.16-SNAPSHOT SKIPPED
[INFO] TomEE :: Examples :: Vaadin LTS V08 8.0.16-SNAPSHOT SKIPPED
[INFO] TomEE :: Examples :: Vaadin LTS V10 8.0.16-SNAPSHOT SKIPPED
[INFO] TomEE :: Examples :: Vaadin LATEST 8.0.16-SNAPSHOT . SKIPPED
[INFO] TomEE :: Examples :: Azure deployment example 8.0.16-SNAPSHOT SKIPPED
[INFO] TomEE :: Examples :: Microprofile Fault Tolerance :: Timeout 8.0.16-SNAPSHOT SKIPPED
[INFO] TomEE :: Examples :: XA Datasource configuration and usage 8.0.16-SNAPSHOT SKIPPED
[INFO] TomEE :: Examples :: Websocket JMS 8.0.16-SNAPSHOT . SKIPPED
[INFO] TomEE :: Examples :: Properties Provider 8.0.16-SNAPSHOT SUCCESS [ 0.103 s]
[INFO] TomEE :: Examples :: Properties Provider :: Implementation 8.0.16-SNAPSHOT SUCCESS [ 0.178 s]
[INFO] TomEE :: Examples :: Properties Provider :: Sample Webapp 8.0.16-SNAPSHOT SKIPPED
[INFO] TomEE :: Examples :: Jakarta Security tomcat-user.xml Identity Store 8.0.16-SNAPSHOT SKIPPED
[INFO] TomEE :: Examples :: Jakarta Security custom Identity Store 8.0.16-SNAPSHOT SKIPPED
[INFO] TomEE :: Examples 8.0.16-SNAPSHOT .................. SUCCESS [ 0.600 s]
[INFO] TomEE :: Assembly :: All In One EJB Lite jar 8.0.16-SNAPSHOT SUCCESS [ 30.738 s]
[INFO] TomEE :: Utils :: TomEE Webapps-based Deployer EJB 8.0.16-SNAPSHOT SKIPPED
[INFO] TomEE :: TCK 8.0.16-SNAPSHOT ....................... SUCCESS [ 0.029 s]
[INFO] TomEE :: TCK :: Common 8.0.16-SNAPSHOT ............. SKIPPED
[INFO] TomEE :: TCK :: CDI Embedded 8.0.16-SNAPSHOT ....... SKIPPED
[INFO] TomEE :: TCK :: CDI TomEE 8.0.16-SNAPSHOT .......... SKIPPED
[INFO] TomEE :: TCK :: CDI TCK Signature Tests 8.0.16-SNAPSHOT SUCCESS [ 6.656 s]
[INFO] TomEE :: TCK :: Bean Validation Embedded 8.0.16-SNAPSHOT SUCCESS [01:33 min]
[INFO] TomEE :: TCK :: Bean Validation TomEE 8.0.16-SNAPSHOT SKIPPED
[INFO] TomEE :: TCK :: Bean Validation TCK Signature tests 8.0.16-SNAPSHOT SKIPPED
[INFO] TomEE :: TCK :: MicroProfile 8.0.16-SNAPSHOT ....... SUCCESS [ 0.045 s]
[INFO] TomEE :: TCK :: MicroProfile Config TCK 8.0.16-SNAPSHOT SKIPPED
[INFO] TomEE :: TCK :: MicroProfile JWT TCK 8.0.16-SNAPSHOT SKIPPED
[INFO] TomEE :: TCK :: MicroProfile Fault Tolerance TCK 8.0.16-SNAPSHOT SKIPPED
[INFO] TomEE :: TCK :: MicroProfile Health TCK 8.0.16-SNAPSHOT SKIPPED
[INFO] TomEE :: TCK :: MicroProfile Metrics TCK 8.0.16-SNAPSHOT SKIPPED
[INFO] TomEE :: TCK :: MicroProfile Rest Client TCK 8.0.16-SNAPSHOT SKIPPED
[INFO] TomEE :: TCK :: MicroProfile Open API TCK 8.0.16-SNAPSHOT SKIPPED
[INFO] TomEE :: TCK :: MicroProfile Open Tracing TCK 8.0.16-SNAPSHOT SKIPPED
[INFO] TomEE :: Arquillian Adaptors Parent :: Webapp Remote 8.0.16-SNAPSHOT SUCCESS [01:09 min]
[INFO] TomEE :: Arquillian Adaptors Parent :: Tests 8.0.16-SNAPSHOT SKIPPED
[INFO] TomEE :: Arquillian Adaptors Parent :: Tests :: Web Profile 8.0.16-SNAPSHOT SKIPPED
[INFO] TomEE :: Arquillian Adaptors Parent :: Tests :: JAXRS 8.0.16-SNAPSHOT SKIPPED
[INFO] TomEE :: Arquillian Adaptors Parent :: Tests :: JAXWS 8.0.16-SNAPSHOT SKIPPED
[INFO] TomEE :: Arquillian Adaptors Parent :: Tests :: JMS 8.0.16-SNAPSHOT SKIPPED
[INFO] TomEE :: Arquillian Adaptors Parent :: Tests :: CODI 8.0.16-SNAPSHOT SKIPPED
[INFO] TomEE :: Arquillian Adaptors Parent :: Tests :: Configuration Tests 8.0.16-SNAPSHOT SKIPPED
[INFO] TomEE :: Arquillian Adaptors Parent :: Sample :: Moviefun 8.0.16-SNAPSHOT SKIPPED
[INFO] TomEE :: Arquillian Adaptors Parent :: Arquillian TCK 8.0.16-SNAPSHOT SKIPPED
[INFO] TomEE :: Utils :: Log4j2 8.0.16-SNAPSHOT ........... SKIPPED
[INFO] TomEE :: TomEE :: webaccess 8.0.16-SNAPSHOT ........ SKIPPED
[INFO] TomEE :: TomEE :: Overlay Runner 8.0.16-SNAPSHOT ... SKIPPED
[INFO] ------------------------------------------------------------------------
[INFO] BUILD FAILURE
[INFO] ------------------------------------------------------------------------
[INFO] Total time: 01:10 h
[INFO] Finished at: 2023-06-12T21:46:39Z
[INFO] ------------------------------------------------------------------------
[ERROR] Failed to execute goal org.apache.maven.plugins:maven-surefire-plugin:3.0.0-M5:test (default-test) on project tomee-jdbc: There are test failures.
[ERROR]
[ERROR] Please refer to <https://ci-builds.apache.org/job/Tomee/job/tomee-8.x-build-full-java8/ws/tomee/tomee-jdbc/target/surefire-reports> for the individual test results.
[ERROR] Please refer to dump files (if any exist) [date].dump, [date]-jvmRun[N].dump and [date].dumpstream.
[ERROR] ExecutionException The forked VM terminated without properly saying goodbye. VM crash or System.exit called?
[ERROR] Command was /bin/sh -c cd <https://ci-builds.apache.org/job/Tomee/job/tomee-8.x-build-full-java8/ws/tomee/tomee-jdbc> && /usr/local/asfpackages/java/adoptium-jdk-8u362-b09/jre/bin/java -Dfile.encoding=UTF-8 -jar <https://ci-builds.apache.org/job/Tomee/job/tomee-8.x-build-full-java8/ws/tomee/tomee-jdbc/target/surefire/surefirebooter971722198409311956.jar> <https://ci-builds.apache.org/job/Tomee/job/tomee-8.x-build-full-java8/ws/tomee/tomee-jdbc/target/surefire> 2023-06-12T20-36-25_930-jvmRun1 surefire2013327367202770645tmp surefire_5007594022396937111697tmp
[ERROR] Process Exit Code: 0
[ERROR] Crashed tests:
[ERROR] org.apache.tomee.jdbc.TomcatXADataSourceTest
[ERROR] org.apache.maven.surefire.booter.SurefireBooterForkException: ExecutionException The forked VM terminated without properly saying goodbye. VM crash or System.exit called?
[ERROR] Command was /bin/sh -c cd <https://ci-builds.apache.org/job/Tomee/job/tomee-8.x-build-full-java8/ws/tomee/tomee-jdbc> && /usr/local/asfpackages/java/adoptium-jdk-8u362-b09/jre/bin/java -Dfile.encoding=UTF-8 -jar <https://ci-builds.apache.org/job/Tomee/job/tomee-8.x-build-full-java8/ws/tomee/tomee-jdbc/target/surefire/surefirebooter971722198409311956.jar> <https://ci-builds.apache.org/job/Tomee/job/tomee-8.x-build-full-java8/ws/tomee/tomee-jdbc/target/surefire> 2023-06-12T20-36-25_930-jvmRun1 surefire2013327367202770645tmp surefire_5007594022396937111697tmp
[ERROR] Process Exit Code: 0
[ERROR] Crashed tests:
[ERROR] org.apache.tomee.jdbc.TomcatXADataSourceTest
[ERROR] at org.apache.maven.plugin.surefire.booterclient.ForkStarter.awaitResultsDone(ForkStarter.java:532)
[ERROR] at org.apache.maven.plugin.surefire.booterclient.ForkStarter.runSuitesForkPerTestSet(ForkStarter.java:479)
[ERROR] at org.apache.maven.plugin.surefire.booterclient.ForkStarter.run(ForkStarter.java:322)
[ERROR] at org.apache.maven.plugin.surefire.booterclient.ForkStarter.run(ForkStarter.java:266)
[ERROR] at org.apache.maven.plugin.surefire.AbstractSurefireMojo.executeProvider(AbstractSurefireMojo.java:1314)
[ERROR] at org.apache.maven.plugin.surefire.AbstractSurefireMojo.executeAfterPreconditionsChecked(AbstractSurefireMojo.java:1159)
[ERROR] at org.apache.maven.plugin.surefire.AbstractSurefireMojo.execute(AbstractSurefireMojo.java:932)
[ERROR] at org.apache.maven.plugin.DefaultBuildPluginManager.executeMojo(DefaultBuildPluginManager.java:137)
[ERROR] at org.apache.maven.lifecycle.internal.MojoExecutor.execute(MojoExecutor.java:210)
[ERROR] at org.apache.maven.lifecycle.internal.MojoExecutor.execute(MojoExecutor.java:156)
[ERROR] at org.apache.maven.lifecycle.internal.MojoExecutor.execute(MojoExecutor.java:148)
[ERROR] at org.apache.maven.lifecycle.internal.LifecycleModuleBuilder.buildProject(LifecycleModuleBuilder.java:117)
[ERROR] at org.apache.maven.lifecycle.internal.LifecycleModuleBuilder.buildProject(LifecycleModuleBuilder.java:81)
[ERROR] at org.apache.maven.lifecycle.internal.builder.singlethreaded.SingleThreadedBuilder.build(SingleThreadedBuilder.java:56)
[ERROR] at org.apache.maven.lifecycle.internal.LifecycleStarter.execute(LifecycleStarter.java:128)
[ERROR] at org.apache.maven.DefaultMaven.doExecute(DefaultMaven.java:305)
[ERROR] at org.apache.maven.DefaultMaven.doExecute(DefaultMaven.java:192)
[ERROR] at org.apache.maven.DefaultMaven.execute(DefaultMaven.java:105)
[ERROR] at org.apache.maven.cli.MavenCli.execute(MavenCli.java:957)
[ERROR] at org.apache.maven.cli.MavenCli.doMain(MavenCli.java:289)
[ERROR] at org.apache.maven.cli.MavenCli.main(MavenCli.java:193)
[ERROR] at sun.reflect.NativeMethodAccessorImpl.invoke0(Native Method)
[ERROR] at sun.reflect.NativeMethodAccessorImpl.invoke(NativeMethodAccessorImpl.java:62)
[ERROR] at sun.reflect.DelegatingMethodAccessorImpl.invoke(DelegatingMethodAccessorImpl.java:43)
[ERROR] at java.lang.reflect.Method.invoke(Method.java:498)
[ERROR] at org.codehaus.plexus.classworlds.launcher.Launcher.launchEnhanced(Launcher.java:282)
[ERROR] at org.codehaus.plexus.classworlds.launcher.Launcher.launch(Launcher.java:225)
[ERROR] at org.codehaus.plexus.classworlds.launcher.Launcher.mainWithExitCode(Launcher.java:406)
[ERROR] at org.codehaus.plexus.classworlds.launcher.Launcher.main(Launcher.java:347)
[ERROR] Caused by: org.apache.maven.surefire.booter.SurefireBooterForkException: The forked VM terminated without properly saying goodbye. VM crash or System.exit called?
[ERROR] Command was /bin/sh -c cd <https://ci-builds.apache.org/job/Tomee/job/tomee-8.x-build-full-java8/ws/tomee/tomee-jdbc> && /usr/local/asfpackages/java/adoptium-jdk-8u362-b09/jre/bin/java -Dfile.encoding=UTF-8 -jar <https://ci-builds.apache.org/job/Tomee/job/tomee-8.x-build-full-java8/ws/tomee/tomee-jdbc/target/surefire/surefirebooter971722198409311956.jar> <https://ci-builds.apache.org/job/Tomee/job/tomee-8.x-build-full-java8/ws/tomee/tomee-jdbc/target/surefire> 2023-06-12T20-36-25_930-jvmRun1 surefire2013327367202770645tmp surefire_5007594022396937111697tmp
[ERROR] Process Exit Code: 0
[ERROR] Crashed tests:
[ERROR] org.apache.tomee.jdbc.TomcatXADataSourceTest
[ERROR] at org.apache.maven.plugin.surefire.booterclient.ForkStarter.fork(ForkStarter.java:748)
[ERROR] at org.apache.maven.plugin.surefire.booterclient.ForkStarter.access$700(ForkStarter.java:121)
[ERROR] at org.apache.maven.plugin.surefire.booterclient.ForkStarter$2.call(ForkStarter.java:465)
[ERROR] at org.apache.maven.plugin.surefire.booterclient.ForkStarter$2.call(ForkStarter.java:442)
[ERROR] at java.util.concurrent.FutureTask.run(FutureTask.java:266)
[ERROR] at java.util.concurrent.ThreadPoolExecutor.runWorker(ThreadPoolExecutor.java:1149)
[ERROR] at java.util.concurrent.ThreadPoolExecutor$Worker.run(ThreadPoolExecutor.java:624)
[ERROR] at java.lang.Thread.run(Thread.java:750)
[ERROR]
[ERROR] -> [Help 1]
[ERROR]
[ERROR] To see the full stack trace of the errors, re-run Maven with the -e switch.
[ERROR] Re-run Maven using the -X switch to enable full debug logging.
[ERROR]
[ERROR] For more information about the errors and possible solutions, please read the following articles:
[ERROR] [Help 1] http://cwiki.apache.org/confluence/display/MAVEN/MojoExecutionException
[ERROR]
[ERROR] After correcting the problems, you can resume the build with the command
[ERROR] mvn <args> -rf :tomee-jdbc
Build step 'Invoke top-level Maven targets' marked build as failure
INFO: Processing JUnit
INFO: [JUnit] - 835 test report file(s) were found with the pattern '**/target/surefire-reports/TEST-*.xml' relative to '<https://ci-builds.apache.org/job/Tomee/job/tomee-8.x-build-full-java8/ws/'> for the testing framework 'JUnit'.
WARNING: The file '<https://ci-builds.apache.org/job/Tomee/job/tomee-8.x-build-full-java8/ws/examples/scala-basic/target/surefire-reports/TEST-org.scalatest.tools.DiscoverySuite-5c2af2fe-4061-402e-b25a-99c67e5f0fc6.xml'> is an invalid file.
WARNING: At line 8 of <https://ci-builds.apache.org/job/Tomee/job/tomee-8.x-build-full-java8/ws/examples/scala-basic/target/surefire-reports/TEST-org.scalatest.tools.DiscoverySuite-5c2af2fe-4061-402e-b25a-99c67e5f0fc6.xml>:cvc-complex-type.2.1: Element 'property' must have no character or element information item [children], because the type's content type is empty.
WARNING: At line 13 of <https://ci-builds.apache.org/job/Tomee/job/tomee-8.x-build-full-java8/ws/examples/scala-basic/target/surefire-reports/TEST-org.scalatest.tools.DiscoverySuite-5c2af2fe-4061-402e-b25a-99c67e5f0fc6.xml>:cvc-complex-type.2.1: Element 'property' must have no character or element information item [children], because the type's content type is empty.
WARNING: At line 24 of <https://ci-builds.apache.org/job/Tomee/job/tomee-8.x-build-full-java8/ws/examples/scala-basic/target/surefire-reports/TEST-org.scalatest.tools.DiscoverySuite-5c2af2fe-4061-402e-b25a-99c67e5f0fc6.xml>:cvc-complex-type.2.1: Element 'property' must have no character or element information item [children], because the type's content type is empty.
WARNING: At line 27 of <https://ci-builds.apache.org/job/Tomee/job/tomee-8.x-build-full-java8/ws/examples/scala-basic/target/surefire-reports/TEST-org.scalatest.tools.DiscoverySuite-5c2af2fe-4061-402e-b25a-99c67e5f0fc6.xml>:cvc-complex-type.2.1: Element 'property' must have no character or element information item [children], because the type's content type is empty.
WARNING: At line 31 of <https://ci-builds.apache.org/job/Tomee/job/tomee-8.x-build-full-java8/ws/examples/scala-basic/target/surefire-reports/TEST-org.scalatest.tools.DiscoverySuite-5c2af2fe-4061-402e-b25a-99c67e5f0fc6.xml>:cvc-complex-type.2.1: Element 'property' must have no character or element information item [children], because the type's content type is empty.
WARNING: At line 34 of <https://ci-builds.apache.org/job/Tomee/job/tomee-8.x-build-full-java8/ws/examples/scala-basic/target/surefire-reports/TEST-org.scalatest.tools.DiscoverySuite-5c2af2fe-4061-402e-b25a-99c67e5f0fc6.xml>:cvc-complex-type.2.1: Element 'property' must have no character or element information item [children], because the type's content type is empty.
WARNING: At line 42 of <https://ci-builds.apache.org/job/Tomee/job/tomee-8.x-build-full-java8/ws/examples/scala-basic/target/surefire-reports/TEST-org.scalatest.tools.DiscoverySuite-5c2af2fe-4061-402e-b25a-99c67e5f0fc6.xml>:cvc-complex-type.2.1: Element 'property' must have no character or element information item [children], because the type's content type is empty.
WARNING: At line 46 of <https://ci-builds.apache.org/job/Tomee/job/tomee-8.x-build-full-java8/ws/examples/scala-basic/target/surefire-reports/TEST-org.scalatest.tools.DiscoverySuite-5c2af2fe-4061-402e-b25a-99c67e5f0fc6.xml>:cvc-complex-type.2.1: Element 'property' must have no character or element information item [children], because the type's content type is empty.
WARNING: At line 49 of <https://ci-builds.apache.org/job/Tomee/job/tomee-8.x-build-full-java8/ws/examples/scala-basic/target/surefire-reports/TEST-org.scalatest.tools.DiscoverySuite-5c2af2fe-4061-402e-b25a-99c67e5f0fc6.xml>:cvc-complex-type.2.1: Element 'property' must have no character or element information item [children], because the type's content type is empty.
WARNING: At line 52 of <https://ci-builds.apache.org/job/Tomee/job/tomee-8.x-build-full-java8/ws/examples/scala-basic/target/surefire-reports/TEST-org.scalatest.tools.DiscoverySuite-5c2af2fe-4061-402e-b25a-99c67e5f0fc6.xml>:cvc-complex-type.2.1: Element 'property' must have no character or element information item [children], because the type's content type is empty.
WARNING: At line 56 of <https://ci-builds.apache.org/job/Tomee/job/tomee-8.x-build-full-java8/ws/examples/scala-basic/target/surefire-reports/TEST-org.scalatest.tools.DiscoverySuite-5c2af2fe-4061-402e-b25a-99c67e5f0fc6.xml>:cvc-complex-type.2.1: Element 'property' must have no character or element information item [children], because the type's content type is empty.
WARNING: At line 60 of <https://ci-builds.apache.org/job/Tomee/job/tomee-8.x-build-full-java8/ws/examples/scala-basic/target/surefire-reports/TEST-org.scalatest.tools.DiscoverySuite-5c2af2fe-4061-402e-b25a-99c67e5f0fc6.xml>:cvc-complex-type.2.1: Element 'property' must have no character or element information item [children], because the type's content type is empty.
WARNING: At line 69 of <https://ci-builds.apache.org/job/Tomee/job/tomee-8.x-build-full-java8/ws/examples/scala-basic/target/surefire-reports/TEST-org.scalatest.tools.DiscoverySuite-5c2af2fe-4061-402e-b25a-99c67e5f0fc6.xml>:cvc-complex-type.2.1: Element 'property' must have no character or element information item [children], because the type's content type is empty.
WARNING: At line 74 of <https://ci-builds.apache.org/job/Tomee/job/tomee-8.x-build-full-java8/ws/examples/scala-basic/target/surefire-reports/TEST-org.scalatest.tools.DiscoverySuite-5c2af2fe-4061-402e-b25a-99c67e5f0fc6.xml>:cvc-complex-type.2.1: Element 'property' must have no character or element information item [children], because the type's content type is empty.
WARNING: At line 77 of <https://ci-builds.apache.org/job/Tomee/job/tomee-8.x-build-full-java8/ws/examples/scala-basic/target/surefire-reports/TEST-org.scalatest.tools.DiscoverySuite-5c2af2fe-4061-402e-b25a-99c67e5f0fc6.xml>:cvc-complex-type.2.1: Element 'property' must have no character or element information item [children], because the type's content type is empty.
WARNING: At line 85 of <https://ci-builds.apache.org/job/Tomee/job/tomee-8.x-build-full-java8/ws/examples/scala-basic/target/surefire-reports/TEST-org.scalatest.tools.DiscoverySuite-5c2af2fe-4061-402e-b25a-99c67e5f0fc6.xml>:cvc-complex-type.2.1: Element 'property' must have no character or element information item [children], because the type's content type is empty.
WARNING: At line 89 of <https://ci-builds.apache.org/job/Tomee/job/tomee-8.x-build-full-java8/ws/examples/scala-basic/target/surefire-reports/TEST-org.scalatest.tools.DiscoverySuite-5c2af2fe-4061-402e-b25a-99c67e5f0fc6.xml>:cvc-complex-type.2.1: Element 'property' must have no character or element information item [children], because the type's content type is empty.
WARNING: At line 94 of <https://ci-builds.apache.org/job/Tomee/job/tomee-8.x-build-full-java8/ws/examples/scala-basic/target/surefire-reports/TEST-org.scalatest.tools.DiscoverySuite-5c2af2fe-4061-402e-b25a-99c67e5f0fc6.xml>:cvc-complex-type.2.1: Element 'property' must have no character or element information item [children], because the type's content type is empty.
WARNING: At line 98 of <https://ci-builds.apache.org/job/Tomee/job/tomee-8.x-build-full-java8/ws/examples/scala-basic/target/surefire-reports/TEST-org.scalatest.tools.DiscoverySuite-5c2af2fe-4061-402e-b25a-99c67e5f0fc6.xml>:cvc-complex-type.2.1: Element 'property' must have no character or element information item [children], because the type's content type is empty.
WARNING: The result file '<https://ci-builds.apache.org/job/Tomee/job/tomee-8.x-build-full-java8/ws/examples/scala-basic/target/surefire-reports/TEST-org.scalatest.tools.DiscoverySuite-5c2af2fe-4061-402e-b25a-99c67e5f0fc6.xml'> for the metric 'JUnit' is not valid. The result file has been skipped.
WARNING: The file '<https://ci-builds.apache.org/job/Tomee/job/tomee-8.x-build-full-java8/ws/examples/scala-basic/target/surefire-reports/TEST-org.superbiz.GreetingServiceTest.xml'> is an invalid file.
WARNING: At line 8 of <https://ci-builds.apache.org/job/Tomee/job/tomee-8.x-build-full-java8/ws/examples/scala-basic/target/surefire-reports/TEST-org.superbiz.GreetingServiceTest.xml>:cvc-complex-type.2.1: Element 'property' must have no character or element information item [children], because the type's content type is empty.
WARNING: At line 13 of <https://ci-builds.apache.org/job/Tomee/job/tomee-8.x-build-full-java8/ws/examples/scala-basic/target/surefire-reports/TEST-org.superbiz.GreetingServiceTest.xml>:cvc-complex-type.2.1: Element 'property' must have no character or element information item [children], because the type's content type is empty.
WARNING: At line 24 of <https://ci-builds.apache.org/job/Tomee/job/tomee-8.x-build-full-java8/ws/examples/scala-basic/target/surefire-reports/TEST-org.superbiz.GreetingServiceTest.xml>:cvc-complex-type.2.1: Element 'property' must have no character or element information item [children], because the type's content type is empty.
WARNING: At line 27 of <https://ci-builds.apache.org/job/Tomee/job/tomee-8.x-build-full-java8/ws/examples/scala-basic/target/surefire-reports/TEST-org.superbiz.GreetingServiceTest.xml>:cvc-complex-type.2.1: Element 'property' must have no character or element information item [children], because the type's content type is empty.
WARNING: At line 31 of <https://ci-builds.apache.org/job/Tomee/job/tomee-8.x-build-full-java8/ws/examples/scala-basic/target/surefire-reports/TEST-org.superbiz.GreetingServiceTest.xml>:cvc-complex-type.2.1: Element 'property' must have no character or element information item [children], because the type's content type is empty.
WARNING: At line 34 of <https://ci-builds.apache.org/job/Tomee/job/tomee-8.x-build-full-java8/ws/examples/scala-basic/target/surefire-reports/TEST-org.superbiz.GreetingServiceTest.xml>:cvc-complex-type.2.1: Element 'property' must have no character or element information item [children], because the type's content type is empty.
WARNING: At line 42 of <https://ci-builds.apache.org/job/Tomee/job/tomee-8.x-build-full-java8/ws/examples/scala-basic/target/surefire-reports/TEST-org.superbiz.GreetingServiceTest.xml>:cvc-complex-type.2.1: Element 'property' must have no character or element information item [children], because the type's content type is empty.
WARNING: At line 46 of <https://ci-builds.apache.org/job/Tomee/job/tomee-8.x-build-full-java8/ws/examples/scala-basic/target/surefire-reports/TEST-org.superbiz.GreetingServiceTest.xml>:cvc-complex-type.2.1: Element 'property' must have no character or element information item [children], because the type's content type is empty.
WARNING: At line 49 of <https://ci-builds.apache.org/job/Tomee/job/tomee-8.x-build-full-java8/ws/examples/scala-basic/target/surefire-reports/TEST-org.superbiz.GreetingServiceTest.xml>:cvc-complex-type.2.1: Element 'property' must have no character or element information item [children], because the type's content type is empty.
WARNING: At line 52 of <https://ci-builds.apache.org/job/Tomee/job/tomee-8.x-build-full-java8/ws/examples/scala-basic/target/surefire-reports/TEST-org.superbiz.GreetingServiceTest.xml>:cvc-complex-type.2.1: Element 'property' must have no character or element information item [children], because the type's content type is empty.
WARNING: At line 56 of <https://ci-builds.apache.org/job/Tomee/job/tomee-8.x-build-full-java8/ws/examples/scala-basic/target/surefire-reports/TEST-org.superbiz.GreetingServiceTest.xml>:cvc-complex-type.2.1: Element 'property' must have no character or element information item [children], because the type's content type is empty.
WARNING: At line 60 of <https://ci-builds.apache.org/job/Tomee/job/tomee-8.x-build-full-java8/ws/examples/scala-basic/target/surefire-reports/TEST-org.superbiz.GreetingServiceTest.xml>:cvc-complex-type.2.1: Element 'property' must have no character or element information item [children], because the type's content type is empty.
WARNING: At line 69 of <https://ci-builds.apache.org/job/Tomee/job/tomee-8.x-build-full-java8/ws/examples/scala-basic/target/surefire-reports/TEST-org.superbiz.GreetingServiceTest.xml>:cvc-complex-type.2.1: Element 'property' must have no character or element information item [children], because the type's content type is empty.
WARNING: At line 74 of <https://ci-builds.apache.org/job/Tomee/job/tomee-8.x-build-full-java8/ws/examples/scala-basic/target/surefire-reports/TEST-org.superbiz.GreetingServiceTest.xml>:cvc-complex-type.2.1: Element 'property' must have no character or element information item [children], because the type's content type is empty.
WARNING: At line 77 of <https://ci-builds.apache.org/job/Tomee/job/tomee-8.x-build-full-java8/ws/examples/scala-basic/target/surefire-reports/TEST-org.superbiz.GreetingServiceTest.xml>:cvc-complex-type.2.1: Element 'property' must have no character or element information item [children], because the type's content type is empty.
WARNING: At line 85 of <https://ci-builds.apache.org/job/Tomee/job/tomee-8.x-build-full-java8/ws/examples/scala-basic/target/surefire-reports/TEST-org.superbiz.GreetingServiceTest.xml>:cvc-complex-type.2.1: Element 'property' must have no character or element information item [children], because the type's content type is empty.
WARNING: At line 89 of <https://ci-builds.apache.org/job/Tomee/job/tomee-8.x-build-full-java8/ws/examples/scala-basic/target/surefire-reports/TEST-org.superbiz.GreetingServiceTest.xml>:cvc-complex-type.2.1: Element 'property' must have no character or element information item [children], because the type's content type is empty.
WARNING: At line 94 of <https://ci-builds.apache.org/job/Tomee/job/tomee-8.x-build-full-java8/ws/examples/scala-basic/target/surefire-reports/TEST-org.superbiz.GreetingServiceTest.xml>:cvc-complex-type.2.1: Element 'property' must have no character or element information item [children], because the type's content type is empty.
WARNING: At line 98 of <https://ci-builds.apache.org/job/Tomee/job/tomee-8.x-build-full-java8/ws/examples/scala-basic/target/surefire-reports/TEST-org.superbiz.GreetingServiceTest.xml>:cvc-complex-type.2.1: Element 'property' must have no character or element information item [children], because the type's content type is empty.
WARNING: The result file '<https://ci-builds.apache.org/job/Tomee/job/tomee-8.x-build-full-java8/ws/examples/scala-basic/target/surefire-reports/TEST-org.superbiz.GreetingServiceTest.xml'> for the metric 'JUnit' is not valid. The result file has been skipped.
INFO: Setting the build status to org.jenkinsci.plugins.xunit.XUnitProcessorResult@5b1b2de7