You are viewing a plain text version of this content. The canonical link for it is here.
Posted to ci@bigtop.apache.org by Apache Jenkins Server <je...@builds.apache.org> on 2020/04/30 06:30:20 UTC

Build failed in Jenkins: Bigtop-trunk-test-execution #2474

See <https://builds.apache.org/job/Bigtop-trunk-test-execution/2474/display/redirect?page=changes>

Changes:

[junhe] BIGTOP-3352: Fix qfs build error on Ubuntu 18.04


------------------------------------------
Started by an SCM change
Running as SYSTEM
[EnvInject] - Loading node environment variables.
Building remotely on H23 (ubuntu) in workspace <https://builds.apache.org/job/Bigtop-trunk-test-execution/ws/>
No credentials specified
 > git rev-parse --is-inside-work-tree # timeout=10
Fetching changes from the remote Git repository
 > git config remote.origin.url https://git-wip-us.apache.org/repos/asf/bigtop.git # timeout=10
Fetching upstream changes from https://git-wip-us.apache.org/repos/asf/bigtop.git
 > git --version # timeout=10
 > git fetch --tags --progress -- https://git-wip-us.apache.org/repos/asf/bigtop.git +refs/heads/*:refs/remotes/origin/*
 > git rev-parse origin/master^{commit} # timeout=10
Checking out Revision 0db0aafadac99363f41347c6a2d4010fd6959b1c (origin/master)
 > git config core.sparsecheckout # timeout=10
 > git checkout -f 0db0aafadac99363f41347c6a2d4010fd6959b1c
Commit message: "BIGTOP-3352: Fix qfs build error on Ubuntu 18.04"
 > git rev-list --no-walk 20b7a14488902b74b3d74bd3cd6a46d8f0ea0702 # timeout=10
[Bigtop-trunk-test-execution] $ /home/jenkins/tools/maven/latest3/bin/mvn -f bigtop-tests/test-execution/pom.xml clean
[INFO] Scanning for projects...
[INFO] ------------------------------------------------------------------------
[INFO] Reactor Build Order:
[INFO] 
[INFO] stacks-validation-common                                           [pom]
[INFO] smoke-tests-conf                                                   [jar]
[INFO] packagesmokes                                                      [jar]
[INFO] bigtop-smokes                                                      [pom]
[INFO] 
[INFO] ---------------< org.apache.bigtop.itest:stacks-common >----------------
[INFO] Building stacks-validation-common 1.5.0-SNAPSHOT                   [1/4]
[INFO] --------------------------------[ pom ]---------------------------------
[INFO] 
[INFO] --- maven-clean-plugin:3.1.0:clean (default-clean) @ stacks-common ---
[INFO] 
[INFO] --------------< org.apache.bigtop.itest:smoke-tests-conf >--------------
[INFO] Building smoke-tests-conf 1.5.0-SNAPSHOT                           [2/4]
[INFO] --------------------------------[ jar ]---------------------------------
[INFO] 
[INFO] --- maven-clean-plugin:3.1.0:clean (default-clean) @ smoke-tests-conf ---
[INFO] 
[INFO] ----------< org.apache.bigtop.itest:package-smoke-execution >-----------
[INFO] Building packagesmokes 1.5.0-SNAPSHOT                              [3/4]
[INFO] --------------------------------[ jar ]---------------------------------
[INFO] 
[INFO] --- maven-clean-plugin:3.1.0:clean (default-clean) @ package-smoke-execution ---
[INFO] 
[INFO] -----------< org.apache.bigtop.itest:bigtop-test-execution >------------
[INFO] Building bigtop-smokes 1.5.0-SNAPSHOT                              [4/4]
[INFO] --------------------------------[ pom ]---------------------------------
[INFO] 
[INFO] --- maven-clean-plugin:3.1.0:clean (default-clean) @ bigtop-test-execution ---
[INFO] ------------------------------------------------------------------------
[INFO] Reactor Summary for bigtop-smokes 1.5.0-SNAPSHOT:
[INFO] 
[INFO] stacks-validation-common ........................... SUCCESS [  0.302 s]
[INFO] smoke-tests-conf ................................... SUCCESS [  0.004 s]
[INFO] packagesmokes ...................................... SUCCESS [  0.019 s]
[INFO] bigtop-smokes ...................................... SUCCESS [  0.013 s]
[INFO] ------------------------------------------------------------------------
[INFO] BUILD SUCCESS
[INFO] ------------------------------------------------------------------------
[INFO] Total time:  0.776 s
[INFO] Finished at: 2020-04-30T06:30:18Z
[INFO] ------------------------------------------------------------------------
[Bigtop-trunk-test-execution] $ /bin/bash -xe /tmp/jenkins4872491236264830351.sh
+ export HADOOP_CONF_DIR=
+ HADOOP_CONF_DIR=
+ export HADOOP_HOME=
+ HADOOP_HOME=
+ mvn -f bigtop-tests/test-execution/pom.xml -DskipTests -DskipITs deploy -DrepositoryId=apache.snapshots.https
/tmp/jenkins4872491236264830351.sh: line 4: mvn: command not found
Build step 'Execute shell' marked build as failure

Build failed in Jenkins: Bigtop-trunk-test-execution #2482

Posted by Apache Jenkins Server <je...@builds.apache.org>.
See <https://builds.apache.org/job/Bigtop-trunk-test-execution/2482/display/redirect>

Changes:


------------------------------------------
Started by an SCM change
Running as SYSTEM
[EnvInject] - Loading node environment variables.
Building remotely on H23 (ubuntu) in workspace <https://builds.apache.org/job/Bigtop-trunk-test-execution/ws/>
No credentials specified
 > git rev-parse --is-inside-work-tree # timeout=10
Fetching changes from the remote Git repository
 > git config remote.origin.url https://git-wip-us.apache.org/repos/asf/bigtop.git # timeout=10
Fetching upstream changes from https://git-wip-us.apache.org/repos/asf/bigtop.git
 > git --version # timeout=10
 > git fetch --tags --progress -- https://git-wip-us.apache.org/repos/asf/bigtop.git +refs/heads/*:refs/remotes/origin/*
ERROR: Error fetching remote repo 'origin'
hudson.plugins.git.GitException: Failed to fetch from https://git-wip-us.apache.org/repos/asf/bigtop.git
	at hudson.plugins.git.GitSCM.fetchFrom(GitSCM.java:894)
	at hudson.plugins.git.GitSCM.retrieveChanges(GitSCM.java:1161)
	at hudson.plugins.git.GitSCM.checkout(GitSCM.java:1192)
	at hudson.scm.SCM.checkout(SCM.java:504)
	at hudson.model.AbstractProject.checkout(AbstractProject.java:1208)
	at hudson.model.AbstractBuild$AbstractBuildExecution.defaultCheckout(AbstractBuild.java:574)
	at jenkins.scm.SCMCheckoutStrategy.checkout(SCMCheckoutStrategy.java:86)
	at hudson.model.AbstractBuild$AbstractBuildExecution.run(AbstractBuild.java:499)
	at hudson.model.Run.execute(Run.java:1815)
	at hudson.model.FreeStyleBuild.run(FreeStyleBuild.java:43)
	at hudson.model.ResourceController.execute(ResourceController.java:97)
	at hudson.model.Executor.run(Executor.java:429)
Caused by: hudson.plugins.git.GitException: Command "git fetch --tags --progress -- https://git-wip-us.apache.org/repos/asf/bigtop.git +refs/heads/*:refs/remotes/origin/*" returned status code 128:
stdout: 
stderr: error: cannot fork() for rev-list: Resource temporarily unavailable
error: Could not run 'git rev-list'
error: cannot fork() for fetch-pack: Resource temporarily unavailable

	at org.jenkinsci.plugins.gitclient.CliGitAPIImpl.launchCommandIn(CliGitAPIImpl.java:2172)
	at org.jenkinsci.plugins.gitclient.CliGitAPIImpl.launchCommandWithCredentials(CliGitAPIImpl.java:1864)
	at org.jenkinsci.plugins.gitclient.CliGitAPIImpl.access$500(CliGitAPIImpl.java:78)
	at org.jenkinsci.plugins.gitclient.CliGitAPIImpl$1.execute(CliGitAPIImpl.java:545)
	at org.jenkinsci.plugins.gitclient.RemoteGitImpl$CommandInvocationHandler$1.call(RemoteGitImpl.java:153)
	at org.jenkinsci.plugins.gitclient.RemoteGitImpl$CommandInvocationHandler$1.call(RemoteGitImpl.java:146)
	at hudson.remoting.UserRequest.perform(UserRequest.java:212)
	at hudson.remoting.UserRequest.perform(UserRequest.java:54)
	at hudson.remoting.Request$2.run(Request.java:369)
	at hudson.remoting.InterceptingExecutorService$1.call(InterceptingExecutorService.java:72)
	at java.util.concurrent.FutureTask.run(FutureTask.java:266)
	at java.util.concurrent.ThreadPoolExecutor.runWorker(ThreadPoolExecutor.java:1149)
	at java.util.concurrent.ThreadPoolExecutor$Worker.run(ThreadPoolExecutor.java:624)
	at java.lang.Thread.run(Thread.java:748)
	Suppressed: hudson.remoting.Channel$CallSiteStackTrace: Remote call to H23
		at hudson.remoting.Channel.attachCallSiteStackTrace(Channel.java:1743)
		at hudson.remoting.UserRequest$ExceptionResponse.retrieve(UserRequest.java:357)
		at hudson.remoting.Channel.call(Channel.java:957)
		at org.jenkinsci.plugins.gitclient.RemoteGitImpl$CommandInvocationHandler.execute(RemoteGitImpl.java:146)
		at sun.reflect.GeneratedMethodAccessor1196.invoke(Unknown Source)
		at sun.reflect.DelegatingMethodAccessorImpl.invoke(DelegatingMethodAccessorImpl.java:43)
		at java.lang.reflect.Method.invoke(Method.java:498)
		at org.jenkinsci.plugins.gitclient.RemoteGitImpl$CommandInvocationHandler.invoke(RemoteGitImpl.java:132)
		at com.sun.proxy.$Proxy123.execute(Unknown Source)
		at hudson.plugins.git.GitSCM.fetchFrom(GitSCM.java:892)
		at hudson.plugins.git.GitSCM.retrieveChanges(GitSCM.java:1161)
		at hudson.plugins.git.GitSCM.checkout(GitSCM.java:1192)
		at hudson.scm.SCM.checkout(SCM.java:504)
		at hudson.model.AbstractProject.checkout(AbstractProject.java:1208)
		at hudson.model.AbstractBuild$AbstractBuildExecution.defaultCheckout(AbstractBuild.java:574)
		at jenkins.scm.SCMCheckoutStrategy.checkout(SCMCheckoutStrategy.java:86)
		at hudson.model.AbstractBuild$AbstractBuildExecution.run(AbstractBuild.java:499)
		at hudson.model.Run.execute(Run.java:1815)
		at hudson.model.FreeStyleBuild.run(FreeStyleBuild.java:43)
		at hudson.model.ResourceController.execute(ResourceController.java:97)
		at hudson.model.Executor.run(Executor.java:429)
ERROR: Error fetching remote repo 'origin'
Retrying after 10 seconds
No credentials specified
 > git rev-parse --is-inside-work-tree # timeout=10
Fetching changes from the remote Git repository
 > git config remote.origin.url https://git-wip-us.apache.org/repos/asf/bigtop.git # timeout=10
Fetching upstream changes from https://git-wip-us.apache.org/repos/asf/bigtop.git
 > git --version # timeout=10
 > git fetch --tags --progress -- https://git-wip-us.apache.org/repos/asf/bigtop.git +refs/heads/*:refs/remotes/origin/*
ERROR: Error fetching remote repo 'origin'
hudson.plugins.git.GitException: Failed to fetch from https://git-wip-us.apache.org/repos/asf/bigtop.git
	at hudson.plugins.git.GitSCM.fetchFrom(GitSCM.java:894)
	at hudson.plugins.git.GitSCM.retrieveChanges(GitSCM.java:1161)
	at hudson.plugins.git.GitSCM.checkout(GitSCM.java:1192)
	at hudson.scm.SCM.checkout(SCM.java:504)
	at hudson.model.AbstractProject.checkout(AbstractProject.java:1208)
	at hudson.model.AbstractBuild$AbstractBuildExecution.defaultCheckout(AbstractBuild.java:574)
	at jenkins.scm.SCMCheckoutStrategy.checkout(SCMCheckoutStrategy.java:86)
	at hudson.model.AbstractBuild$AbstractBuildExecution.run(AbstractBuild.java:499)
	at hudson.model.Run.execute(Run.java:1815)
	at hudson.model.FreeStyleBuild.run(FreeStyleBuild.java:43)
	at hudson.model.ResourceController.execute(ResourceController.java:97)
	at hudson.model.Executor.run(Executor.java:429)
Caused by: hudson.plugins.git.GitException: Command "git fetch --tags --progress -- https://git-wip-us.apache.org/repos/asf/bigtop.git +refs/heads/*:refs/remotes/origin/*" returned status code 128:
stdout: 
stderr: error: cannot fork() for rev-list: Resource temporarily unavailable
error: Could not run 'git rev-list'
error: cannot fork() for fetch-pack: Resource temporarily unavailable

	at org.jenkinsci.plugins.gitclient.CliGitAPIImpl.launchCommandIn(CliGitAPIImpl.java:2172)
	at org.jenkinsci.plugins.gitclient.CliGitAPIImpl.launchCommandWithCredentials(CliGitAPIImpl.java:1864)
	at org.jenkinsci.plugins.gitclient.CliGitAPIImpl.access$500(CliGitAPIImpl.java:78)
	at org.jenkinsci.plugins.gitclient.CliGitAPIImpl$1.execute(CliGitAPIImpl.java:545)
	at org.jenkinsci.plugins.gitclient.RemoteGitImpl$CommandInvocationHandler$1.call(RemoteGitImpl.java:153)
	at org.jenkinsci.plugins.gitclient.RemoteGitImpl$CommandInvocationHandler$1.call(RemoteGitImpl.java:146)
	at hudson.remoting.UserRequest.perform(UserRequest.java:212)
	at hudson.remoting.UserRequest.perform(UserRequest.java:54)
	at hudson.remoting.Request$2.run(Request.java:369)
	at hudson.remoting.InterceptingExecutorService$1.call(InterceptingExecutorService.java:72)
	at java.util.concurrent.FutureTask.run(FutureTask.java:266)
	at java.util.concurrent.ThreadPoolExecutor.runWorker(ThreadPoolExecutor.java:1149)
	at java.util.concurrent.ThreadPoolExecutor$Worker.run(ThreadPoolExecutor.java:624)
	at java.lang.Thread.run(Thread.java:748)
	Suppressed: hudson.remoting.Channel$CallSiteStackTrace: Remote call to H23
		at hudson.remoting.Channel.attachCallSiteStackTrace(Channel.java:1743)
		at hudson.remoting.UserRequest$ExceptionResponse.retrieve(UserRequest.java:357)
		at hudson.remoting.Channel.call(Channel.java:957)
		at org.jenkinsci.plugins.gitclient.RemoteGitImpl$CommandInvocationHandler.execute(RemoteGitImpl.java:146)
		at sun.reflect.GeneratedMethodAccessor1196.invoke(Unknown Source)
		at sun.reflect.DelegatingMethodAccessorImpl.invoke(DelegatingMethodAccessorImpl.java:43)
		at java.lang.reflect.Method.invoke(Method.java:498)
		at org.jenkinsci.plugins.gitclient.RemoteGitImpl$CommandInvocationHandler.invoke(RemoteGitImpl.java:132)
		at com.sun.proxy.$Proxy123.execute(Unknown Source)
		at hudson.plugins.git.GitSCM.fetchFrom(GitSCM.java:892)
		at hudson.plugins.git.GitSCM.retrieveChanges(GitSCM.java:1161)
		at hudson.plugins.git.GitSCM.checkout(GitSCM.java:1192)
		at hudson.scm.SCM.checkout(SCM.java:504)
		at hudson.model.AbstractProject.checkout(AbstractProject.java:1208)
		at hudson.model.AbstractBuild$AbstractBuildExecution.defaultCheckout(AbstractBuild.java:574)
		at jenkins.scm.SCMCheckoutStrategy.checkout(SCMCheckoutStrategy.java:86)
		at hudson.model.AbstractBuild$AbstractBuildExecution.run(AbstractBuild.java:499)
		at hudson.model.Run.execute(Run.java:1815)
		at hudson.model.FreeStyleBuild.run(FreeStyleBuild.java:43)
		at hudson.model.ResourceController.execute(ResourceController.java:97)
		at hudson.model.Executor.run(Executor.java:429)
ERROR: Error fetching remote repo 'origin'
Retrying after 10 seconds
No credentials specified
 > git rev-parse --is-inside-work-tree # timeout=10
Fetching changes from the remote Git repository
 > git config remote.origin.url https://git-wip-us.apache.org/repos/asf/bigtop.git # timeout=10
Fetching upstream changes from https://git-wip-us.apache.org/repos/asf/bigtop.git
 > git --version # timeout=10
 > git fetch --tags --progress -- https://git-wip-us.apache.org/repos/asf/bigtop.git +refs/heads/*:refs/remotes/origin/*
ERROR: Error fetching remote repo 'origin'
hudson.plugins.git.GitException: Failed to fetch from https://git-wip-us.apache.org/repos/asf/bigtop.git
	at hudson.plugins.git.GitSCM.fetchFrom(GitSCM.java:894)
	at hudson.plugins.git.GitSCM.retrieveChanges(GitSCM.java:1161)
	at hudson.plugins.git.GitSCM.checkout(GitSCM.java:1192)
	at hudson.scm.SCM.checkout(SCM.java:504)
	at hudson.model.AbstractProject.checkout(AbstractProject.java:1208)
	at hudson.model.AbstractBuild$AbstractBuildExecution.defaultCheckout(AbstractBuild.java:574)
	at jenkins.scm.SCMCheckoutStrategy.checkout(SCMCheckoutStrategy.java:86)
	at hudson.model.AbstractBuild$AbstractBuildExecution.run(AbstractBuild.java:499)
	at hudson.model.Run.execute(Run.java:1815)
	at hudson.model.FreeStyleBuild.run(FreeStyleBuild.java:43)
	at hudson.model.ResourceController.execute(ResourceController.java:97)
	at hudson.model.Executor.run(Executor.java:429)
Caused by: hudson.plugins.git.GitException: Command "git fetch --tags --progress -- https://git-wip-us.apache.org/repos/asf/bigtop.git +refs/heads/*:refs/remotes/origin/*" returned status code 128:
stdout: 
stderr: error: cannot fork() for rev-list: Resource temporarily unavailable
error: Could not run 'git rev-list'
error: cannot fork() for fetch-pack: Resource temporarily unavailable

	at org.jenkinsci.plugins.gitclient.CliGitAPIImpl.launchCommandIn(CliGitAPIImpl.java:2172)
	at org.jenkinsci.plugins.gitclient.CliGitAPIImpl.launchCommandWithCredentials(CliGitAPIImpl.java:1864)
	at org.jenkinsci.plugins.gitclient.CliGitAPIImpl.access$500(CliGitAPIImpl.java:78)
	at org.jenkinsci.plugins.gitclient.CliGitAPIImpl$1.execute(CliGitAPIImpl.java:545)
	at org.jenkinsci.plugins.gitclient.RemoteGitImpl$CommandInvocationHandler$1.call(RemoteGitImpl.java:153)
	at org.jenkinsci.plugins.gitclient.RemoteGitImpl$CommandInvocationHandler$1.call(RemoteGitImpl.java:146)
	at hudson.remoting.UserRequest.perform(UserRequest.java:212)
	at hudson.remoting.UserRequest.perform(UserRequest.java:54)
	at hudson.remoting.Request$2.run(Request.java:369)
	at hudson.remoting.InterceptingExecutorService$1.call(InterceptingExecutorService.java:72)
	at java.util.concurrent.FutureTask.run(FutureTask.java:266)
	at java.util.concurrent.ThreadPoolExecutor.runWorker(ThreadPoolExecutor.java:1149)
	at java.util.concurrent.ThreadPoolExecutor$Worker.run(ThreadPoolExecutor.java:624)
	at java.lang.Thread.run(Thread.java:748)
	Suppressed: hudson.remoting.Channel$CallSiteStackTrace: Remote call to H23
		at hudson.remoting.Channel.attachCallSiteStackTrace(Channel.java:1743)
		at hudson.remoting.UserRequest$ExceptionResponse.retrieve(UserRequest.java:357)
		at hudson.remoting.Channel.call(Channel.java:957)
		at org.jenkinsci.plugins.gitclient.RemoteGitImpl$CommandInvocationHandler.execute(RemoteGitImpl.java:146)
		at sun.reflect.GeneratedMethodAccessor1196.invoke(Unknown Source)
		at sun.reflect.DelegatingMethodAccessorImpl.invoke(DelegatingMethodAccessorImpl.java:43)
		at java.lang.reflect.Method.invoke(Method.java:498)
		at org.jenkinsci.plugins.gitclient.RemoteGitImpl$CommandInvocationHandler.invoke(RemoteGitImpl.java:132)
		at com.sun.proxy.$Proxy123.execute(Unknown Source)
		at hudson.plugins.git.GitSCM.fetchFrom(GitSCM.java:892)
		at hudson.plugins.git.GitSCM.retrieveChanges(GitSCM.java:1161)
		at hudson.plugins.git.GitSCM.checkout(GitSCM.java:1192)
		at hudson.scm.SCM.checkout(SCM.java:504)
		at hudson.model.AbstractProject.checkout(AbstractProject.java:1208)
		at hudson.model.AbstractBuild$AbstractBuildExecution.defaultCheckout(AbstractBuild.java:574)
		at jenkins.scm.SCMCheckoutStrategy.checkout(SCMCheckoutStrategy.java:86)
		at hudson.model.AbstractBuild$AbstractBuildExecution.run(AbstractBuild.java:499)
		at hudson.model.Run.execute(Run.java:1815)
		at hudson.model.FreeStyleBuild.run(FreeStyleBuild.java:43)
		at hudson.model.ResourceController.execute(ResourceController.java:97)
		at hudson.model.Executor.run(Executor.java:429)
ERROR: Error fetching remote repo 'origin'

Build failed in Jenkins: Bigtop-trunk-test-execution #2481

Posted by Apache Jenkins Server <je...@builds.apache.org>.
See <https://builds.apache.org/job/Bigtop-trunk-test-execution/2481/display/redirect?page=changes>

Changes:

[github] BIGTOP-3359. Fix failure of installing Hadoop due to conflicting


------------------------------------------
Started by an SCM change
Running as SYSTEM
[EnvInject] - Loading node environment variables.
Building remotely on H32 (ubuntu) in workspace <https://builds.apache.org/job/Bigtop-trunk-test-execution/ws/>
No credentials specified
 > git rev-parse --is-inside-work-tree # timeout=10
Fetching changes from the remote Git repository
 > git config remote.origin.url https://git-wip-us.apache.org/repos/asf/bigtop.git # timeout=10
Fetching upstream changes from https://git-wip-us.apache.org/repos/asf/bigtop.git
 > git --version # timeout=10
 > git fetch --tags --progress -- https://git-wip-us.apache.org/repos/asf/bigtop.git +refs/heads/*:refs/remotes/origin/*
 > git rev-parse origin/master^{commit} # timeout=10
Checking out Revision 00b394f8dcc54cc25d962c720c5fbcf8f88c5e07 (origin/master)
 > git config core.sparsecheckout # timeout=10
 > git checkout -f 00b394f8dcc54cc25d962c720c5fbcf8f88c5e07
Commit message: "BIGTOP-3359. Fix failure of installing Hadoop due to conflicting .build-id entry on CentOS 8. (#642)"
 > git rev-list --no-walk c15ce38f85ae0b201d7f8b879115e6169459bf9d # timeout=10
[Bigtop-trunk-test-execution] $ /home/jenkins/tools/maven/latest3/bin/mvn -f bigtop-tests/test-execution/pom.xml clean
[INFO] Scanning for projects...
[INFO] ------------------------------------------------------------------------
[INFO] Reactor Build Order:
[INFO] 
[INFO] stacks-validation-common                                           [pom]
[INFO] smoke-tests-conf                                                   [jar]
[INFO] packagesmokes                                                      [jar]
[INFO] bigtop-smokes                                                      [pom]
[INFO] 
[INFO] ---------------< org.apache.bigtop.itest:stacks-common >----------------
[INFO] Building stacks-validation-common 1.5.0-SNAPSHOT                   [1/4]
[INFO] --------------------------------[ pom ]---------------------------------
[INFO] 
[INFO] --- maven-clean-plugin:3.1.0:clean (default-clean) @ stacks-common ---
[INFO] 
[INFO] --------------< org.apache.bigtop.itest:smoke-tests-conf >--------------
[INFO] Building smoke-tests-conf 1.5.0-SNAPSHOT                           [2/4]
[INFO] --------------------------------[ jar ]---------------------------------
[INFO] 
[INFO] --- maven-clean-plugin:3.1.0:clean (default-clean) @ smoke-tests-conf ---
[INFO] 
[INFO] ----------< org.apache.bigtop.itest:package-smoke-execution >-----------
[INFO] Building packagesmokes 1.5.0-SNAPSHOT                              [3/4]
[INFO] --------------------------------[ jar ]---------------------------------
[INFO] 
[INFO] --- maven-clean-plugin:3.1.0:clean (default-clean) @ package-smoke-execution ---
[INFO] 
[INFO] -----------< org.apache.bigtop.itest:bigtop-test-execution >------------
[INFO] Building bigtop-smokes 1.5.0-SNAPSHOT                              [4/4]
[INFO] --------------------------------[ pom ]---------------------------------
[INFO] 
[INFO] --- maven-clean-plugin:3.1.0:clean (default-clean) @ bigtop-test-execution ---
[INFO] ------------------------------------------------------------------------
[INFO] Reactor Summary for bigtop-smokes 1.5.0-SNAPSHOT:
[INFO] 
[INFO] stacks-validation-common ........................... SUCCESS [  0.352 s]
[INFO] smoke-tests-conf ................................... SUCCESS [  0.011 s]
[INFO] packagesmokes ...................................... SUCCESS [  0.032 s]
[INFO] bigtop-smokes ...................................... SUCCESS [  0.019 s]
[INFO] ------------------------------------------------------------------------
[INFO] BUILD SUCCESS
[INFO] ------------------------------------------------------------------------
[INFO] Total time:  1.021 s
[INFO] Finished at: 2020-05-27T05:51:39Z
[INFO] ------------------------------------------------------------------------
[Bigtop-trunk-test-execution] $ /bin/bash -xe /tmp/jenkins8337156051294171507.sh
+ export HADOOP_CONF_DIR=
+ HADOOP_CONF_DIR=
+ export HADOOP_HOME=
+ HADOOP_HOME=
+ mvn -f bigtop-tests/test-execution/pom.xml -DskipTests -DskipITs deploy -DrepositoryId=apache.snapshots.https
/tmp/jenkins8337156051294171507.sh: line 4: mvn: command not found
Build step 'Execute shell' marked build as failure

Build failed in Jenkins: Bigtop-trunk-test-execution #2480

Posted by Apache Jenkins Server <je...@builds.apache.org>.
See <https://builds.apache.org/job/Bigtop-trunk-test-execution/2480/display/redirect?page=changes>

Changes:

[github] BIGTOP-3356: Add CentOS 8 support to the Docker provisioner (#640)


------------------------------------------
Started by an SCM change
Running as SYSTEM
[EnvInject] - Loading node environment variables.
Building remotely on H32 (ubuntu) in workspace <https://builds.apache.org/job/Bigtop-trunk-test-execution/ws/>
No credentials specified
 > git rev-parse --is-inside-work-tree # timeout=10
Fetching changes from the remote Git repository
 > git config remote.origin.url https://git-wip-us.apache.org/repos/asf/bigtop.git # timeout=10
Fetching upstream changes from https://git-wip-us.apache.org/repos/asf/bigtop.git
 > git --version # timeout=10
 > git fetch --tags --progress -- https://git-wip-us.apache.org/repos/asf/bigtop.git +refs/heads/*:refs/remotes/origin/*
 > git rev-parse origin/master^{commit} # timeout=10
Checking out Revision c15ce38f85ae0b201d7f8b879115e6169459bf9d (origin/master)
 > git config core.sparsecheckout # timeout=10
 > git checkout -f c15ce38f85ae0b201d7f8b879115e6169459bf9d
Commit message: "BIGTOP-3356: Add CentOS 8 support to the Docker provisioner (#640)"
 > git rev-list --no-walk 4c9586044e8d7844d785b2b44936a989c7b62316 # timeout=10
[Bigtop-trunk-test-execution] $ /home/jenkins/tools/maven/latest3/bin/mvn -f bigtop-tests/test-execution/pom.xml clean
[INFO] Scanning for projects...
[INFO] ------------------------------------------------------------------------
[INFO] Reactor Build Order:
[INFO] 
[INFO] stacks-validation-common                                           [pom]
[INFO] smoke-tests-conf                                                   [jar]
[INFO] packagesmokes                                                      [jar]
[INFO] bigtop-smokes                                                      [pom]
[INFO] 
[INFO] ---------------< org.apache.bigtop.itest:stacks-common >----------------
[INFO] Building stacks-validation-common 1.5.0-SNAPSHOT                   [1/4]
[INFO] --------------------------------[ pom ]---------------------------------
[INFO] 
[INFO] --- maven-clean-plugin:3.1.0:clean (default-clean) @ stacks-common ---
[INFO] 
[INFO] --------------< org.apache.bigtop.itest:smoke-tests-conf >--------------
[INFO] Building smoke-tests-conf 1.5.0-SNAPSHOT                           [2/4]
[INFO] --------------------------------[ jar ]---------------------------------
[INFO] 
[INFO] --- maven-clean-plugin:3.1.0:clean (default-clean) @ smoke-tests-conf ---
[INFO] 
[INFO] ----------< org.apache.bigtop.itest:package-smoke-execution >-----------
[INFO] Building packagesmokes 1.5.0-SNAPSHOT                              [3/4]
[INFO] --------------------------------[ jar ]---------------------------------
[INFO] 
[INFO] --- maven-clean-plugin:3.1.0:clean (default-clean) @ package-smoke-execution ---
[INFO] 
[INFO] -----------< org.apache.bigtop.itest:bigtop-test-execution >------------
[INFO] Building bigtop-smokes 1.5.0-SNAPSHOT                              [4/4]
[INFO] --------------------------------[ pom ]---------------------------------
[INFO] 
[INFO] --- maven-clean-plugin:3.1.0:clean (default-clean) @ bigtop-test-execution ---
[INFO] ------------------------------------------------------------------------
[INFO] Reactor Summary for bigtop-smokes 1.5.0-SNAPSHOT:
[INFO] 
[INFO] stacks-validation-common ........................... SUCCESS [  0.444 s]
[INFO] smoke-tests-conf ................................... SUCCESS [  0.007 s]
[INFO] packagesmokes ...................................... SUCCESS [  0.037 s]
[INFO] bigtop-smokes ...................................... SUCCESS [  0.021 s]
[INFO] ------------------------------------------------------------------------
[INFO] BUILD SUCCESS
[INFO] ------------------------------------------------------------------------
[INFO] Total time:  1.273 s
[INFO] Finished at: 2020-05-27T02:15:28Z
[INFO] ------------------------------------------------------------------------
[Bigtop-trunk-test-execution] $ /bin/bash -xe /tmp/jenkins7008347064234060949.sh
+ export HADOOP_CONF_DIR=
+ HADOOP_CONF_DIR=
+ export HADOOP_HOME=
+ HADOOP_HOME=
+ mvn -f bigtop-tests/test-execution/pom.xml -DskipTests -DskipITs deploy -DrepositoryId=apache.snapshots.https
/tmp/jenkins7008347064234060949.sh: line 4: mvn: command not found
Build step 'Execute shell' marked build as failure

Build failed in Jenkins: Bigtop-trunk-test-execution #2479

Posted by Apache Jenkins Server <je...@builds.apache.org>.
See <https://builds.apache.org/job/Bigtop-trunk-test-execution/2479/display/redirect?page=changes>

Changes:

[github] BIGTOP-3358: get_roles() function should fail if a component is not in


------------------------------------------
Started by an SCM change
Running as SYSTEM
[EnvInject] - Loading node environment variables.
Building remotely on H30 (ubuntu) in workspace <https://builds.apache.org/job/Bigtop-trunk-test-execution/ws/>
No credentials specified
 > git rev-parse --is-inside-work-tree # timeout=10
Fetching changes from the remote Git repository
 > git config remote.origin.url https://git-wip-us.apache.org/repos/asf/bigtop.git # timeout=10
Fetching upstream changes from https://git-wip-us.apache.org/repos/asf/bigtop.git
 > git --version # timeout=10
 > git fetch --tags --progress -- https://git-wip-us.apache.org/repos/asf/bigtop.git +refs/heads/*:refs/remotes/origin/*
 > git rev-parse origin/master^{commit} # timeout=10
Checking out Revision 4c9586044e8d7844d785b2b44936a989c7b62316 (origin/master)
 > git config core.sparsecheckout # timeout=10
 > git checkout -f 4c9586044e8d7844d785b2b44936a989c7b62316
Commit message: "BIGTOP-3358: get_roles() function should fail if a component is not in roles_map (#641)"
 > git rev-list --no-walk 2e1654037f944d207edb7a0f0b37b1cf3a6a3fcc # timeout=10
[Bigtop-trunk-test-execution] $ /home/jenkins/tools/maven/latest3/bin/mvn -f bigtop-tests/test-execution/pom.xml clean
[INFO] Scanning for projects...
[INFO] ------------------------------------------------------------------------
[INFO] Reactor Build Order:
[INFO] 
[INFO] stacks-validation-common                                           [pom]
[INFO] smoke-tests-conf                                                   [jar]
[INFO] packagesmokes                                                      [jar]
[INFO] bigtop-smokes                                                      [pom]
[INFO] 
[INFO] ---------------< org.apache.bigtop.itest:stacks-common >----------------
[INFO] Building stacks-validation-common 1.5.0-SNAPSHOT                   [1/4]
[INFO] --------------------------------[ pom ]---------------------------------
[INFO] 
[INFO] --- maven-clean-plugin:3.1.0:clean (default-clean) @ stacks-common ---
[INFO] 
[INFO] --------------< org.apache.bigtop.itest:smoke-tests-conf >--------------
[INFO] Building smoke-tests-conf 1.5.0-SNAPSHOT                           [2/4]
[INFO] --------------------------------[ jar ]---------------------------------
[INFO] 
[INFO] --- maven-clean-plugin:3.1.0:clean (default-clean) @ smoke-tests-conf ---
[INFO] 
[INFO] ----------< org.apache.bigtop.itest:package-smoke-execution >-----------
[INFO] Building packagesmokes 1.5.0-SNAPSHOT                              [3/4]
[INFO] --------------------------------[ jar ]---------------------------------
[INFO] 
[INFO] --- maven-clean-plugin:3.1.0:clean (default-clean) @ package-smoke-execution ---
[INFO] 
[INFO] -----------< org.apache.bigtop.itest:bigtop-test-execution >------------
[INFO] Building bigtop-smokes 1.5.0-SNAPSHOT                              [4/4]
[INFO] --------------------------------[ pom ]---------------------------------
[INFO] 
[INFO] --- maven-clean-plugin:3.1.0:clean (default-clean) @ bigtop-test-execution ---
[INFO] ------------------------------------------------------------------------
[INFO] Reactor Summary for bigtop-smokes 1.5.0-SNAPSHOT:
[INFO] 
[INFO] stacks-validation-common ........................... SUCCESS [  0.342 s]
[INFO] smoke-tests-conf ................................... SUCCESS [  0.007 s]
[INFO] packagesmokes ...................................... SUCCESS [  0.050 s]
[INFO] bigtop-smokes ...................................... SUCCESS [  0.022 s]
[INFO] ------------------------------------------------------------------------
[INFO] BUILD SUCCESS
[INFO] ------------------------------------------------------------------------
[INFO] Total time:  1.174 s
[INFO] Finished at: 2020-05-25T10:00:27Z
[INFO] ------------------------------------------------------------------------
[Bigtop-trunk-test-execution] $ /bin/bash -xe /tmp/jenkins7367164437928467447.sh
+ export HADOOP_CONF_DIR=
+ HADOOP_CONF_DIR=
+ export HADOOP_HOME=
+ HADOOP_HOME=
+ mvn -f bigtop-tests/test-execution/pom.xml -DskipTests -DskipITs deploy -DrepositoryId=apache.snapshots.https
/tmp/jenkins7367164437928467447.sh: line 4: mvn: command not found
Build step 'Execute shell' marked build as failure

Build failed in Jenkins: Bigtop-trunk-test-execution #2478

Posted by Apache Jenkins Server <je...@builds.apache.org>.
See <https://builds.apache.org/job/Bigtop-trunk-test-execution/2478/display/redirect?page=changes>

Changes:

[github] BIGTOP-3327: Fix Zeppelin build issue after upgrading Spark-2.4.5 (#631)


------------------------------------------
Started by an SCM change
Running as SYSTEM
[EnvInject] - Loading node environment variables.
Building remotely on H23 (ubuntu) in workspace <https://builds.apache.org/job/Bigtop-trunk-test-execution/ws/>
No credentials specified
 > git rev-parse --is-inside-work-tree # timeout=10
Fetching changes from the remote Git repository
 > git config remote.origin.url https://git-wip-us.apache.org/repos/asf/bigtop.git # timeout=10
Fetching upstream changes from https://git-wip-us.apache.org/repos/asf/bigtop.git
 > git --version # timeout=10
 > git fetch --tags --progress -- https://git-wip-us.apache.org/repos/asf/bigtop.git +refs/heads/*:refs/remotes/origin/*
 > git rev-parse origin/master^{commit} # timeout=10
Checking out Revision 2e1654037f944d207edb7a0f0b37b1cf3a6a3fcc (origin/master)
 > git config core.sparsecheckout # timeout=10
 > git checkout -f 2e1654037f944d207edb7a0f0b37b1cf3a6a3fcc
Commit message: "BIGTOP-3327: Fix Zeppelin build issue after upgrading Spark-2.4.5 (#631)"
 > git rev-list --no-walk 9b66904274239c058833e792565823ca3152cf96 # timeout=10
[Bigtop-trunk-test-execution] $ /home/jenkins/tools/maven/latest3/bin/mvn -f bigtop-tests/test-execution/pom.xml clean
[INFO] Scanning for projects...
[INFO] ------------------------------------------------------------------------
[INFO] Reactor Build Order:
[INFO] 
[INFO] stacks-validation-common                                           [pom]
[INFO] smoke-tests-conf                                                   [jar]
[INFO] packagesmokes                                                      [jar]
[INFO] bigtop-smokes                                                      [pom]
[INFO] 
[INFO] ---------------< org.apache.bigtop.itest:stacks-common >----------------
[INFO] Building stacks-validation-common 1.5.0-SNAPSHOT                   [1/4]
[INFO] --------------------------------[ pom ]---------------------------------
[INFO] 
[INFO] --- maven-clean-plugin:3.1.0:clean (default-clean) @ stacks-common ---
[INFO] 
[INFO] --------------< org.apache.bigtop.itest:smoke-tests-conf >--------------
[INFO] Building smoke-tests-conf 1.5.0-SNAPSHOT                           [2/4]
[INFO] --------------------------------[ jar ]---------------------------------
[INFO] 
[INFO] --- maven-clean-plugin:3.1.0:clean (default-clean) @ smoke-tests-conf ---
[INFO] 
[INFO] ----------< org.apache.bigtop.itest:package-smoke-execution >-----------
[INFO] Building packagesmokes 1.5.0-SNAPSHOT                              [3/4]
[INFO] --------------------------------[ jar ]---------------------------------
[INFO] 
[INFO] --- maven-clean-plugin:3.1.0:clean (default-clean) @ package-smoke-execution ---
[INFO] 
[INFO] -----------< org.apache.bigtop.itest:bigtop-test-execution >------------
[INFO] Building bigtop-smokes 1.5.0-SNAPSHOT                              [4/4]
[INFO] --------------------------------[ pom ]---------------------------------
[INFO] 
[INFO] --- maven-clean-plugin:3.1.0:clean (default-clean) @ bigtop-test-execution ---
[INFO] ------------------------------------------------------------------------
[INFO] Reactor Summary for bigtop-smokes 1.5.0-SNAPSHOT:
[INFO] 
[INFO] stacks-validation-common ........................... SUCCESS [  0.338 s]
[INFO] smoke-tests-conf ................................... SUCCESS [  0.005 s]
[INFO] packagesmokes ...................................... SUCCESS [  0.018 s]
[INFO] bigtop-smokes ...................................... SUCCESS [  0.014 s]
[INFO] ------------------------------------------------------------------------
[INFO] BUILD SUCCESS
[INFO] ------------------------------------------------------------------------
[INFO] Total time:  0.894 s
[INFO] Finished at: 2020-05-15T15:00:15Z
[INFO] ------------------------------------------------------------------------
[Bigtop-trunk-test-execution] $ /bin/bash -xe /tmp/jenkins395929464335572981.sh
+ export HADOOP_CONF_DIR=
+ HADOOP_CONF_DIR=
+ export HADOOP_HOME=
+ HADOOP_HOME=
+ mvn -f bigtop-tests/test-execution/pom.xml -DskipTests -DskipITs deploy -DrepositoryId=apache.snapshots.https
/tmp/jenkins395929464335572981.sh: line 4: mvn: command not found
Build step 'Execute shell' marked build as failure

Build failed in Jenkins: Bigtop-trunk-test-execution #2477

Posted by Apache Jenkins Server <je...@builds.apache.org>.
See <https://builds.apache.org/job/Bigtop-trunk-test-execution/2477/display/redirect?page=changes>

Changes:

[github] BIGTOP-3348. Fix Hive test failures caused by NoSuchMethodError of


------------------------------------------
Started by an SCM change
Running as SYSTEM
[EnvInject] - Loading node environment variables.
Building remotely on H23 (ubuntu) in workspace <https://builds.apache.org/job/Bigtop-trunk-test-execution/ws/>
No credentials specified
 > git rev-parse --is-inside-work-tree # timeout=10
Fetching changes from the remote Git repository
 > git config remote.origin.url https://git-wip-us.apache.org/repos/asf/bigtop.git # timeout=10
Fetching upstream changes from https://git-wip-us.apache.org/repos/asf/bigtop.git
 > git --version # timeout=10
 > git fetch --tags --progress -- https://git-wip-us.apache.org/repos/asf/bigtop.git +refs/heads/*:refs/remotes/origin/*
 > git rev-parse origin/master^{commit} # timeout=10
Checking out Revision 9b66904274239c058833e792565823ca3152cf96 (origin/master)
 > git config core.sparsecheckout # timeout=10
 > git checkout -f 9b66904274239c058833e792565823ca3152cf96
Commit message: "BIGTOP-3348. Fix Hive test failures caused by NoSuchMethodError of ApplicationId.fromString. (#636)"
 > git rev-list --no-walk 5784cad1f3a32dcbe3001f1f1db55eac2c947a3f # timeout=10
[Bigtop-trunk-test-execution] $ /home/jenkins/tools/maven/latest3/bin/mvn -f bigtop-tests/test-execution/pom.xml clean
[INFO] Scanning for projects...
[INFO] ------------------------------------------------------------------------
[INFO] Reactor Build Order:
[INFO] 
[INFO] stacks-validation-common                                           [pom]
[INFO] smoke-tests-conf                                                   [jar]
[INFO] packagesmokes                                                      [jar]
[INFO] bigtop-smokes                                                      [pom]
[INFO] 
[INFO] ---------------< org.apache.bigtop.itest:stacks-common >----------------
[INFO] Building stacks-validation-common 1.5.0-SNAPSHOT                   [1/4]
[INFO] --------------------------------[ pom ]---------------------------------
[INFO] 
[INFO] --- maven-clean-plugin:3.1.0:clean (default-clean) @ stacks-common ---
[INFO] 
[INFO] --------------< org.apache.bigtop.itest:smoke-tests-conf >--------------
[INFO] Building smoke-tests-conf 1.5.0-SNAPSHOT                           [2/4]
[INFO] --------------------------------[ jar ]---------------------------------
[INFO] 
[INFO] --- maven-clean-plugin:3.1.0:clean (default-clean) @ smoke-tests-conf ---
[INFO] 
[INFO] ----------< org.apache.bigtop.itest:package-smoke-execution >-----------
[INFO] Building packagesmokes 1.5.0-SNAPSHOT                              [3/4]
[INFO] --------------------------------[ jar ]---------------------------------
[INFO] 
[INFO] --- maven-clean-plugin:3.1.0:clean (default-clean) @ package-smoke-execution ---
[INFO] 
[INFO] -----------< org.apache.bigtop.itest:bigtop-test-execution >------------
[INFO] Building bigtop-smokes 1.5.0-SNAPSHOT                              [4/4]
[INFO] --------------------------------[ pom ]---------------------------------
[INFO] 
[INFO] --- maven-clean-plugin:3.1.0:clean (default-clean) @ bigtop-test-execution ---
[INFO] ------------------------------------------------------------------------
[INFO] Reactor Summary for bigtop-smokes 1.5.0-SNAPSHOT:
[INFO] 
[INFO] stacks-validation-common ........................... SUCCESS [  0.294 s]
[INFO] smoke-tests-conf ................................... SUCCESS [  0.006 s]
[INFO] packagesmokes ...................................... SUCCESS [  0.020 s]
[INFO] bigtop-smokes ...................................... SUCCESS [  0.046 s]
[INFO] ------------------------------------------------------------------------
[INFO] BUILD SUCCESS
[INFO] ------------------------------------------------------------------------
[INFO] Total time:  0.902 s
[INFO] Finished at: 2020-05-13T15:30:20Z
[INFO] ------------------------------------------------------------------------
[Bigtop-trunk-test-execution] $ /bin/bash -xe /tmp/jenkins3334475585999764122.sh
+ export HADOOP_CONF_DIR=
+ HADOOP_CONF_DIR=
+ export HADOOP_HOME=
+ HADOOP_HOME=
+ mvn -f bigtop-tests/test-execution/pom.xml -DskipTests -DskipITs deploy -DrepositoryId=apache.snapshots.https
/tmp/jenkins3334475585999764122.sh: line 4: mvn: command not found
Build step 'Execute shell' marked build as failure

Build failed in Jenkins: Bigtop-trunk-test-execution #2476

Posted by Apache Jenkins Server <je...@builds.apache.org>.
See <https://builds.apache.org/job/Bigtop-trunk-test-execution/2476/display/redirect?page=changes>

Changes:

[github] BIGTOP-3353: hive.hwi.war.file configuration is no longer needed (#638)


------------------------------------------
Started by an SCM change
Running as SYSTEM
[EnvInject] - Loading node environment variables.
Building remotely on H30 (ubuntu) in workspace <https://builds.apache.org/job/Bigtop-trunk-test-execution/ws/>
No credentials specified
 > git rev-parse --is-inside-work-tree # timeout=10
Fetching changes from the remote Git repository
 > git config remote.origin.url https://git-wip-us.apache.org/repos/asf/bigtop.git # timeout=10
Fetching upstream changes from https://git-wip-us.apache.org/repos/asf/bigtop.git
 > git --version # timeout=10
 > git fetch --tags --progress -- https://git-wip-us.apache.org/repos/asf/bigtop.git +refs/heads/*:refs/remotes/origin/*
 > git rev-parse origin/master^{commit} # timeout=10
Checking out Revision 5784cad1f3a32dcbe3001f1f1db55eac2c947a3f (origin/master)
 > git config core.sparsecheckout # timeout=10
 > git checkout -f 5784cad1f3a32dcbe3001f1f1db55eac2c947a3f
Commit message: "BIGTOP-3353: hive.hwi.war.file configuration is no longer needed (#638)"
 > git rev-list --no-walk 399a210dbd85270079945a13ae6f94dc84db52e4 # timeout=10
[Bigtop-trunk-test-execution] $ /home/jenkins/tools/maven/latest3/bin/mvn -f bigtop-tests/test-execution/pom.xml clean
[INFO] Scanning for projects...
[INFO] ------------------------------------------------------------------------
[INFO] Reactor Build Order:
[INFO] 
[INFO] stacks-validation-common                                           [pom]
[INFO] smoke-tests-conf                                                   [jar]
[INFO] packagesmokes                                                      [jar]
[INFO] bigtop-smokes                                                      [pom]
[INFO] 
[INFO] ---------------< org.apache.bigtop.itest:stacks-common >----------------
[INFO] Building stacks-validation-common 1.5.0-SNAPSHOT                   [1/4]
[INFO] --------------------------------[ pom ]---------------------------------
[INFO] 
[INFO] --- maven-clean-plugin:3.1.0:clean (default-clean) @ stacks-common ---
[INFO] 
[INFO] --------------< org.apache.bigtop.itest:smoke-tests-conf >--------------
[INFO] Building smoke-tests-conf 1.5.0-SNAPSHOT                           [2/4]
[INFO] --------------------------------[ jar ]---------------------------------
[INFO] 
[INFO] --- maven-clean-plugin:3.1.0:clean (default-clean) @ smoke-tests-conf ---
[INFO] 
[INFO] ----------< org.apache.bigtop.itest:package-smoke-execution >-----------
[INFO] Building packagesmokes 1.5.0-SNAPSHOT                              [3/4]
[INFO] --------------------------------[ jar ]---------------------------------
[INFO] 
[INFO] --- maven-clean-plugin:3.1.0:clean (default-clean) @ package-smoke-execution ---
[INFO] 
[INFO] -----------< org.apache.bigtop.itest:bigtop-test-execution >------------
[INFO] Building bigtop-smokes 1.5.0-SNAPSHOT                              [4/4]
[INFO] --------------------------------[ pom ]---------------------------------
[INFO] 
[INFO] --- maven-clean-plugin:3.1.0:clean (default-clean) @ bigtop-test-execution ---
[INFO] ------------------------------------------------------------------------
[INFO] Reactor Summary for bigtop-smokes 1.5.0-SNAPSHOT:
[INFO] 
[INFO] stacks-validation-common ........................... SUCCESS [  0.357 s]
[INFO] smoke-tests-conf ................................... SUCCESS [  0.007 s]
[INFO] packagesmokes ...................................... SUCCESS [  0.079 s]
[INFO] bigtop-smokes ...................................... SUCCESS [  0.024 s]
[INFO] ------------------------------------------------------------------------
[INFO] BUILD SUCCESS
[INFO] ------------------------------------------------------------------------
[INFO] Total time:  1.337 s
[INFO] Finished at: 2020-05-06T18:30:32Z
[INFO] ------------------------------------------------------------------------
[Bigtop-trunk-test-execution] $ /bin/bash -xe /tmp/jenkins7532434861420447478.sh
+ export HADOOP_CONF_DIR=
+ HADOOP_CONF_DIR=
+ export HADOOP_HOME=
+ HADOOP_HOME=
+ mvn -f bigtop-tests/test-execution/pom.xml -DskipTests -DskipITs deploy -DrepositoryId=apache.snapshots.https
/tmp/jenkins7532434861420447478.sh: line 4: mvn: command not found
Build step 'Execute shell' marked build as failure

Build failed in Jenkins: Bigtop-trunk-test-execution #2475

Posted by Apache Jenkins Server <je...@builds.apache.org>.
See <https://builds.apache.org/job/Bigtop-trunk-test-execution/2475/display/redirect?page=changes>

Changes:

[github] BIGTOP-3347. Fix test failures of Hive ProxyFileSystem against Hadoop


------------------------------------------
Started by an SCM change
Running as SYSTEM
[EnvInject] - Loading node environment variables.
Building remotely on H32 (ubuntu) in workspace <https://builds.apache.org/job/Bigtop-trunk-test-execution/ws/>
No credentials specified
 > git rev-parse --is-inside-work-tree # timeout=10
Fetching changes from the remote Git repository
 > git config remote.origin.url https://git-wip-us.apache.org/repos/asf/bigtop.git # timeout=10
Fetching upstream changes from https://git-wip-us.apache.org/repos/asf/bigtop.git
 > git --version # timeout=10
 > git fetch --tags --progress -- https://git-wip-us.apache.org/repos/asf/bigtop.git +refs/heads/*:refs/remotes/origin/*
 > git rev-parse origin/master^{commit} # timeout=10
Checking out Revision 399a210dbd85270079945a13ae6f94dc84db52e4 (origin/master)
 > git config core.sparsecheckout # timeout=10
 > git checkout -f 399a210dbd85270079945a13ae6f94dc84db52e4
Commit message: "BIGTOP-3347. Fix test failures of Hive ProxyFileSystem against Hadoop 2.10.0. (#633)"
 > git rev-list --no-walk 0db0aafadac99363f41347c6a2d4010fd6959b1c # timeout=10
[Bigtop-trunk-test-execution] $ /home/jenkins/tools/maven/latest3/bin/mvn -f bigtop-tests/test-execution/pom.xml clean
[INFO] Scanning for projects...
[INFO] ------------------------------------------------------------------------
[INFO] Reactor Build Order:
[INFO] 
[INFO] stacks-validation-common                                           [pom]
[INFO] smoke-tests-conf                                                   [jar]
[INFO] packagesmokes                                                      [jar]
[INFO] bigtop-smokes                                                      [pom]
[INFO] 
[INFO] ---------------< org.apache.bigtop.itest:stacks-common >----------------
[INFO] Building stacks-validation-common 1.5.0-SNAPSHOT                   [1/4]
[INFO] --------------------------------[ pom ]---------------------------------
[INFO] 
[INFO] --- maven-clean-plugin:3.1.0:clean (default-clean) @ stacks-common ---
[INFO] 
[INFO] --------------< org.apache.bigtop.itest:smoke-tests-conf >--------------
[INFO] Building smoke-tests-conf 1.5.0-SNAPSHOT                           [2/4]
[INFO] --------------------------------[ jar ]---------------------------------
[INFO] 
[INFO] --- maven-clean-plugin:3.1.0:clean (default-clean) @ smoke-tests-conf ---
[INFO] 
[INFO] ----------< org.apache.bigtop.itest:package-smoke-execution >-----------
[INFO] Building packagesmokes 1.5.0-SNAPSHOT                              [3/4]
[INFO] --------------------------------[ jar ]---------------------------------
[INFO] 
[INFO] --- maven-clean-plugin:3.1.0:clean (default-clean) @ package-smoke-execution ---
[INFO] 
[INFO] -----------< org.apache.bigtop.itest:bigtop-test-execution >------------
[INFO] Building bigtop-smokes 1.5.0-SNAPSHOT                              [4/4]
[INFO] --------------------------------[ pom ]---------------------------------
[INFO] 
[INFO] --- maven-clean-plugin:3.1.0:clean (default-clean) @ bigtop-test-execution ---
[INFO] ------------------------------------------------------------------------
[INFO] Reactor Summary for bigtop-smokes 1.5.0-SNAPSHOT:
[INFO] 
[INFO] stacks-validation-common ........................... SUCCESS [  0.346 s]
[INFO] smoke-tests-conf ................................... SUCCESS [  0.006 s]
[INFO] packagesmokes ...................................... SUCCESS [  0.035 s]
[INFO] bigtop-smokes ...................................... SUCCESS [  0.021 s]
[INFO] ------------------------------------------------------------------------
[INFO] BUILD SUCCESS
[INFO] ------------------------------------------------------------------------
[INFO] Total time:  1.131 s
[INFO] Finished at: 2020-05-05T07:15:23Z
[INFO] ------------------------------------------------------------------------
[Bigtop-trunk-test-execution] $ /bin/bash -xe /tmp/jenkins3462561519633401659.sh
+ export HADOOP_CONF_DIR=
+ HADOOP_CONF_DIR=
+ export HADOOP_HOME=
+ HADOOP_HOME=
+ mvn -f bigtop-tests/test-execution/pom.xml -DskipTests -DskipITs deploy -DrepositoryId=apache.snapshots.https
/tmp/jenkins3462561519633401659.sh: line 4: mvn: command not found
Build step 'Execute shell' marked build as failure