You are viewing a plain text version of this content. The canonical link for it is here.
Posted to builds@hbase.apache.org by Apache Jenkins Server <je...@builds.apache.org> on 2015/08/27 01:00:22 UTC
Build failed in Jenkins: HBase-1.0 #1031
See <https://builds.apache.org/job/HBase-1.0/1031/changes>
Changes:
[eclark] HBASE-14313 After a Connection sees ConnectionClosingException on a connection it never recovers
------------------------------------------
[...truncated 1899 lines...]
Running org.apache.hadoop.hbase.security.access.TestScanEarlyTermination
Running org.apache.hadoop.hbase.security.access.TestAccessController2
Tests run: 1, Failures: 0, Errors: 0, Skipped: 0, Time elapsed: 4.875 sec - in org.apache.hadoop.hbase.security.access.TestScanEarlyTermination
Running org.apache.hadoop.hbase.security.access.TestZKPermissionsWatcher
Tests run: 1, Failures: 0, Errors: 0, Skipped: 0, Time elapsed: 3.705 sec - in org.apache.hadoop.hbase.security.access.TestZKPermissionsWatcher
Running org.apache.hadoop.hbase.security.token.TestTokenAuthentication
Tests run: 3, Failures: 0, Errors: 0, Skipped: 0, Time elapsed: 0.52 sec - in org.apache.hadoop.hbase.security.token.TestTokenAuthentication
Running org.apache.hadoop.hbase.security.token.TestZKSecretWatcher
Tests run: 7, Failures: 0, Errors: 0, Skipped: 0, Time elapsed: 33.2 sec - in org.apache.hadoop.hbase.security.access.TestTablePermissions
Tests run: 5, Failures: 0, Errors: 0, Skipped: 0, Time elapsed: 29.448 sec - in org.apache.hadoop.hbase.security.access.TestAccessController2
Tests run: 1, Failures: 0, Errors: 0, Skipped: 0, Time elapsed: 13.266 sec - in org.apache.hadoop.hbase.security.token.TestZKSecretWatcher
Running org.apache.hadoop.hbase.security.visibility.TestWithDisabledAuthorization
Running org.apache.hadoop.hbase.security.visibility.TestDefaultScanLabelGeneratorStack
Tests run: 2, Failures: 0, Errors: 0, Skipped: 0, Time elapsed: 3.92 sec - in org.apache.hadoop.hbase.security.visibility.TestWithDisabledAuthorization
Running org.apache.hadoop.hbase.security.visibility.TestVisibilityLabelReplicationWithExpAsString
Tests run: 1, Failures: 0, Errors: 0, Skipped: 0, Time elapsed: 2.252 sec - in org.apache.hadoop.hbase.security.visibility.TestDefaultScanLabelGeneratorStack
Running org.apache.hadoop.hbase.security.visibility.TestVisibilityLabelsWithSLGStack
Tests run: 1, Failures: 0, Errors: 0, Skipped: 0, Time elapsed: 1.872 sec - in org.apache.hadoop.hbase.security.visibility.TestVisibilityLabelsWithSLGStack
Tests run: 54, Failures: 0, Errors: 0, Skipped: 0, Time elapsed: 93.529 sec - in org.apache.hadoop.hbase.security.access.TestAccessController
Running org.apache.hadoop.hbase.security.visibility.TestEnforcingScanLabelGenerator
Tests run: 1, Failures: 0, Errors: 0, Skipped: 0, Time elapsed: 2.166 sec - in org.apache.hadoop.hbase.security.visibility.TestEnforcingScanLabelGenerator
Running org.apache.hadoop.hbase.security.visibility.TestVisibilityLabelsReplication
Tests run: 7, Failures: 0, Errors: 0, Skipped: 0, Time elapsed: 303.668 sec - in org.apache.hadoop.hbase.mapred.TestTableSnapshotInputFormat
Tests run: 1, Failures: 0, Errors: 0, Skipped: 0, Time elapsed: 20.36 sec - in org.apache.hadoop.hbase.security.visibility.TestVisibilityLabelReplicationWithExpAsString
Running org.apache.hadoop.hbase.security.visibility.TestVisibilityLabelsWithDeletes
Running org.apache.hadoop.hbase.security.visibility.TestVisibilityLabelsOpWithDifferentUsersNoACL
Tests run: 1, Failures: 0, Errors: 0, Skipped: 0, Time elapsed: 3.24 sec - in org.apache.hadoop.hbase.security.visibility.TestVisibilityLabelsOpWithDifferentUsersNoACL
Running org.apache.hadoop.hbase.security.visibility.TestVisibilityLabelsWithDistributedLogReplay
Running org.apache.hadoop.hbase.security.visibility.TestVisibilityLabelsWithCustomVisLabService
Tests run: 1, Failures: 0, Errors: 0, Skipped: 0, Time elapsed: 21.964 sec - in org.apache.hadoop.hbase.security.visibility.TestVisibilityLabelsReplication
Running org.apache.hadoop.hbase.security.visibility.TestVisibilityLabelsWithDefaultVisLabelService
Tests run: 23, Failures: 0, Errors: 0, Skipped: 0, Time elapsed: 18.347 sec - in org.apache.hadoop.hbase.security.visibility.TestVisibilityLabelsWithDistributedLogReplay
Running org.apache.hadoop.hbase.security.visibility.TestVisibilityLablesWithGroups
Tests run: 1, Failures: 0, Errors: 0, Skipped: 0, Time elapsed: 2.98 sec - in org.apache.hadoop.hbase.security.visibility.TestVisibilityLablesWithGroups
Tests run: 19, Failures: 0, Errors: 0, Skipped: 0, Time elapsed: 17.114 sec - in org.apache.hadoop.hbase.security.visibility.TestVisibilityLabelsWithCustomVisLabService
Running org.apache.hadoop.hbase.zookeeper.lock.TestZKInterProcessReadWriteLock
Tests run: 23, Failures: 0, Errors: 0, Skipped: 0, Time elapsed: 19.658 sec - in org.apache.hadoop.hbase.security.visibility.TestVisibilityLabelsWithDefaultVisLabelService
Running org.apache.hadoop.hbase.security.visibility.TestVisibilityLabelsWithACL
Running org.apache.hadoop.hbase.security.visibility.TestVisibilityWithCheckAuths
Running org.apache.hadoop.hbase.zookeeper.TestZooKeeperACL
Tests run: 6, Failures: 0, Errors: 0, Skipped: 0, Time elapsed: 0.288 sec - in org.apache.hadoop.hbase.zookeeper.TestZooKeeperACL
Tests run: 2, Failures: 0, Errors: 0, Skipped: 0, Time elapsed: 3.415 sec - in org.apache.hadoop.hbase.security.visibility.TestVisibilityWithCheckAuths
Tests run: 5, Failures: 0, Errors: 0, Skipped: 0, Time elapsed: 6.795 sec - in org.apache.hadoop.hbase.security.visibility.TestVisibilityLabelsWithACL
Running org.apache.hadoop.hbase.zookeeper.TestHQuorumPeer
Running org.apache.hadoop.hbase.zookeeper.TestZooKeeperNodeTracker
Tests run: 3, Failures: 0, Errors: 0, Skipped: 0, Time elapsed: 1.116 sec - in org.apache.hadoop.hbase.zookeeper.TestHQuorumPeer
Tests run: 3, Failures: 0, Errors: 0, Skipped: 0, Time elapsed: 1.067 sec - in org.apache.hadoop.hbase.zookeeper.TestZooKeeperNodeTracker
Running org.apache.hadoop.hbase.zookeeper.TestZKTableStateManager
Running org.apache.hadoop.hbase.zookeeper.TestRecoverableZooKeeper
Tests run: 1, Failures: 0, Errors: 0, Skipped: 0, Time elapsed: 0.964 sec - in org.apache.hadoop.hbase.zookeeper.TestZKTableStateManager
Running org.apache.hadoop.hbase.zookeeper.TestZKLeaderManager
Tests run: 1, Failures: 0, Errors: 0, Skipped: 0, Time elapsed: 1.3 sec - in org.apache.hadoop.hbase.zookeeper.TestRecoverableZooKeeper
Tests run: 1, Failures: 0, Errors: 0, Skipped: 0, Time elapsed: 0.155 sec - in org.apache.hadoop.hbase.zookeeper.TestZKLeaderManager
Running org.apache.hadoop.hbase.zookeeper.TestZKMulti
Running org.apache.hadoop.hbase.TestRegionRebalancing
Running org.apache.hadoop.hbase.TestDrainingServer
Tests run: 12, Failures: 0, Errors: 0, Skipped: 0, Time elapsed: 1.697 sec - in org.apache.hadoop.hbase.zookeeper.TestZKMulti
Running org.apache.hadoop.hbase.TestAcidGuarantees
Tests run: 2, Failures: 0, Errors: 0, Skipped: 0, Time elapsed: 2.183 sec - in org.apache.hadoop.hbase.TestDrainingServer
Tests run: 39, Failures: 0, Errors: 0, Skipped: 0, Time elapsed: 58.62 sec - in org.apache.hadoop.hbase.security.visibility.TestVisibilityLabelsWithDeletes
Tests run: 6, Failures: 0, Errors: 0, Skipped: 0, Time elapsed: 24.631 sec - in org.apache.hadoop.hbase.zookeeper.lock.TestZKInterProcessReadWriteLock
Running org.apache.hadoop.hbase.migration.TestUpgradeTo96
Running org.apache.hadoop.hbase.TestMultiVersions
Running org.apache.hadoop.hbase.migration.TestNamespaceUpgrade
Tests run: 5, Failures: 0, Errors: 0, Skipped: 0, Time elapsed: 4.945 sec - in org.apache.hadoop.hbase.migration.TestUpgradeTo96
Tests run: 3, Failures: 0, Errors: 0, Skipped: 0, Time elapsed: 7.563 sec - in org.apache.hadoop.hbase.TestMultiVersions
Running org.apache.hadoop.hbase.master.TestHMasterRPCException
Tests run: 1, Failures: 0, Errors: 0, Skipped: 0, Time elapsed: 3.883 sec - in org.apache.hadoop.hbase.master.TestHMasterRPCException
Running org.apache.hadoop.hbase.master.TestDeadServer
Tests run: 3, Failures: 0, Errors: 0, Skipped: 0, Time elapsed: 0.406 sec - in org.apache.hadoop.hbase.master.TestDeadServer
Running org.apache.hadoop.hbase.master.TestMasterRestartAfterDisablingTable
Running org.apache.hadoop.hbase.master.TestAssignmentListener
Tests run: 2, Failures: 0, Errors: 0, Skipped: 0, Time elapsed: 42.255 sec - in org.apache.hadoop.hbase.TestRegionRebalancing
Tests run: 2, Failures: 0, Errors: 0, Skipped: 0, Time elapsed: 5.796 sec - in org.apache.hadoop.hbase.master.TestAssignmentListener
Running org.apache.hadoop.hbase.master.TestMasterFailoverBalancerPersistence
Tests run: 5, Failures: 0, Errors: 0, Skipped: 0, Time elapsed: 22.102 sec - in org.apache.hadoop.hbase.migration.TestNamespaceUpgrade
Tests run: 1, Failures: 0, Errors: 0, Skipped: 0, Time elapsed: 16.32 sec - in org.apache.hadoop.hbase.master.TestMasterRestartAfterDisablingTable
Running org.apache.hadoop.hbase.master.TestMasterShutdown
Running org.apache.hadoop.hbase.master.snapshot.TestSnapshotFileCache
Running org.apache.hadoop.hbase.master.TestZKBasedOpenCloseRegion
Tests run: 3, Failures: 0, Errors: 0, Skipped: 0, Time elapsed: 3.599 sec - in org.apache.hadoop.hbase.master.TestZKBasedOpenCloseRegion
Tests run: 1, Failures: 0, Errors: 0, Skipped: 0, Time elapsed: 20.081 sec - in org.apache.hadoop.hbase.master.TestMasterFailoverBalancerPersistence
Running org.apache.hadoop.hbase.master.cleaner.TestHFileCleaner
Tests run: 3, Failures: 0, Errors: 0, Skipped: 0, Time elapsed: 1.14 sec - in org.apache.hadoop.hbase.master.cleaner.TestHFileCleaner
Running org.apache.hadoop.hbase.master.cleaner.TestLogsCleaner
Tests run: 2, Failures: 0, Errors: 0, Skipped: 0, Time elapsed: 19.036 sec - in org.apache.hadoop.hbase.master.TestMasterShutdown
Running org.apache.hadoop.hbase.master.cleaner.TestSnapshotFromMaster
Tests run: 1, Failures: 0, Errors: 0, Skipped: 0, Time elapsed: 11.438 sec - in org.apache.hadoop.hbase.master.cleaner.TestLogsCleaner
Running org.apache.hadoop.hbase.master.TestMasterOperationsForRegionReplicas
Running org.apache.hadoop.hbase.master.TestGetInfoPort
Tests run: 4, Failures: 0, Errors: 0, Skipped: 0, Time elapsed: 14.606 sec - in org.apache.hadoop.hbase.master.cleaner.TestSnapshotFromMaster
Running org.apache.hadoop.hbase.master.TestMasterStatusServlet
Tests run: 4, Failures: 0, Errors: 0, Skipped: 0, Time elapsed: 2.115 sec - in org.apache.hadoop.hbase.master.TestMasterStatusServlet
Running org.apache.hadoop.hbase.master.balancer.TestStochasticLoadBalancer
Tests run: 3, Failures: 0, Errors: 0, Skipped: 0, Time elapsed: 93.892 sec - in org.apache.hadoop.hbase.TestAcidGuarantees
Tests run: 1, Failures: 0, Errors: 0, Skipped: 0, Time elapsed: 10.859 sec - in org.apache.hadoop.hbase.master.TestGetInfoPort
Running org.apache.hadoop.hbase.master.balancer.TestDefaultLoadBalancer
Tests run: 2, Failures: 0, Errors: 0, Skipped: 0, Time elapsed: 13.21 sec - in org.apache.hadoop.hbase.master.TestMasterOperationsForRegionReplicas
Tests run: 5, Failures: 0, Errors: 0, Skipped: 0, Time elapsed: 40.059 sec - in org.apache.hadoop.hbase.master.snapshot.TestSnapshotFileCache
Running org.apache.hadoop.hbase.master.balancer.TestBaseLoadBalancer
Running org.apache.hadoop.hbase.master.TestMasterFailover
Tests run: 1, Failures: 0, Errors: 0, Skipped: 0, Time elapsed: 2.117 sec - in org.apache.hadoop.hbase.master.balancer.TestDefaultLoadBalancer
Tests run: 7, Failures: 0, Errors: 0, Skipped: 0, Time elapsed: 0.867 sec - in org.apache.hadoop.hbase.master.balancer.TestBaseLoadBalancer
Running org.apache.hadoop.hbase.master.TestMasterNoCluster
Running org.apache.hadoop.hbase.master.TestGetLastFlushedSequenceId
Running org.apache.hadoop.hbase.master.TestDistributedLogSplitting
Tests run: 3, Failures: 0, Errors: 0, Skipped: 0, Time elapsed: 13.731 sec - in org.apache.hadoop.hbase.master.TestMasterNoCluster
Running org.apache.hadoop.hbase.master.TestRollingRestart
Tests run: 1, Failures: 0, Errors: 0, Skipped: 0, Time elapsed: 15.687 sec - in org.apache.hadoop.hbase.master.TestGetLastFlushedSequenceId
Running org.apache.hadoop.hbase.master.TestRegionPlacement2
Tests run: 2, Failures: 0, Errors: 0, Skipped: 0, Time elapsed: 1.964 sec - in org.apache.hadoop.hbase.master.TestRegionPlacement2
Tests run: 1, Failures: 0, Errors: 0, Skipped: 0, Time elapsed: 21.239 sec - in org.apache.hadoop.hbase.master.TestRollingRestart
Running org.apache.hadoop.hbase.master.TestMaster
Running org.apache.hadoop.hbase.master.TestMasterMetricsWrapper
Tests run: 1, Failures: 0, Errors: 0, Skipped: 0, Time elapsed: 2.369 sec - in org.apache.hadoop.hbase.master.TestMasterMetricsWrapper
Tests run: 4, Failures: 0, Errors: 0, Skipped: 0, Time elapsed: 10.269 sec - in org.apache.hadoop.hbase.master.TestMaster
Running org.apache.hadoop.hbase.master.TestActiveMasterManager
Running org.apache.hadoop.hbase.master.TestMasterTransitions
Tests run: 3, Failures: 0, Errors: 0, Skipped: 3, Time elapsed: 0.002 sec - in org.apache.hadoop.hbase.master.TestMasterTransitions
Tests run: 2, Failures: 0, Errors: 0, Skipped: 0, Time elapsed: 1.206 sec - in org.apache.hadoop.hbase.master.TestActiveMasterManager
Running org.apache.hadoop.hbase.master.TestOpenedRegionHandler
Running org.apache.hadoop.hbase.master.TestRestartCluster
Tests run: 2, Failures: 0, Errors: 0, Skipped: 0, Time elapsed: 13.248 sec - in org.apache.hadoop.hbase.master.TestOpenedRegionHandler
Running org.apache.hadoop.hbase.master.handler.TestCreateTableHandler2
Tests run: 7, Failures: 0, Errors: 0, Skipped: 0, Time elapsed: 71.994 sec - in org.apache.hadoop.hbase.master.TestMasterFailover
Tests run: 1, Failures: 0, Errors: 0, Skipped: 0, Time elapsed: 10.066 sec - in org.apache.hadoop.hbase.master.handler.TestCreateTableHandler2
Running org.apache.hadoop.hbase.master.handler.TestCreateTableHandler
Running org.apache.hadoop.hbase.master.handler.TestTableDescriptorModification
Tests run: 3, Failures: 0, Errors: 0, Skipped: 0, Time elapsed: 4.191 sec - in org.apache.hadoop.hbase.master.handler.TestTableDescriptorModification
Running org.apache.hadoop.hbase.master.handler.TestEnableTableHandler
Tests run: 3, Failures: 0, Errors: 0, Skipped: 0, Time elapsed: 38.115 sec - in org.apache.hadoop.hbase.master.TestRestartCluster
Tests run: 3, Failures: 0, Errors: 0, Skipped: 0, Time elapsed: 24.929 sec - in org.apache.hadoop.hbase.master.handler.TestCreateTableHandler
Running org.apache.hadoop.hbase.master.TestSplitLogManager
Running org.apache.hadoop.hbase.master.handler.TestTableDeleteFamilyHandler
Tests run: 1, Failures: 0, Errors: 0, Skipped: 0, Time elapsed: 2.368 sec - in org.apache.hadoop.hbase.master.handler.TestTableDeleteFamilyHandler
Tests run: 3, Failures: 0, Errors: 0, Skipped: 0, Time elapsed: 27.688 sec - in org.apache.hadoop.hbase.master.handler.TestEnableTableHandler
Running org.apache.hadoop.hbase.master.TestAssignmentManagerOnCluster
Running org.apache.hadoop.hbase.master.TestRegionPlacement
Tests run: 2, Failures: 0, Errors: 0, Skipped: 0, Time elapsed: 17.438 sec - in org.apache.hadoop.hbase.master.TestRegionPlacement
Running org.apache.hadoop.hbase.master.TestClusterStatusPublisher
Tests run: 3, Failures: 0, Errors: 0, Skipped: 0, Time elapsed: 0.481 sec - in org.apache.hadoop.hbase.master.TestClusterStatusPublisher
Running org.apache.hadoop.hbase.master.TestTableLockManager
Tests run: 21, Failures: 0, Errors: 0, Skipped: 0, Time elapsed: 34.431 sec - in org.apache.hadoop.hbase.master.TestAssignmentManagerOnCluster
Running org.apache.hadoop.hbase.master.TestMasterMetrics
Tests run: 2, Failures: 0, Errors: 0, Skipped: 0, Time elapsed: 1.05 sec - in org.apache.hadoop.hbase.master.TestMasterMetrics
Running org.apache.hadoop.hbase.master.TestZKLessAMOnCluster
Tests run: 18, Failures: 0, Errors: 0, Skipped: 0, Time elapsed: 169.25 sec - in org.apache.hadoop.hbase.master.TestDistributedLogSplitting
Running org.apache.hadoop.hbase.master.TestMasterFileSystem
Tests run: 2, Failures: 0, Errors: 0, Skipped: 0, Time elapsed: 1.352 sec - in org.apache.hadoop.hbase.master.TestMasterFileSystem
Running org.apache.hadoop.hbase.master.TestAssignmentManager
Tests run: 20, Failures: 0, Errors: 0, Skipped: 0, Time elapsed: 3.926 sec - in org.apache.hadoop.hbase.master.TestAssignmentManager
Tests run: 21, Failures: 0, Errors: 0, Skipped: 0, Time elapsed: 33.563 sec - in org.apache.hadoop.hbase.master.TestZKLessAMOnCluster
Tests run: 5, Failures: 0, Errors: 0, Skipped: 0, Time elapsed: 79.741 sec - in org.apache.hadoop.hbase.master.TestTableLockManager
Tests run: 15, Failures: 0, Errors: 0, Skipped: 0, Time elapsed: 133.751 sec - in org.apache.hadoop.hbase.master.TestSplitLogManager
Killed
Results :
Tests run: 2382, Failures: 0, Errors: 0, Skipped: 18
[INFO] ------------------------------------------------------------------------
[INFO] Reactor Summary:
[INFO]
[INFO] Apache HBase ...................................... SUCCESS [3.565s]
[INFO] Apache HBase - Checkstyle ......................... SUCCESS [0.638s]
[INFO] Apache HBase - Resource Bundle .................... SUCCESS [0.215s]
[INFO] Apache HBase - Annotations ........................ SUCCESS [1.091s]
[INFO] Apache HBase - Common ............................. SUCCESS [1:07.378s]
[INFO] Apache HBase - Protocol ........................... SUCCESS [11.220s]
[INFO] Apache HBase - Client ............................. SUCCESS [1:23.937s]
[INFO] Apache HBase - Hadoop Compatibility ............... SUCCESS [7.507s]
[INFO] Apache HBase - Hadoop Two Compatibility ........... SUCCESS [7.126s]
[INFO] Apache HBase - Prefix Tree ........................ SUCCESS [13.348s]
[INFO] Apache HBase - Server ............................. FAILURE [1:15:40.879s]
[INFO] Apache HBase - Testing Util ....................... SKIPPED
[INFO] Apache HBase - Thrift ............................. SKIPPED
[INFO] Apache HBase - Rest ............................... SKIPPED
[INFO] Apache HBase - Shell .............................. SKIPPED
[INFO] Apache HBase - Integration Tests .................. SKIPPED
[INFO] Apache HBase - Examples ........................... SKIPPED
[INFO] Apache HBase - Assembly ........................... SKIPPED
[INFO] ------------------------------------------------------------------------
[INFO] BUILD FAILURE
[INFO] ------------------------------------------------------------------------
[INFO] Total time: 1:18:58.583s
[INFO] Finished at: Wed Aug 26 22:59:26 UTC 2015
[INFO] Final Memory: 47M/499M
[INFO] ------------------------------------------------------------------------
[ERROR] Failed to execute goal org.apache.maven.plugins:maven-surefire-plugin:2.18:test (secondPartTestsExecution) on project hbase-server: ExecutionException: java.lang.RuntimeException: The forked VM terminated without properly saying goodbye. VM crash or System.exit called?
[ERROR] Command was /bin/sh -c cd <https://builds.apache.org/job/HBase-1.0/ws/hbase-server> && /home/jenkins/tools/java/jdk1.7.0_25-32/jre/bin/java -enableassertions -XX:MaxDirectMemorySize=1G -Xmx2800m -XX:MaxPermSize=256m -Djava.security.egd=file:/dev/./urandom -Djava.net.preferIPv4Stack=true -Djava.awt.headless=true -jar <https://builds.apache.org/job/HBase-1.0/ws/hbase-server/target/surefire/surefirebooter1775609335515514518.jar> <https://builds.apache.org/job/HBase-1.0/ws/hbase-server/target/surefire/surefire8210071281052606668tmp> <https://builds.apache.org/job/HBase-1.0/ws/hbase-server/target/surefire/surefire_11722067313449273794444tmp>
[ERROR] -> [Help 1]
[ERROR]
[ERROR] To see the full stack trace of the errors, re-run Maven with the -e switch.
[ERROR] Re-run Maven using the -X switch to enable full debug logging.
[ERROR]
[ERROR] For more information about the errors and possible solutions, please read the following articles:
[ERROR] [Help 1] http://cwiki.apache.org/confluence/display/MAVEN/MojoFailureException
[ERROR]
[ERROR] After correcting the problems, you can resume the build with the command
[ERROR] mvn <goals> -rf :hbase-server
Build step 'Invoke top-level Maven targets' marked build as failure
Performing Post build task...
Match found for :.* : True
Logical operation result is TRUE
Running script : ZOMBIE_TESTS_COUNT=`jps | grep surefirebooter | wc -l`
if [[ $ZOMBIE_TESTS_COUNT != 0 ]] ; then
#It seems sometimes the tests are not dying immediately. Let's give them 10s
echo "Suspicious java process found - waiting 10s to see if there are just slow to stop"
sleep 10
ZOMBIE_TESTS_COUNT=`jps | grep surefirebooter | wc -l`
if [[ $ZOMBIE_TESTS_COUNT != 0 ]] ; then
echo "There are $ZOMBIE_TESTS_COUNT zombie tests, they should have been killed by surefire but survived"
echo "************ BEGIN zombies jstack extract"
ZB_STACK=`jps | grep surefirebooter | cut -d ' ' -f 1 | xargs -n 1 jstack | grep ".test" | grep "\.java"`
jps | grep surefirebooter | cut -d ' ' -f 1 | xargs -n 1 jstack
echo "************ END zombies jstack extract"
JIRA_COMMENT="$JIRA_COMMENT
{color:red}-1 core zombie tests{color}. There are ${ZOMBIE_TESTS_COUNT} zombie test(s): ${ZB_STACK}"
BAD=1
jps | grep surefirebooter | cut -d ' ' -f 1 | xargs kill -9
else
echo "We're ok: there is no zombie test, but some tests took some time to stop"
fi
else
echo "We're ok: there is no zombie test"
fi
[HBase-1.0] $ /bin/bash -xe /tmp/hudson7933006843061355904.sh
++ jps
++ grep surefirebooter
++ wc -l
+ ZOMBIE_TESTS_COUNT=0
+ [[ 0 != 0 ]]
+ echo 'We'\''re ok: there is no zombie test'
We're ok: there is no zombie test
POST BUILD TASK : SUCCESS
END OF POST BUILD TASK : 0
Archiving artifacts
Sending artifact delta relative to HBase-1.0 #1014
Archived 1929 artifacts
Archive block size is 32768
Received 28 blocks and 416185933 bytes
Compression is 0.2%
Took 1 min 47 sec
Recording test results
Updating HBASE-14313
Jenkins build is back to normal : HBase-1.0 #1037
Posted by Apache Jenkins Server <je...@builds.apache.org>.
See <https://builds.apache.org/job/HBase-1.0/1037/changes>
Build failed in Jenkins: HBase-1.0 #1036
Posted by Apache Jenkins Server <je...@builds.apache.org>.
See <https://builds.apache.org/job/HBase-1.0/1036/changes>
Changes:
[enis] Updated pom.xml version to 1.0.3-SNAPSHOT
------------------------------------------
[...truncated 4235 lines...]
java.lang.Thread.State: RUNNABLE
at java.net.PlainSocketImpl.socketAccept(Native Method)
at java.net.AbstractPlainSocketImpl.accept(AbstractPlainSocketImpl.java:398)
at java.net.ServerSocket.implAccept(ServerSocket.java:530)
at java.net.ServerSocket.accept(ServerSocket.java:498)
at org.apache.activemq.transport.tcp.TcpTransportServer.run(TcpTransportServer.java:301)
at java.lang.Thread.run(Thread.java:724)
"ActiveMQ Transport Server Thread Handler: tcp://localhost:61617" daemon prio=10 tid=0xa7ce9400 nid=0x1f97 waiting on condition [0xa6ead000]
java.lang.Thread.State: TIMED_WAITING (parking)
at sun.misc.Unsafe.park(Native Method)
- parking to wait for <0xb38c06c8> (a java.util.concurrent.locks.AbstractQueuedSynchronizer$ConditionObject)
at java.util.concurrent.locks.LockSupport.parkNanos(LockSupport.java:226)
at java.util.concurrent.locks.AbstractQueuedSynchronizer$ConditionObject.awaitNanos(AbstractQueuedSynchronizer.java:2082)
at java.util.concurrent.LinkedBlockingQueue.poll(LinkedBlockingQueue.java:467)
at org.apache.activemq.transport.tcp.TcpTransportServer$1.run(TcpTransportServer.java:375)
at java.lang.Thread.run(Thread.java:724)
"ActiveMQ Data File Writer" daemon prio=10 tid=0xa7cc3000 nid=0x1f95 in Object.wait() [0xa6efe000]
java.lang.Thread.State: WAITING (on object monitor)
at java.lang.Object.wait(Native Method)
at java.lang.Object.wait(Object.java:503)
at org.apache.activemq.store.kahadb.disk.journal.DataFileAppender.processQueue(DataFileAppender.java:304)
- locked <0xb3e1b380> (a java.lang.Object)
at org.apache.activemq.store.kahadb.disk.journal.DataFileAppender$1.run(DataFileAppender.java:193)
"ActiveMQ Journal Checkpoint Worker" daemon prio=10 tid=0xa7cbf800 nid=0x1f94 waiting on condition [0xa725c000]
java.lang.Thread.State: TIMED_WAITING (sleeping)
at java.lang.Thread.sleep(Native Method)
at org.apache.activemq.store.kahadb.MessageDatabase$3.run(MessageDatabase.java:350)
"KahaDB Scheduler" daemon prio=10 tid=0xa7cb5c00 nid=0x1f93 in Object.wait() [0xa9c7d000]
java.lang.Thread.State: TIMED_WAITING (on object monitor)
at java.lang.Object.wait(Native Method)
at java.util.TimerThread.mainLoop(Timer.java:552)
- locked <0xb3e1bd10> (a java.util.TaskQueue)
at java.util.TimerThread.run(Timer.java:505)
"RMI RenewClean-[140.211.11.27:43891]" daemon prio=10 tid=0xa7605800 nid=0x1f91 in Object.wait() [0xa72fe000]
java.lang.Thread.State: TIMED_WAITING (on object monitor)
at java.lang.Object.wait(Native Method)
at java.lang.ref.ReferenceQueue.remove(ReferenceQueue.java:135)
- locked <0xb3e5f7c0> (a java.lang.ref.ReferenceQueue$Lock)
at sun.rmi.transport.DGCClient$EndpointEntry$RenewCleanThread.run(DGCClient.java:535)
at java.lang.Thread.run(Thread.java:724)
"ActiveMQ Broker[testBroker] Scheduler" daemon prio=10 tid=0xa7c9ac00 nid=0x1f90 in Object.wait() [0xa829b000]
java.lang.Thread.State: TIMED_WAITING (on object monitor)
at java.lang.Object.wait(Native Method)
at java.util.TimerThread.mainLoop(Timer.java:552)
- locked <0xb3df7900> (a java.util.TaskQueue)
at java.util.TimerThread.run(Timer.java:505)
"RMI Scheduler(0)" daemon prio=10 tid=0xa7a4e800 nid=0x1f8f waiting on condition [0xa82ec000]
java.lang.Thread.State: TIMED_WAITING (parking)
at sun.misc.Unsafe.park(Native Method)
- parking to wait for <0xb37c2340> (a java.util.concurrent.locks.AbstractQueuedSynchronizer$ConditionObject)
at java.util.concurrent.locks.LockSupport.parkNanos(LockSupport.java:226)
at java.util.concurrent.locks.AbstractQueuedSynchronizer$ConditionObject.awaitNanos(AbstractQueuedSynchronizer.java:2082)
at java.util.concurrent.ScheduledThreadPoolExecutor$DelayedWorkQueue.take(ScheduledThreadPoolExecutor.java:1090)
at java.util.concurrent.ScheduledThreadPoolExecutor$DelayedWorkQueue.take(ScheduledThreadPoolExecutor.java:807)
at java.util.concurrent.ThreadPoolExecutor.getTask(ThreadPoolExecutor.java:1068)
at java.util.concurrent.ThreadPoolExecutor.runWorker(ThreadPoolExecutor.java:1130)
at java.util.concurrent.ThreadPoolExecutor$Worker.run(ThreadPoolExecutor.java:615)
at java.lang.Thread.run(Thread.java:724)
"GC Daemon" daemon prio=10 tid=0xa7a06000 nid=0x1f8c in Object.wait() [0xa917d000]
java.lang.Thread.State: TIMED_WAITING (on object monitor)
at java.lang.Object.wait(Native Method)
at sun.misc.GC$Daemon.run(GC.java:117)
- locked <0xb3823190> (a sun.misc.GC$LatencyLock)
"RMI Reaper" prio=10 tid=0xa7a04c00 nid=0x1f8b in Object.wait() [0xa937d000]
java.lang.Thread.State: WAITING (on object monitor)
at java.lang.Object.wait(Native Method)
- waiting on <0xb3812298> (a java.lang.ref.ReferenceQueue$Lock)
at java.lang.ref.ReferenceQueue.remove(ReferenceQueue.java:135)
- locked <0xb3812298> (a java.lang.ref.ReferenceQueue$Lock)
at java.lang.ref.ReferenceQueue.remove(ReferenceQueue.java:151)
at sun.rmi.transport.ObjectTable$Reaper.run(ObjectTable.java:351)
at java.lang.Thread.run(Thread.java:724)
"RMI TCP Accept-0" daemon prio=10 tid=0xa7a03c00 nid=0x1f8a runnable [0xa957d000]
java.lang.Thread.State: RUNNABLE
at java.net.PlainSocketImpl.socketAccept(Native Method)
at java.net.AbstractPlainSocketImpl.accept(AbstractPlainSocketImpl.java:398)
at java.net.ServerSocket.implAccept(ServerSocket.java:530)
at java.net.ServerSocket.accept(ServerSocket.java:498)
at sun.rmi.transport.tcp.TCPTransport$AcceptLoop.executeAcceptLoop(TCPTransport.java:387)
at sun.rmi.transport.tcp.TCPTransport$AcceptLoop.run(TCPTransport.java:359)
at java.lang.Thread.run(Thread.java:724)
"RMI TCP Accept-1099" daemon prio=10 tid=0xa7c64000 nid=0x1f88 runnable [0xaa056000]
java.lang.Thread.State: RUNNABLE
at java.net.PlainSocketImpl.socketAccept(Native Method)
at java.net.AbstractPlainSocketImpl.accept(AbstractPlainSocketImpl.java:398)
at java.net.ServerSocket.implAccept(ServerSocket.java:530)
at java.net.ServerSocket.accept(ServerSocket.java:498)
at sun.rmi.transport.tcp.TCPTransport$AcceptLoop.executeAcceptLoop(TCPTransport.java:387)
at sun.rmi.transport.tcp.TCPTransport$AcceptLoop.run(TCPTransport.java:359)
at java.lang.Thread.run(Thread.java:724)
"Service Thread" daemon prio=10 tid=0xa9626c00 nid=0x1f65 runnable [0x00000000]
java.lang.Thread.State: RUNNABLE
"C2 CompilerThread1" daemon prio=10 tid=0xa9625000 nid=0x1f64 waiting on condition [0x00000000]
java.lang.Thread.State: RUNNABLE
"C2 CompilerThread0" daemon prio=10 tid=0xa9623000 nid=0x1f63 waiting on condition [0x00000000]
java.lang.Thread.State: RUNNABLE
"Signal Dispatcher" daemon prio=10 tid=0xa9621800 nid=0x1f62 runnable [0x00000000]
java.lang.Thread.State: RUNNABLE
"Finalizer" daemon prio=10 tid=0xa9be6c00 nid=0x1f61 in Object.wait() [0xaee7d000]
java.lang.Thread.State: WAITING (on object monitor)
at java.lang.Object.wait(Native Method)
at java.lang.ref.ReferenceQueue.remove(ReferenceQueue.java:135)
- locked <0xb3833330> (a java.lang.ref.ReferenceQueue$Lock)
at java.lang.ref.ReferenceQueue.remove(ReferenceQueue.java:151)
at java.lang.ref.Finalizer$FinalizerThread.run(Finalizer.java:189)
"Reference Handler" daemon prio=10 tid=0xa9be5000 nid=0x1f60 in Object.wait() [0xaf07d000]
java.lang.Thread.State: WAITING (on object monitor)
at java.lang.Object.wait(Native Method)
at java.lang.Object.wait(Object.java:503)
at java.lang.ref.Reference$ReferenceHandler.run(Reference.java:133)
- locked <0xb3823180> (a java.lang.ref.Reference$Lock)
"main" prio=10 tid=0xf6706800 nid=0x1f4c waiting on condition [0xf691e000]
java.lang.Thread.State: TIMED_WAITING (sleeping)
at java.lang.Thread.sleep(Native Method)
at org.apache.stratos.integration.tests.application.SingleClusterScalingTest.assertClusterWithScalingup(SingleClusterScalingTest.java:215)
at org.apache.stratos.integration.tests.application.SingleClusterScalingTest.testDeployApplication(SingleClusterScalingTest.java:115)
at sun.reflect.NativeMethodAccessorImpl.invoke0(Native Method)
at sun.reflect.NativeMethodAccessorImpl.invoke(NativeMethodAccessorImpl.java:57)
at sun.reflect.DelegatingMethodAccessorImpl.invoke(DelegatingMethodAccessorImpl.java:43)
at java.lang.reflect.Method.invoke(Method.java:606)
at org.testng.internal.MethodInvocationHelper.invokeMethod(MethodInvocationHelper.java:80)
at org.testng.internal.Invoker.invokeMethod(Invoker.java:673)
at org.testng.internal.Invoker.invokeTestMethod(Invoker.java:842)
at org.testng.internal.Invoker.invokeTestMethods(Invoker.java:1166)
at org.testng.internal.TestMethodWorker.invokeTestMethods(TestMethodWorker.java:125)
at org.testng.internal.TestMethodWorker.run(TestMethodWorker.java:109)
at org.testng.TestRunner.runWorkers(TestRunner.java:1178)
at org.testng.TestRunner.privateRun(TestRunner.java:757)
at org.testng.TestRunner.run(TestRunner.java:608)
at org.testng.SuiteRunner.runTest(SuiteRunner.java:334)
at org.testng.SuiteRunner.runSequentially(SuiteRunner.java:329)
at org.testng.SuiteRunner.privateRun(SuiteRunner.java:291)
at org.testng.SuiteRunner.run(SuiteRunner.java:240)
at org.testng.SuiteRunnerWorker.runSuite(SuiteRunnerWorker.java:52)
at org.testng.SuiteRunnerWorker.run(SuiteRunnerWorker.java:86)
at org.testng.TestNG.runSuitesSequentially(TestNG.java:1158)
at org.testng.TestNG.runSuitesLocally(TestNG.java:1083)
at org.testng.TestNG.run(TestNG.java:999)
at org.apache.maven.surefire.testng.TestNGExecutor.run(TestNGExecutor.java:295)
at org.apache.maven.surefire.testng.TestNGXmlTestSuite.execute(TestNGXmlTestSuite.java:84)
at org.apache.maven.surefire.testng.TestNGProvider.invoke(TestNGProvider.java:90)
at org.apache.maven.surefire.booter.ForkedBooter.invokeProviderInSameClassLoader(ForkedBooter.java:203)
at org.apache.maven.surefire.booter.ForkedBooter.runSuitesInProcess(ForkedBooter.java:155)
at org.apache.maven.surefire.booter.ForkedBooter.main(ForkedBooter.java:103)
"VM Thread" prio=10 tid=0xa9ef8800 nid=0x1f5f runnable
"GC task thread#0 (ParallelGC)" prio=10 tid=0xf6710800 nid=0x1f4d runnable
"GC task thread#1 (ParallelGC)" prio=10 tid=0xf6712000 nid=0x1f4e runnable
"GC task thread#2 (ParallelGC)" prio=10 tid=0xf6713800 nid=0x1f4f runnable
"GC task thread#3 (ParallelGC)" prio=10 tid=0xf6714c00 nid=0x1f50 runnable
"GC task thread#4 (ParallelGC)" prio=10 tid=0xf6716400 nid=0x1f51 runnable
"GC task thread#5 (ParallelGC)" prio=10 tid=0xf6717c00 nid=0x1f52 runnable
"GC task thread#6 (ParallelGC)" prio=10 tid=0xf6719000 nid=0x1f53 runnable
"GC task thread#7 (ParallelGC)" prio=10 tid=0xf671a800 nid=0x1f54 runnable
"GC task thread#8 (ParallelGC)" prio=10 tid=0xf671c000 nid=0x1f55 runnable
"GC task thread#9 (ParallelGC)" prio=10 tid=0xf671d800 nid=0x1f56 runnable
"GC task thread#10 (ParallelGC)" prio=10 tid=0xf671ec00 nid=0x1f57 runnable
"GC task thread#11 (ParallelGC)" prio=10 tid=0xf6720400 nid=0x1f58 runnable
"GC task thread#12 (ParallelGC)" prio=10 tid=0xf6721c00 nid=0x1f59 runnable
"GC task thread#13 (ParallelGC)" prio=10 tid=0xf6723000 nid=0x1f5a runnable
"GC task thread#14 (ParallelGC)" prio=10 tid=0xf6724800 nid=0x1f5b runnable
"GC task thread#15 (ParallelGC)" prio=10 tid=0xf6726000 nid=0x1f5c runnable
"GC task thread#16 (ParallelGC)" prio=10 tid=0xf6727400 nid=0x1f5d runnable
"GC task thread#17 (ParallelGC)" prio=10 tid=0xf6728c00 nid=0x1f5e runnable
"VM Periodic Task Thread" prio=10 tid=0xa9628800 nid=0x1f66 waiting on condition
JNI global references: 306
+ echo '************ END zombies jstack extract'
************ END zombies jstack extract
+ JIRA_COMMENT='
{color:red}-1 core zombie tests{color}. There are 2 zombie test(s): at org.apache.activemq.artemis.tests.integration.cluster.failover.FailoverTest.createSession(FailoverTest.java:96)
at org.apache.activemq.artemis.tests.integration.cluster.failover.FailoverTest.testFailoverOnInitialConnection(FailoverTest.java:773)
at org.apache.stratos.integration.tests.application.SingleClusterScalingTest.assertClusterWithScalingup(SingleClusterScalingTest.java:215)
at org.apache.stratos.integration.tests.application.SingleClusterScalingTest.testDeployApplication(SingleClusterScalingTest.java:115)
at org.testng.internal.MethodInvocationHelper.invokeMethod(MethodInvocationHelper.java:80)
at org.testng.internal.Invoker.invokeMethod(Invoker.java:673)
at org.testng.internal.Invoker.invokeTestMethod(Invoker.java:842)
at org.testng.internal.Invoker.invokeTestMethods(Invoker.java:1166)
at org.testng.internal.TestMethodWorker.invokeTestMethods(TestMethodWorker.java:125)
at org.testng.internal.TestMethodWorker.run(TestMethodWorker.java:109)
at org.testng.TestRunner.runWorkers(TestRunner.java:1178)
at org.testng.TestRunner.privateRun(TestRunner.java:757)
at org.testng.TestRunner.run(TestRunner.java:608)
at org.testng.SuiteRunner.runTest(SuiteRunner.java:334)
at org.testng.SuiteRunner.runSequentially(SuiteRunner.java:329)
at org.testng.SuiteRunner.privateRun(SuiteRunner.java:291)
at org.testng.SuiteRunner.run(SuiteRunner.java:240)
at org.testng.SuiteRunnerWorker.runSuite(SuiteRunnerWorker.java:52)
at org.testng.SuiteRunnerWorker.run(SuiteRunnerWorker.java:86)
at org.testng.TestNG.runSuitesSequentially(TestNG.java:1158)
at org.testng.TestNG.runSuitesLocally(TestNG.java:1083)
at org.testng.TestNG.run(TestNG.java:999)
at org.apache.maven.surefire.testng.TestNGExecutor.run(TestNGExecutor.java:295)
at org.apache.maven.surefire.testng.TestNGXmlTestSuite.execute(TestNGXmlTestSuite.java:84)
at org.apache.maven.surefire.testng.TestNGProvider.invoke(TestNGProvider.java:90)'
+ BAD=1
+ jps
+ grep surefirebooter
+ cut -d ' ' -f 1
+ xargs kill -9
POST BUILD TASK : SUCCESS
END OF POST BUILD TASK : 0
Archiving artifacts
Sending artifact delta relative to HBase-1.0 #1014
Archived 1931 artifacts
Archive block size is 32768
Received 28 blocks and 440580928 bytes
Compression is 0.2%
Took 2 min 39 sec
Recording test results
Build failed in Jenkins: HBase-1.0 #1035
Posted by Apache Jenkins Server <je...@builds.apache.org>.
See <https://builds.apache.org/job/HBase-1.0/1035/changes>
Changes:
[matteo.bertozzi] HBASE-14325 Add snapshotinfo command to hbase script.
------------------------------------------
[...truncated 1206 lines...]
Tests run: 4, Failures: 0, Errors: 0, Skipped: 0, Time elapsed: 0.254 sec - in org.apache.hadoop.hbase.regionserver.TestKeyValueHeap
Running org.apache.hadoop.hbase.monitoring.TestMemoryBoundedLogMessageBuffer
Tests run: 2, Failures: 0, Errors: 0, Skipped: 0, Time elapsed: 0.356 sec - in org.apache.hadoop.hbase.monitoring.TestMemoryBoundedLogMessageBuffer
Running org.apache.hadoop.hbase.monitoring.TestTaskMonitor
Tests run: 3, Failures: 0, Errors: 0, Skipped: 0, Time elapsed: 0.658 sec - in org.apache.hadoop.hbase.monitoring.TestTaskMonitor
Running org.apache.hadoop.hbase.client.TestPutDeleteEtcCellIteration
Tests run: 6, Failures: 0, Errors: 0, Skipped: 0, Time elapsed: 0.52 sec - in org.apache.hadoop.hbase.client.TestPutDeleteEtcCellIteration
Running org.apache.hadoop.hbase.client.TestHBaseAdminNoCluster
Tests run: 2, Failures: 0, Errors: 0, Skipped: 0, Time elapsed: 7.038 sec - in org.apache.hadoop.hbase.client.TestHBaseAdminNoCluster
Running org.apache.hadoop.hbase.client.TestConnectionUtils
Tests run: 1, Failures: 0, Errors: 0, Skipped: 0, Time elapsed: 0.334 sec - in org.apache.hadoop.hbase.client.TestConnectionUtils
Running org.apache.hadoop.hbase.client.TestIntraRowPagination
Tests run: 1, Failures: 0, Errors: 0, Skipped: 0, Time elapsed: 1.6 sec - in org.apache.hadoop.hbase.client.TestIntraRowPagination
Running org.apache.hadoop.hbase.client.TestResult
Tests run: 9, Failures: 0, Errors: 0, Skipped: 0, Time elapsed: 0.603 sec - in org.apache.hadoop.hbase.client.TestResult
Running org.apache.hadoop.hbase.TestHDFSBlocksDistribution
Tests run: 2, Failures: 0, Errors: 0, Skipped: 0, Time elapsed: 0.337 sec - in org.apache.hadoop.hbase.TestHDFSBlocksDistribution
Running org.apache.hadoop.hbase.TestSerialization
Tests run: 9, Failures: 0, Errors: 0, Skipped: 0, Time elapsed: 1.433 sec - in org.apache.hadoop.hbase.TestSerialization
Running org.apache.hadoop.hbase.conf.TestConfigurationManager
Tests run: 2, Failures: 0, Errors: 0, Skipped: 0, Time elapsed: 0.316 sec - in org.apache.hadoop.hbase.conf.TestConfigurationManager
Running org.apache.hadoop.hbase.TestTagRewriteCell
Tests run: 1, Failures: 0, Errors: 0, Skipped: 0, Time elapsed: 0.36 sec - in org.apache.hadoop.hbase.TestTagRewriteCell
Running org.apache.hadoop.hbase.zookeeper.TestZooKeeperMainServer
Tests run: 2, Failures: 0, Errors: 0, Skipped: 0, Time elapsed: 1.078 sec - in org.apache.hadoop.hbase.zookeeper.TestZooKeeperMainServer
Running org.apache.hadoop.hbase.zookeeper.TestZKConfig
Tests run: 1, Failures: 0, Errors: 0, Skipped: 0, Time elapsed: 0.431 sec - in org.apache.hadoop.hbase.zookeeper.TestZKConfig
Running org.apache.hadoop.hbase.mapreduce.TestGroupingTableMapper
Tests run: 1, Failures: 0, Errors: 0, Skipped: 0, Time elapsed: 0.624 sec - in org.apache.hadoop.hbase.mapreduce.TestGroupingTableMapper
Running org.apache.hadoop.hbase.mapreduce.TestSimpleTotalOrderPartitioner
Tests run: 1, Failures: 0, Errors: 0, Skipped: 0, Time elapsed: 0.105 sec - in org.apache.hadoop.hbase.mapreduce.TestSimpleTotalOrderPartitioner
Running org.apache.hadoop.hbase.mapreduce.TestTableMapReduceUtil
Killed
Running org.apache.hadoop.hbase.mapreduce.TestImportTsvParser
Tests run: 12, Failures: 0, Errors: 0, Skipped: 0, Time elapsed: 0.71 sec - in org.apache.hadoop.hbase.mapreduce.TestImportTsvParser
Running org.apache.hadoop.hbase.mapreduce.TestTableInputFormatBase
Tests run: 1, Failures: 0, Errors: 0, Skipped: 0, Time elapsed: 0.338 sec - in org.apache.hadoop.hbase.mapreduce.TestTableInputFormatBase
Running org.apache.hadoop.hbase.mapreduce.TestSerialization
Tests run: 2, Failures: 0, Errors: 0, Skipped: 0, Time elapsed: 2.224 sec - in org.apache.hadoop.hbase.mapreduce.TestSerialization
Running org.apache.hadoop.hbase.mapreduce.TestTableSplit
Tests run: 4, Failures: 0, Errors: 0, Skipped: 0, Time elapsed: 0.517 sec - in org.apache.hadoop.hbase.mapreduce.TestTableSplit
Running org.apache.hadoop.hbase.mapreduce.TestJarFinder
Tests run: 4, Failures: 0, Errors: 0, Skipped: 0, Time elapsed: 1.706 sec - in org.apache.hadoop.hbase.mapreduce.TestJarFinder
Running org.apache.hadoop.hbase.TestHRegionLocation
Tests run: 3, Failures: 0, Errors: 0, Skipped: 0, Time elapsed: 0.411 sec - in org.apache.hadoop.hbase.TestHRegionLocation
Running org.apache.hadoop.hbase.io.TestImmutableBytesWritable
Tests run: 3, Failures: 0, Errors: 0, Skipped: 0, Time elapsed: 0.374 sec - in org.apache.hadoop.hbase.io.TestImmutableBytesWritable
Running org.apache.hadoop.hbase.io.TestHFileLink
Tests run: 2, Failures: 0, Errors: 0, Skipped: 0, Time elapsed: 0.433 sec - in org.apache.hadoop.hbase.io.TestHFileLink
Running org.apache.hadoop.hbase.io.TestReference
Tests run: 1, Failures: 0, Errors: 0, Skipped: 0, Time elapsed: 0.603 sec - in org.apache.hadoop.hbase.io.TestReference
Running org.apache.hadoop.hbase.io.hfile.TestChecksum
Tests run: 3, Failures: 0, Errors: 0, Skipped: 0, Time elapsed: 1.242 sec - in org.apache.hadoop.hbase.io.hfile.TestChecksum
Running org.apache.hadoop.hbase.io.hfile.TestScannerSelectionUsingKeyRange
Tests run: 3, Failures: 0, Errors: 0, Skipped: 0, Time elapsed: 1.729 sec - in org.apache.hadoop.hbase.io.hfile.TestScannerSelectionUsingKeyRange
Running org.apache.hadoop.hbase.io.hfile.TestFixedFileTrailer
Tests run: 4, Failures: 0, Errors: 0, Skipped: 0, Time elapsed: 0.834 sec - in org.apache.hadoop.hbase.io.hfile.TestFixedFileTrailer
Running org.apache.hadoop.hbase.io.hfile.TestLruCachedBlock
Tests run: 1, Failures: 0, Errors: 0, Skipped: 0, Time elapsed: 0.487 sec - in org.apache.hadoop.hbase.io.hfile.TestLruCachedBlock
Running org.apache.hadoop.hbase.io.hfile.TestHFileDataBlockEncoder
Tests run: 30, Failures: 0, Errors: 0, Skipped: 0, Time elapsed: 1.667 sec - in org.apache.hadoop.hbase.io.hfile.TestHFileDataBlockEncoder
Running org.apache.hadoop.hbase.io.hfile.TestPrefetch
Tests run: 1, Failures: 0, Errors: 0, Skipped: 0, Time elapsed: 2.973 sec - in org.apache.hadoop.hbase.io.hfile.TestPrefetch
Running org.apache.hadoop.hbase.io.hfile.TestHFileEncryption
Tests run: 3, Failures: 0, Errors: 0, Skipped: 0, Time elapsed: 3.82 sec - in org.apache.hadoop.hbase.io.hfile.TestHFileEncryption
Running org.apache.hadoop.hbase.io.hfile.TestHFile
Tests run: 7, Failures: 0, Errors: 0, Skipped: 0, Time elapsed: 0.79 sec - in org.apache.hadoop.hbase.io.hfile.TestHFile
Running org.apache.hadoop.hbase.io.hfile.TestReseekTo
Tests run: 1, Failures: 0, Errors: 0, Skipped: 0, Time elapsed: 1.193 sec - in org.apache.hadoop.hbase.io.hfile.TestReseekTo
Running org.apache.hadoop.hbase.io.hfile.TestHFileInlineToRootChunkConversion
Tests run: 1, Failures: 0, Errors: 0, Skipped: 0, Time elapsed: 0.859 sec - in org.apache.hadoop.hbase.io.hfile.TestHFileInlineToRootChunkConversion
Running org.apache.hadoop.hbase.io.hfile.bucket.TestByteBufferIOEngine
Tests run: 1, Failures: 0, Errors: 0, Skipped: 0, Time elapsed: 0.406 sec - in org.apache.hadoop.hbase.io.hfile.bucket.TestByteBufferIOEngine
Running org.apache.hadoop.hbase.io.hfile.bucket.TestFileIOEngine
Tests run: 1, Failures: 0, Errors: 0, Skipped: 0, Time elapsed: 0.335 sec - in org.apache.hadoop.hbase.io.hfile.bucket.TestFileIOEngine
Running org.apache.hadoop.hbase.io.hfile.bucket.TestBucketWriterThread
Tests run: 4, Failures: 0, Errors: 0, Skipped: 0, Time elapsed: 0.797 sec - in org.apache.hadoop.hbase.io.hfile.bucket.TestBucketWriterThread
Running org.apache.hadoop.hbase.io.hfile.bucket.TestBucketCache
Tests run: 10, Failures: 0, Errors: 0, Skipped: 0, Time elapsed: 9.332 sec - in org.apache.hadoop.hbase.io.hfile.bucket.TestBucketCache
Running org.apache.hadoop.hbase.io.hfile.TestHFileWriterV3
Tests run: 4, Failures: 0, Errors: 0, Skipped: 0, Time elapsed: 3.064 sec - in org.apache.hadoop.hbase.io.hfile.TestHFileWriterV3
Running org.apache.hadoop.hbase.io.hfile.TestCachedBlockQueue
Tests run: 2, Failures: 0, Errors: 0, Skipped: 0, Time elapsed: 0.337 sec - in org.apache.hadoop.hbase.io.hfile.TestCachedBlockQueue
Running org.apache.hadoop.hbase.io.hfile.TestHFileBlockCompatibility
Tests run: 16, Failures: 0, Errors: 0, Skipped: 0, Time elapsed: 2.383 sec - in org.apache.hadoop.hbase.io.hfile.TestHFileBlockCompatibility
Running org.apache.hadoop.hbase.io.hfile.TestLazyDataBlockDecompression
Tests run: 2, Failures: 0, Errors: 0, Skipped: 0, Time elapsed: 1.356 sec - in org.apache.hadoop.hbase.io.hfile.TestLazyDataBlockDecompression
Running org.apache.hadoop.hbase.io.hfile.TestBlockCacheReporting
Tests run: 2, Failures: 0, Errors: 0, Skipped: 0, Time elapsed: 0.805 sec - in org.apache.hadoop.hbase.io.hfile.TestBlockCacheReporting
Running org.apache.hadoop.hbase.io.hfile.TestLruBlockCache
Tests run: 9, Failures: 0, Errors: 0, Skipped: 0, Time elapsed: 1.082 sec - in org.apache.hadoop.hbase.io.hfile.TestLruBlockCache
Running org.apache.hadoop.hbase.io.hfile.TestSeekTo
Tests run: 20, Failures: 0, Errors: 0, Skipped: 0, Time elapsed: 2.142 sec - in org.apache.hadoop.hbase.io.hfile.TestSeekTo
Running org.apache.hadoop.hbase.io.hfile.TestHFileWriterV2
Tests run: 2, Failures: 0, Errors: 0, Skipped: 0, Time elapsed: 1.993 sec - in org.apache.hadoop.hbase.io.hfile.TestHFileWriterV2
Running org.apache.hadoop.hbase.io.TestHalfStoreFileReader
Tests run: 2, Failures: 0, Errors: 0, Skipped: 0, Time elapsed: 1.16 sec - in org.apache.hadoop.hbase.io.TestHalfStoreFileReader
Running org.apache.hadoop.hbase.io.encoding.TestPrefixTree
Tests run: 2, Failures: 0, Errors: 0, Skipped: 0, Time elapsed: 1.727 sec - in org.apache.hadoop.hbase.io.encoding.TestPrefixTree
Running org.apache.hadoop.hbase.io.encoding.TestSeekBeforeWithReverseScan
Tests run: 2, Failures: 0, Errors: 0, Skipped: 0, Time elapsed: 1.647 sec - in org.apache.hadoop.hbase.io.encoding.TestSeekBeforeWithReverseScan
Running org.apache.hadoop.hbase.io.encoding.TestPrefixTreeEncoding
Tests run: 8, Failures: 0, Errors: 0, Skipped: 0, Time elapsed: 1.218 sec - in org.apache.hadoop.hbase.io.encoding.TestPrefixTreeEncoding
Running org.apache.hadoop.hbase.io.encoding.TestSeekToBlockWithEncoders
Tests run: 9, Failures: 0, Errors: 0, Skipped: 0, Time elapsed: 0.835 sec - in org.apache.hadoop.hbase.io.encoding.TestSeekToBlockWithEncoders
Running org.apache.hadoop.hbase.io.TestHeapSize
Tests run: 3, Failures: 0, Errors: 0, Skipped: 0, Time elapsed: 0.387 sec - in org.apache.hadoop.hbase.io.TestHeapSize
Running org.apache.hadoop.hbase.TestIPv6NIOServerSocketChannel
Tests run: 2, Failures: 0, Errors: 0, Skipped: 0, Time elapsed: 0.55 sec - in org.apache.hadoop.hbase.TestIPv6NIOServerSocketChannel
Running org.apache.hadoop.hbase.protobuf.TestProtobufUtil
Tests run: 7, Failures: 0, Errors: 0, Skipped: 0, Time elapsed: 1.125 sec - in org.apache.hadoop.hbase.protobuf.TestProtobufUtil
Running org.apache.hadoop.hbase.protobuf.TestReplicationProtobuf
Tests run: 1, Failures: 0, Errors: 0, Skipped: 0, Time elapsed: 0.334 sec - in org.apache.hadoop.hbase.protobuf.TestReplicationProtobuf
Running org.apache.hadoop.hbase.filter.TestRegexComparator
Tests run: 3, Failures: 0, Errors: 0, Skipped: 0, Time elapsed: 0.592 sec - in org.apache.hadoop.hbase.filter.TestRegexComparator
Running org.apache.hadoop.hbase.filter.TestFilter
Tests run: 21, Failures: 0, Errors: 0, Skipped: 0, Time elapsed: 4.902 sec - in org.apache.hadoop.hbase.filter.TestFilter
Running org.apache.hadoop.hbase.filter.TestBitComparator
Tests run: 6, Failures: 0, Errors: 0, Skipped: 0, Time elapsed: 0.452 sec - in org.apache.hadoop.hbase.filter.TestBitComparator
Running org.apache.hadoop.hbase.filter.TestColumnPrefixFilter
Tests run: 2, Failures: 0, Errors: 0, Skipped: 0, Time elapsed: 3.753 sec - in org.apache.hadoop.hbase.filter.TestColumnPrefixFilter
Running org.apache.hadoop.hbase.filter.TestSingleColumnValueExcludeFilter
Tests run: 1, Failures: 0, Errors: 0, Skipped: 0, Time elapsed: 0.247 sec - in org.apache.hadoop.hbase.filter.TestSingleColumnValueExcludeFilter
Running org.apache.hadoop.hbase.filter.TestSingleColumnValueFilter
Tests run: 3, Failures: 0, Errors: 0, Skipped: 0, Time elapsed: 0.892 sec - in org.apache.hadoop.hbase.filter.TestSingleColumnValueFilter
Running org.apache.hadoop.hbase.filter.TestRandomRowFilter
Tests run: 2, Failures: 0, Errors: 0, Skipped: 0, Time elapsed: 0.637 sec - in org.apache.hadoop.hbase.filter.TestRandomRowFilter
Running org.apache.hadoop.hbase.filter.TestFirstKeyValueMatchingQualifiersFilter
Tests run: 1, Failures: 0, Errors: 0, Skipped: 0, Time elapsed: 0.244 sec - in org.apache.hadoop.hbase.filter.TestFirstKeyValueMatchingQualifiersFilter
Running org.apache.hadoop.hbase.filter.TestFilterList
Tests run: 7, Failures: 0, Errors: 0, Skipped: 0, Time elapsed: 1.005 sec - in org.apache.hadoop.hbase.filter.TestFilterList
Running org.apache.hadoop.hbase.filter.TestFuzzyRowFilter
Tests run: 6, Failures: 0, Errors: 0, Skipped: 0, Time elapsed: 0.519 sec - in org.apache.hadoop.hbase.filter.TestFuzzyRowFilter
Running org.apache.hadoop.hbase.filter.TestParseFilter
Tests run: 34, Failures: 0, Errors: 0, Skipped: 0, Time elapsed: 1.443 sec - in org.apache.hadoop.hbase.filter.TestParseFilter
Running org.apache.hadoop.hbase.filter.TestPageFilter
Tests run: 2, Failures: 0, Errors: 0, Skipped: 0, Time elapsed: 0.353 sec - in org.apache.hadoop.hbase.filter.TestPageFilter
Running org.apache.hadoop.hbase.filter.TestDependentColumnFilter
Tests run: 4, Failures: 0, Errors: 0, Skipped: 0, Time elapsed: 1.799 sec - in org.apache.hadoop.hbase.filter.TestDependentColumnFilter
Running org.apache.hadoop.hbase.filter.TestInclusiveStopFilter
Tests run: 2, Failures: 0, Errors: 0, Skipped: 0, Time elapsed: 0.279 sec - in org.apache.hadoop.hbase.filter.TestInclusiveStopFilter
Running org.apache.hadoop.hbase.filter.TestMultipleColumnPrefixFilter
Tests run: 3, Failures: 0, Errors: 0, Skipped: 0, Time elapsed: 4.953 sec - in org.apache.hadoop.hbase.filter.TestMultipleColumnPrefixFilter
Running org.apache.hadoop.hbase.filter.TestFilterSerialization
Tests run: 25, Failures: 0, Errors: 0, Skipped: 0, Time elapsed: 1.765 sec - in org.apache.hadoop.hbase.filter.TestFilterSerialization
Running org.apache.hadoop.hbase.filter.TestPrefixFilter
Tests run: 3, Failures: 0, Errors: 0, Skipped: 0, Time elapsed: 0.31 sec - in org.apache.hadoop.hbase.filter.TestPrefixFilter
Running org.apache.hadoop.hbase.filter.TestNullComparator
Tests run: 3, Failures: 0, Errors: 0, Skipped: 0, Time elapsed: 0.36 sec - in org.apache.hadoop.hbase.filter.TestNullComparator
Running org.apache.hadoop.hbase.filter.TestComparatorSerialization
Tests run: 6, Failures: 0, Errors: 0, Skipped: 0, Time elapsed: 1.087 sec - in org.apache.hadoop.hbase.filter.TestComparatorSerialization
Running org.apache.hadoop.hbase.filter.TestColumnPaginationFilter
Tests run: 1, Failures: 0, Errors: 0, Skipped: 0, Time elapsed: 0.778 sec - in org.apache.hadoop.hbase.filter.TestColumnPaginationFilter
Running org.apache.hadoop.hbase.filter.TestInvocationRecordFilter
Tests run: 1, Failures: 0, Errors: 0, Skipped: 0, Time elapsed: 1.467 sec - in org.apache.hadoop.hbase.filter.TestInvocationRecordFilter
Results :
Tests run: 869, Failures: 0, Errors: 0, Skipped: 7
[INFO] ------------------------------------------------------------------------
[INFO] Reactor Summary:
[INFO]
[INFO] Apache HBase ...................................... SUCCESS [4.249s]
[INFO] Apache HBase - Checkstyle ......................... SUCCESS [0.684s]
[INFO] Apache HBase - Resource Bundle .................... SUCCESS [0.181s]
[INFO] Apache HBase - Annotations ........................ SUCCESS [0.932s]
[INFO] Apache HBase - Common ............................. SUCCESS [54.943s]
[INFO] Apache HBase - Protocol ........................... SUCCESS [9.543s]
[INFO] Apache HBase - Client ............................. SUCCESS [1:19.919s]
[INFO] Apache HBase - Hadoop Compatibility ............... SUCCESS [7.147s]
[INFO] Apache HBase - Hadoop Two Compatibility ........... SUCCESS [6.453s]
[INFO] Apache HBase - Prefix Tree ........................ SUCCESS [8.638s]
[INFO] Apache HBase - Server ............................. FAILURE [11:49.227s]
[INFO] Apache HBase - Testing Util ....................... SKIPPED
[INFO] Apache HBase - Thrift ............................. SKIPPED
[INFO] Apache HBase - Rest ............................... SKIPPED
[INFO] Apache HBase - Shell .............................. SKIPPED
[INFO] Apache HBase - Integration Tests .................. SKIPPED
[INFO] Apache HBase - Examples ........................... SKIPPED
[INFO] Apache HBase - Assembly ........................... SKIPPED
[INFO] ------------------------------------------------------------------------
[INFO] BUILD FAILURE
[INFO] ------------------------------------------------------------------------
[INFO] Total time: 14:43.893s
[INFO] Finished at: Mon Aug 31 16:55:43 UTC 2015
[INFO] Final Memory: 73M/703M
[INFO] ------------------------------------------------------------------------
[ERROR] Failed to execute goal org.apache.maven.plugins:maven-surefire-plugin:2.18:test (default-test) on project hbase-server: ExecutionException: java.lang.RuntimeException: The forked VM terminated without properly saying goodbye. VM crash or System.exit called?
[ERROR] Command was /bin/sh -c cd <https://builds.apache.org/job/HBase-1.0/ws/hbase-server> && /home/jenkins/tools/java/jdk1.7.0_25-32/jre/bin/java -enableassertions -XX:MaxDirectMemorySize=1G -Xmx2800m -XX:MaxPermSize=256m -Djava.security.egd=file:/dev/./urandom -Djava.net.preferIPv4Stack=true -Djava.awt.headless=true -jar <https://builds.apache.org/job/HBase-1.0/ws/hbase-server/target/surefire/surefirebooter2549368425194454382.jar> <https://builds.apache.org/job/HBase-1.0/ws/hbase-server/target/surefire/surefire1319569053258007098tmp> <https://builds.apache.org/job/HBase-1.0/ws/hbase-server/target/surefire/surefire_5485644874639789933672tmp>
[ERROR] -> [Help 1]
[ERROR]
[ERROR] To see the full stack trace of the errors, re-run Maven with the -e switch.
[ERROR] Re-run Maven using the -X switch to enable full debug logging.
[ERROR]
[ERROR] For more information about the errors and possible solutions, please read the following articles:
[ERROR] [Help 1] http://cwiki.apache.org/confluence/display/MAVEN/MojoFailureException
[ERROR]
[ERROR] After correcting the problems, you can resume the build with the command
[ERROR] mvn <goals> -rf :hbase-server
Build step 'Invoke top-level Maven targets' marked build as failure
Performing Post build task...
Match found for :.* : True
Logical operation result is TRUE
Running script : ZOMBIE_TESTS_COUNT=`jps | grep surefirebooter | wc -l`
if [[ $ZOMBIE_TESTS_COUNT != 0 ]] ; then
#It seems sometimes the tests are not dying immediately. Let's give them 10s
echo "Suspicious java process found - waiting 10s to see if there are just slow to stop"
sleep 10
ZOMBIE_TESTS_COUNT=`jps | grep surefirebooter | wc -l`
if [[ $ZOMBIE_TESTS_COUNT != 0 ]] ; then
echo "There are $ZOMBIE_TESTS_COUNT zombie tests, they should have been killed by surefire but survived"
echo "************ BEGIN zombies jstack extract"
ZB_STACK=`jps | grep surefirebooter | cut -d ' ' -f 1 | xargs -n 1 jstack | grep ".test" | grep "\.java"`
jps | grep surefirebooter | cut -d ' ' -f 1 | xargs -n 1 jstack
echo "************ END zombies jstack extract"
JIRA_COMMENT="$JIRA_COMMENT
{color:red}-1 core zombie tests{color}. There are ${ZOMBIE_TESTS_COUNT} zombie test(s): ${ZB_STACK}"
BAD=1
jps | grep surefirebooter | cut -d ' ' -f 1 | xargs kill -9
else
echo "We're ok: there is no zombie test, but some tests took some time to stop"
fi
else
echo "We're ok: there is no zombie test"
fi
[HBase-1.0] $ /bin/bash -xe /tmp/hudson1587177490277142719.sh
++ jps
++ grep surefirebooter
++ wc -l
+ ZOMBIE_TESTS_COUNT=0
+ [[ 0 != 0 ]]
+ echo 'We'\''re ok: there is no zombie test'
We're ok: there is no zombie test
POST BUILD TASK : SUCCESS
END OF POST BUILD TASK : 0
Archiving artifacts
Sending artifact delta relative to HBase-1.0 #1014
Archived 916 artifacts
Archive block size is 32768
Received 4 blocks and 34303889 bytes
Compression is 0.4%
Took 23 sec
Recording test results
Updating HBASE-14325
Build failed in Jenkins: HBase-1.0 #1034
Posted by Apache Jenkins Server <je...@builds.apache.org>.
See <https://builds.apache.org/job/HBase-1.0/1034/changes>
Changes:
[larsh] HBASE-14315 Save one call to KeyValueHeap.peek per row.
------------------------------------------
[...truncated 1909 lines...]
Tests run: 1, Failures: 0, Errors: 0, Skipped: 0, Time elapsed: 13.242 sec - in org.apache.hadoop.hbase.security.token.TestZKSecretWatcher
Running org.apache.hadoop.hbase.security.token.TestTokenAuthentication
Tests run: 3, Failures: 0, Errors: 0, Skipped: 0, Time elapsed: 0.523 sec - in org.apache.hadoop.hbase.security.token.TestTokenAuthentication
Tests run: 5, Failures: 0, Errors: 0, Skipped: 0, Time elapsed: 27.484 sec - in org.apache.hadoop.hbase.security.access.TestAccessController2
Running org.apache.hadoop.hbase.security.visibility.TestEnforcingScanLabelGenerator
Running org.apache.hadoop.hbase.security.visibility.TestVisibilityWithCheckAuths
Tests run: 1, Failures: 0, Errors: 0, Skipped: 0, Time elapsed: 2.432 sec - in org.apache.hadoop.hbase.security.visibility.TestEnforcingScanLabelGenerator
Tests run: 2, Failures: 0, Errors: 0, Skipped: 0, Time elapsed: 3.474 sec - in org.apache.hadoop.hbase.security.visibility.TestVisibilityWithCheckAuths
Running org.apache.hadoop.hbase.security.visibility.TestVisibilityLabelsWithSLGStack
Tests run: 1, Failures: 0, Errors: 0, Skipped: 0, Time elapsed: 2.107 sec - in org.apache.hadoop.hbase.security.visibility.TestVisibilityLabelsWithSLGStack
Running org.apache.hadoop.hbase.security.visibility.TestVisibilityLabelsWithACL
Tests run: 5, Failures: 0, Errors: 0, Skipped: 0, Time elapsed: 6.839 sec - in org.apache.hadoop.hbase.security.visibility.TestVisibilityLabelsWithACL
Running org.apache.hadoop.hbase.security.visibility.TestVisibilityLablesWithGroups
Tests run: 1, Failures: 0, Errors: 0, Skipped: 0, Time elapsed: 3.405 sec - in org.apache.hadoop.hbase.security.visibility.TestVisibilityLablesWithGroups
Running org.apache.hadoop.hbase.security.visibility.TestWithDisabledAuthorization
Tests run: 2, Failures: 0, Errors: 0, Skipped: 0, Time elapsed: 2.95 sec - in org.apache.hadoop.hbase.security.visibility.TestWithDisabledAuthorization
Running org.apache.hadoop.hbase.security.visibility.TestVisibilityLabelsOpWithDifferentUsersNoACL
Tests run: 1, Failures: 0, Errors: 0, Skipped: 0, Time elapsed: 2.392 sec - in org.apache.hadoop.hbase.security.visibility.TestVisibilityLabelsOpWithDifferentUsersNoACL
Running org.apache.hadoop.hbase.security.visibility.TestVisibilityLabelsWithDistributedLogReplay
Tests run: 54, Failures: 1, Errors: 0, Skipped: 0, Time elapsed: 89.685 sec <<< FAILURE! - in org.apache.hadoop.hbase.security.access.TestAccessController
testMergeRegions(org.apache.hadoop.hbase.security.access.TestAccessController) Time elapsed: 1.011 sec <<< FAILURE!
java.lang.AssertionError: Expected action to pass for user 'owner' but was denied
at org.junit.Assert.fail(Assert.java:88)
at org.apache.hadoop.hbase.security.access.SecureTestUtil.verifyAllowed(SecureTestUtil.java:168)
at org.apache.hadoop.hbase.security.access.SecureTestUtil.verifyAllowed(SecureTestUtil.java:176)
at org.apache.hadoop.hbase.security.access.TestAccessController.testMergeRegions(TestAccessController.java:687)
Running org.apache.hadoop.hbase.security.visibility.TestDefaultScanLabelGeneratorStack
Tests run: 1, Failures: 0, Errors: 0, Skipped: 0, Time elapsed: 2.459 sec - in org.apache.hadoop.hbase.security.visibility.TestDefaultScanLabelGeneratorStack
Running org.apache.hadoop.hbase.security.visibility.TestVisibilityLabelsWithDefaultVisLabelService
Tests run: 23, Failures: 0, Errors: 0, Skipped: 0, Time elapsed: 15.274 sec - in org.apache.hadoop.hbase.security.visibility.TestVisibilityLabelsWithDistributedLogReplay
Running org.apache.hadoop.hbase.security.visibility.TestVisibilityLabelsWithDeletes
Running org.apache.hadoop.hbase.security.visibility.TestVisibilityLabelsWithCustomVisLabService
Tests run: 23, Failures: 0, Errors: 0, Skipped: 0, Time elapsed: 17.994 sec - in org.apache.hadoop.hbase.security.visibility.TestVisibilityLabelsWithDefaultVisLabelService
Running org.apache.hadoop.hbase.security.visibility.TestVisibilityLabelsReplication
Tests run: 9, Failures: 0, Errors: 0, Skipped: 0, Time elapsed: 281.806 sec - in org.apache.hadoop.hbase.snapshot.TestExportSnapshot
Running org.apache.hadoop.hbase.security.visibility.TestVisibilityLabelReplicationWithExpAsString
Tests run: 19, Failures: 0, Errors: 0, Skipped: 0, Time elapsed: 15.391 sec - in org.apache.hadoop.hbase.security.visibility.TestVisibilityLabelsWithCustomVisLabService
Running org.apache.hadoop.hbase.fs.TestBlockReorder
Tests run: 1, Failures: 0, Errors: 0, Skipped: 0, Time elapsed: 18.212 sec - in org.apache.hadoop.hbase.security.visibility.TestVisibilityLabelReplicationWithExpAsString
Tests run: 1, Failures: 0, Errors: 0, Skipped: 0, Time elapsed: 19.545 sec - in org.apache.hadoop.hbase.security.visibility.TestVisibilityLabelsReplication
Tests run: 3, Failures: 0, Errors: 0, Skipped: 0, Time elapsed: 20.188 sec - in org.apache.hadoop.hbase.fs.TestBlockReorder
Running org.apache.hadoop.hbase.wal.TestWALFactory
Running org.apache.hadoop.hbase.TestInfoServers
Tests run: 3, Failures: 0, Errors: 0, Skipped: 0, Time elapsed: 1.813 sec - in org.apache.hadoop.hbase.TestInfoServers
Running org.apache.hadoop.hbase.wal.TestWALReaderOnSecureWAL
Running org.apache.hadoop.hbase.wal.TestDefaultWALProviderWithHLogKey
Tests run: 2, Failures: 0, Errors: 0, Skipped: 0, Time elapsed: 1.854 sec - in org.apache.hadoop.hbase.wal.TestWALReaderOnSecureWAL
Running org.apache.hadoop.hbase.wal.TestSecureWAL
Tests run: 39, Failures: 0, Errors: 0, Skipped: 0, Time elapsed: 52.538 sec - in org.apache.hadoop.hbase.security.visibility.TestVisibilityLabelsWithDeletes
Tests run: 1, Failures: 0, Errors: 0, Skipped: 0, Time elapsed: 1.423 sec - in org.apache.hadoop.hbase.wal.TestSecureWAL
Tests run: 9, Failures: 0, Errors: 0, Skipped: 0, Time elapsed: 286.073 sec - in org.apache.hadoop.hbase.snapshot.TestSecureExportSnapshot
Running org.apache.hadoop.hbase.wal.TestWALFiltering
Tests run: 5, Failures: 0, Errors: 0, Skipped: 0, Time elapsed: 6.952 sec - in org.apache.hadoop.hbase.wal.TestDefaultWALProviderWithHLogKey
Running org.apache.hadoop.hbase.wal.TestWALSplit
Running org.apache.hadoop.hbase.wal.TestBoundedRegionGroupingProvider
Tests run: 9, Failures: 0, Errors: 0, Skipped: 0, Time elapsed: 15.897 sec - in org.apache.hadoop.hbase.wal.TestWALFactory
Running org.apache.hadoop.hbase.wal.TestDefaultWALProvider
Running org.apache.hadoop.hbase.wal.TestWALSplitCompressed
Tests run: 5, Failures: 0, Errors: 0, Skipped: 0, Time elapsed: 7.502 sec - in org.apache.hadoop.hbase.wal.TestDefaultWALProvider
Tests run: 5, Failures: 0, Errors: 0, Skipped: 0, Time elapsed: 20.415 sec - in org.apache.hadoop.hbase.wal.TestBoundedRegionGroupingProvider
Running org.apache.hadoop.hbase.backup.TestHFileArchiving
Tests run: 1, Failures: 0, Errors: 0, Skipped: 0, Time elapsed: 25.586 sec - in org.apache.hadoop.hbase.wal.TestWALFiltering
Running org.apache.hadoop.hbase.backup.example.TestZooKeeperTableArchiveClient
Running org.apache.hadoop.hbase.zookeeper.TestHQuorumPeer
Tests run: 3, Failures: 0, Errors: 0, Skipped: 0, Time elapsed: 1.086 sec - in org.apache.hadoop.hbase.zookeeper.TestHQuorumPeer
Running org.apache.hadoop.hbase.zookeeper.lock.TestZKInterProcessReadWriteLock
Tests run: 3, Failures: 0, Errors: 0, Skipped: 0, Time elapsed: 3.85 sec - in org.apache.hadoop.hbase.backup.example.TestZooKeeperTableArchiveClient
Running org.apache.hadoop.hbase.zookeeper.TestZKTableStateManager
Tests run: 1, Failures: 0, Errors: 0, Skipped: 0, Time elapsed: 0.7 sec - in org.apache.hadoop.hbase.zookeeper.TestZKTableStateManager
Running org.apache.hadoop.hbase.zookeeper.TestRecoverableZooKeeper
Tests run: 1, Failures: 0, Errors: 0, Skipped: 0, Time elapsed: 1.262 sec - in org.apache.hadoop.hbase.zookeeper.TestRecoverableZooKeeper
Running org.apache.hadoop.hbase.zookeeper.TestZKLeaderManager
Tests run: 1, Failures: 0, Errors: 0, Skipped: 0, Time elapsed: 0.127 sec - in org.apache.hadoop.hbase.zookeeper.TestZKLeaderManager
Running org.apache.hadoop.hbase.zookeeper.TestZooKeeperACL
Tests run: 6, Failures: 0, Errors: 0, Skipped: 0, Time elapsed: 0.27 sec - in org.apache.hadoop.hbase.zookeeper.TestZooKeeperACL
Running org.apache.hadoop.hbase.zookeeper.TestZooKeeperNodeTracker
Tests run: 3, Failures: 0, Errors: 0, Skipped: 0, Time elapsed: 0.839 sec - in org.apache.hadoop.hbase.zookeeper.TestZooKeeperNodeTracker
Running org.apache.hadoop.hbase.zookeeper.TestZKMulti
Tests run: 12, Failures: 0, Errors: 0, Skipped: 0, Time elapsed: 1.49 sec - in org.apache.hadoop.hbase.zookeeper.TestZKMulti
Tests run: 6, Failures: 0, Errors: 0, Skipped: 0, Time elapsed: 24.487 sec - in org.apache.hadoop.hbase.zookeeper.lock.TestZKInterProcessReadWriteLock
Tests run: 5, Failures: 0, Errors: 0, Skipped: 0, Time elapsed: 40.701 sec - in org.apache.hadoop.hbase.backup.TestHFileArchiving
Running org.apache.hadoop.hbase.mapreduce.TestHLogRecordReader
Tests run: 2, Failures: 0, Errors: 0, Skipped: 0, Time elapsed: 0.864 sec - in org.apache.hadoop.hbase.mapreduce.TestHLogRecordReader
Running org.apache.hadoop.hbase.mapreduce.TestTableInputFormatScan2
Running org.apache.hadoop.hbase.mapreduce.TestTableMapReduce
Running org.apache.hadoop.hbase.mapreduce.TestImportExport
Tests run: 31, Failures: 0, Errors: 0, Skipped: 0, Time elapsed: 186.197 sec - in org.apache.hadoop.hbase.wal.TestWALSplit
Tests run: 31, Failures: 0, Errors: 0, Skipped: 0, Time elapsed: 190.872 sec - in org.apache.hadoop.hbase.wal.TestWALSplitCompressed
Running org.apache.hadoop.hbase.mapreduce.TestWALPlayer
Running org.apache.hadoop.hbase.mapreduce.TestCopyTable
Tests run: 2, Failures: 0, Errors: 0, Skipped: 0, Time elapsed: 155.001 sec - in org.apache.hadoop.hbase.mapreduce.TestTableMapReduce
Running org.apache.hadoop.hbase.mapreduce.TestImportTSVWithOperationAttributes
Tests run: 4, Failures: 0, Errors: 0, Skipped: 0, Time elapsed: 50.958 sec - in org.apache.hadoop.hbase.mapreduce.TestWALPlayer
Running org.apache.hadoop.hbase.mapreduce.TestRowCounter
Tests run: 7, Failures: 0, Errors: 0, Skipped: 0, Time elapsed: 238.029 sec - in org.apache.hadoop.hbase.mapreduce.TestTableInputFormatScan2
Tests run: 2, Failures: 0, Errors: 0, Skipped: 0, Time elapsed: 75.597 sec - in org.apache.hadoop.hbase.mapreduce.TestImportTSVWithOperationAttributes
Running org.apache.hadoop.hbase.mapreduce.TestImportTsv
Tests run: 5, Failures: 0, Errors: 0, Skipped: 0, Time elapsed: 117.904 sec - in org.apache.hadoop.hbase.mapreduce.TestCopyTable
Running org.apache.hadoop.hbase.mapreduce.TestLoadIncrementalHFilesUseSecurityEndPoint
Running org.apache.hadoop.hbase.mapreduce.TestSecureLoadIncrementalHFiles
Tests run: 16, Failures: 0, Errors: 0, Skipped: 0, Time elapsed: 55.599 sec - in org.apache.hadoop.hbase.mapreduce.TestLoadIncrementalHFilesUseSecurityEndPoint
Tests run: 16, Failures: 0, Errors: 0, Skipped: 0, Time elapsed: 62.163 sec - in org.apache.hadoop.hbase.mapreduce.TestSecureLoadIncrementalHFiles
Running org.apache.hadoop.hbase.mapreduce.TestTimeRangeMapRed
Running org.apache.hadoop.hbase.mapreduce.TestTableInputFormat
Tests run: 12, Failures: 0, Errors: 0, Skipped: 0, Time elapsed: 370.355 sec - in org.apache.hadoop.hbase.mapreduce.TestImportExport
Running org.apache.hadoop.hbase.mapreduce.TestTableSnapshotInputFormat
Tests run: 1, Failures: 0, Errors: 0, Skipped: 0, Time elapsed: 51.65 sec - in org.apache.hadoop.hbase.mapreduce.TestTimeRangeMapRed
Tests run: 6, Failures: 0, Errors: 0, Skipped: 0, Time elapsed: 187.794 sec - in org.apache.hadoop.hbase.mapreduce.TestRowCounter
Running org.apache.hadoop.hbase.mapreduce.TestLoadIncrementalHFiles
Running org.apache.hadoop.hbase.mapreduce.TestImportTSVWithTTLs
Tests run: 8, Failures: 0, Errors: 0, Skipped: 0, Time elapsed: 82.169 sec - in org.apache.hadoop.hbase.mapreduce.TestTableInputFormat
Running org.apache.hadoop.hbase.mapreduce.TestHRegionPartitioner
Tests run: 1, Failures: 0, Errors: 0, Skipped: 0, Time elapsed: 2.49 sec - in org.apache.hadoop.hbase.mapreduce.TestHRegionPartitioner
Tests run: 1, Failures: 0, Errors: 0, Skipped: 0, Time elapsed: 39.761 sec - in org.apache.hadoop.hbase.mapreduce.TestImportTSVWithTTLs
Running org.apache.hadoop.hbase.mapreduce.TestLoadIncrementalHFilesSplitRecovery
Tests run: 16, Failures: 0, Errors: 0, Skipped: 0, Time elapsed: 57.196 sec - in org.apache.hadoop.hbase.mapreduce.TestLoadIncrementalHFiles
Running org.apache.hadoop.hbase.mapreduce.TestHFileOutputFormat
Tests run: 10, Failures: 0, Errors: 0, Skipped: 0, Time elapsed: 217.443 sec - in org.apache.hadoop.hbase.mapreduce.TestImportTsv
Tests run: 5, Failures: 0, Errors: 0, Skipped: 0, Time elapsed: 15.994 sec - in org.apache.hadoop.hbase.mapreduce.TestLoadIncrementalHFilesSplitRecovery
Running org.apache.hadoop.hbase.mapreduce.TestHFileOutputFormat2
Running org.apache.hadoop.hbase.mapreduce.TestImportTSVWithVisibilityLabels
Running org.apache.hadoop.hbase.mapreduce.TestMultithreadedTableMapper
Tests run: 1, Failures: 0, Errors: 0, Skipped: 0, Time elapsed: 100.158 sec - in org.apache.hadoop.hbase.mapreduce.TestMultithreadedTableMapper
Running org.apache.hadoop.hbase.mapreduce.TestTableInputFormatScan1
Tests run: 5, Failures: 0, Errors: 0, Skipped: 0, Time elapsed: 170.083 sec - in org.apache.hadoop.hbase.mapreduce.TestImportTSVWithVisibilityLabels
Running org.apache.hadoop.hbase.mapreduce.TestCellCounter
Tests run: 8, Failures: 0, Errors: 0, Skipped: 0, Time elapsed: 295.311 sec - in org.apache.hadoop.hbase.mapreduce.TestTableSnapshotInputFormat
Running org.apache.hadoop.hbase.mapreduce.TestWALRecordReader
Tests run: 2, Failures: 0, Errors: 0, Skipped: 0, Time elapsed: 0.776 sec - in org.apache.hadoop.hbase.mapreduce.TestWALRecordReader
Running org.apache.hadoop.hbase.mapreduce.TestMultiTableInputFormat
Tests run: 13, Failures: 0, Errors: 0, Skipped: 1, Time elapsed: 263.982 sec - in org.apache.hadoop.hbase.mapreduce.TestHFileOutputFormat
Running org.apache.hadoop.hbase.mapreduce.TestSecureLoadIncrementalHFilesSplitRecovery
Tests run: 13, Failures: 0, Errors: 0, Skipped: 1, Time elapsed: 275.357 sec - in org.apache.hadoop.hbase.mapreduce.TestHFileOutputFormat2
Tests run: 5, Failures: 0, Errors: 0, Skipped: 0, Time elapsed: 16.171 sec - in org.apache.hadoop.hbase.mapreduce.TestSecureLoadIncrementalHFilesSplitRecovery
Running org.apache.hadoop.hbase.filter.TestScanRowPrefix
Tests run: 1, Failures: 0, Errors: 0, Skipped: 0, Time elapsed: 3.354 sec - in org.apache.hadoop.hbase.filter.TestScanRowPrefix
Running org.apache.hadoop.hbase.filter.TestFilterWithScanLimits
Tests run: 1, Failures: 0, Errors: 0, Skipped: 0, Time elapsed: 2.005 sec - in org.apache.hadoop.hbase.filter.TestFilterWithScanLimits
Running org.apache.hadoop.hbase.filter.TestFuzzyRowAndColumnRangeFilter
Tests run: 1, Failures: 0, Errors: 0, Skipped: 0, Time elapsed: 2.701 sec - in org.apache.hadoop.hbase.filter.TestFuzzyRowAndColumnRangeFilter
Running org.apache.hadoop.hbase.filter.TestColumnRangeFilter
Running org.apache.hadoop.hbase.filter.TestFilterWrapper
Tests run: 1, Failures: 0, Errors: 0, Skipped: 0, Time elapsed: 2.283 sec - in org.apache.hadoop.hbase.filter.TestFilterWrapper
Tests run: 1, Failures: 0, Errors: 0, Skipped: 0, Time elapsed: 13.393 sec - in org.apache.hadoop.hbase.filter.TestColumnRangeFilter
Running org.apache.hadoop.hbase.filter.TestFuzzyRowFilterEndToEnd
Running org.apache.hadoop.hbase.TestMetaTableAccessor
Tests run: 10, Failures: 0, Errors: 0, Skipped: 0, Time elapsed: 9.056 sec - in org.apache.hadoop.hbase.TestMetaTableAccessor
Tests run: 7, Failures: 0, Errors: 0, Skipped: 0, Time elapsed: 218.1 sec - in org.apache.hadoop.hbase.mapreduce.TestTableInputFormatScan1
Tests run: 7, Failures: 0, Errors: 0, Skipped: 0, Time elapsed: 190.306 sec - in org.apache.hadoop.hbase.mapreduce.TestCellCounter
Tests run: 4, Failures: 0, Errors: 0, Skipped: 0, Time elapsed: 162.289 sec - in org.apache.hadoop.hbase.mapreduce.TestMultiTableInputFormat
Tests run: 2, Failures: 0, Errors: 0, Skipped: 0, Time elapsed: 258.766 sec - in org.apache.hadoop.hbase.filter.TestFuzzyRowFilterEndToEnd
Results :
Failed tests:
TestAccessController.testMergeRegions:687->SecureTestUtil.verifyAllowed:176->SecureTestUtil.verifyAllowed:168 Expected action to pass for user 'owner' but was denied
Tests run: 2405, Failures: 1, Errors: 0, Skipped: 18
[INFO] ------------------------------------------------------------------------
[INFO] Reactor Summary:
[INFO]
[INFO] Apache HBase ...................................... SUCCESS [3.311s]
[INFO] Apache HBase - Checkstyle ......................... SUCCESS [0.625s]
[INFO] Apache HBase - Resource Bundle .................... SUCCESS [0.224s]
[INFO] Apache HBase - Annotations ........................ SUCCESS [0.853s]
[INFO] Apache HBase - Common ............................. SUCCESS [55.983s]
[INFO] Apache HBase - Protocol ........................... SUCCESS [9.335s]
[INFO] Apache HBase - Client ............................. SUCCESS [1:20.051s]
[INFO] Apache HBase - Hadoop Compatibility ............... SUCCESS [7.216s]
[INFO] Apache HBase - Hadoop Two Compatibility ........... SUCCESS [6.635s]
[INFO] Apache HBase - Prefix Tree ........................ SUCCESS [8.624s]
[INFO] Apache HBase - Server ............................. FAILURE [1:09:11.015s]
[INFO] Apache HBase - Testing Util ....................... SKIPPED
[INFO] Apache HBase - Thrift ............................. SKIPPED
[INFO] Apache HBase - Rest ............................... SKIPPED
[INFO] Apache HBase - Shell .............................. SKIPPED
[INFO] Apache HBase - Integration Tests .................. SKIPPED
[INFO] Apache HBase - Examples ........................... SKIPPED
[INFO] Apache HBase - Assembly ........................... SKIPPED
[INFO] ------------------------------------------------------------------------
[INFO] BUILD FAILURE
[INFO] ------------------------------------------------------------------------
[INFO] Total time: 1:12:05.424s
[INFO] Finished at: Fri Aug 28 23:52:49 UTC 2015
[INFO] Final Memory: 46M/868M
[INFO] ------------------------------------------------------------------------
[ERROR] Failed to execute goal org.apache.maven.plugins:maven-surefire-plugin:2.18:test (secondPartTestsExecution) on project hbase-server: There are test failures.
[ERROR]
[ERROR] Please refer to <https://builds.apache.org/job/HBase-1.0/ws/hbase-server/target/surefire-reports> for the individual test results.
[ERROR] -> [Help 1]
[ERROR]
[ERROR] To see the full stack trace of the errors, re-run Maven with the -e switch.
[ERROR] Re-run Maven using the -X switch to enable full debug logging.
[ERROR]
[ERROR] For more information about the errors and possible solutions, please read the following articles:
[ERROR] [Help 1] http://cwiki.apache.org/confluence/display/MAVEN/MojoFailureException
[ERROR]
[ERROR] After correcting the problems, you can resume the build with the command
[ERROR] mvn <goals> -rf :hbase-server
Build step 'Invoke top-level Maven targets' marked build as failure
Performing Post build task...
Match found for :.* : True
Logical operation result is TRUE
Running script : ZOMBIE_TESTS_COUNT=`jps | grep surefirebooter | wc -l`
if [[ $ZOMBIE_TESTS_COUNT != 0 ]] ; then
#It seems sometimes the tests are not dying immediately. Let's give them 10s
echo "Suspicious java process found - waiting 10s to see if there are just slow to stop"
sleep 10
ZOMBIE_TESTS_COUNT=`jps | grep surefirebooter | wc -l`
if [[ $ZOMBIE_TESTS_COUNT != 0 ]] ; then
echo "There are $ZOMBIE_TESTS_COUNT zombie tests, they should have been killed by surefire but survived"
echo "************ BEGIN zombies jstack extract"
ZB_STACK=`jps | grep surefirebooter | cut -d ' ' -f 1 | xargs -n 1 jstack | grep ".test" | grep "\.java"`
jps | grep surefirebooter | cut -d ' ' -f 1 | xargs -n 1 jstack
echo "************ END zombies jstack extract"
JIRA_COMMENT="$JIRA_COMMENT
{color:red}-1 core zombie tests{color}. There are ${ZOMBIE_TESTS_COUNT} zombie test(s): ${ZB_STACK}"
BAD=1
jps | grep surefirebooter | cut -d ' ' -f 1 | xargs kill -9
else
echo "We're ok: there is no zombie test, but some tests took some time to stop"
fi
else
echo "We're ok: there is no zombie test"
fi
[HBase-1.0] $ /bin/bash -xe /tmp/hudson7678285505275405077.sh
++ jps
++ grep surefirebooter
++ wc -l
+ ZOMBIE_TESTS_COUNT=0
+ [[ 0 != 0 ]]
+ echo 'We'\''re ok: there is no zombie test'
We're ok: there is no zombie test
POST BUILD TASK : SUCCESS
END OF POST BUILD TASK : 0
Archiving artifacts
Sending artifact delta relative to HBase-1.0 #1014
Archived 1931 artifacts
Archive block size is 32768
Received 28 blocks and 418156973 bytes
Compression is 0.2%
Took 1 min 48 sec
Recording test results
Updating HBASE-14315
Build failed in Jenkins: HBase-1.0 #1033
Posted by Apache Jenkins Server <je...@builds.apache.org>.
See <https://builds.apache.org/job/HBase-1.0/1033/changes>
Changes:
[eclark] HBASE-14313 After a Connection sees ConnectionClosingException it never recovers -- ADDENDUM
------------------------------------------
[...truncated 31540 lines...]
- locked <0x0000000648e2d168> (a java.util.Collections$UnmodifiableSet)
- locked <0x0000000648e2cf30> (a sun.nio.ch.EPollSelectorImpl)
at sun.nio.ch.SelectorImpl.select(SelectorImpl.java:97)
at sun.nio.ch.SelectorImpl.select(SelectorImpl.java:101)
at org.fusesource.hawtdispatch.internal.NioManager$SelectStrategy.select(NioManager.java:52)
at org.fusesource.hawtdispatch.internal.NioManager.select(NioManager.java:182)
at org.fusesource.hawtdispatch.internal.pool.SimplePool.park(SimplePool.java:130)
at org.fusesource.hawtdispatch.internal.pool.SimpleThread.run(SimpleThread.java:75)
"hawtdispatch-DEFAULT-4" #335556 daemon prio=5 os_prio=0 tid=0x00007ff7980d6800 nid=0x3e3d runnable [0x00007ffa731f0000]
java.lang.Thread.State: RUNNABLE
at sun.nio.ch.EPollArrayWrapper.epollWait(Native Method)
at sun.nio.ch.EPollArrayWrapper.poll(EPollArrayWrapper.java:269)
at sun.nio.ch.EPollSelectorImpl.doSelect(EPollSelectorImpl.java:79)
at sun.nio.ch.SelectorImpl.lockAndDoSelect(SelectorImpl.java:86)
- locked <0x0000000648dde900> (a sun.nio.ch.Util$2)
- locked <0x0000000648dde8f0> (a java.util.Collections$UnmodifiableSet)
- locked <0x0000000648dde8a8> (a sun.nio.ch.EPollSelectorImpl)
at sun.nio.ch.SelectorImpl.select(SelectorImpl.java:97)
at sun.nio.ch.SelectorImpl.select(SelectorImpl.java:101)
at org.fusesource.hawtdispatch.internal.NioManager$SelectStrategy.select(NioManager.java:52)
at org.fusesource.hawtdispatch.internal.NioManager.select(NioManager.java:182)
at org.fusesource.hawtdispatch.internal.pool.SimplePool.park(SimplePool.java:130)
at org.fusesource.hawtdispatch.internal.pool.SimpleThread.run(SimpleThread.java:75)
"hawtdispatch-DEFAULT-3" #335555 daemon prio=5 os_prio=0 tid=0x00007ff79808b800 nid=0x3e3c runnable [0x00007ffa601de000]
java.lang.Thread.State: RUNNABLE
at sun.nio.ch.NativeThread.current(Native Method)
at sun.nio.ch.SocketChannelImpl.read(SocketChannelImpl.java:326)
- locked <0x0000000648e84400> (a java.lang.Object)
- locked <0x0000000648db7078> (a java.lang.Object)
at org.fusesource.hawtdispatch.transport.AbstractProtocolCodec.read(AbstractProtocolCodec.java:326)
at org.fusesource.hawtdispatch.transport.TcpTransport.drainInbound(TcpTransport.java:706)
at org.fusesource.hawtdispatch.transport.TcpTransport$6.run(TcpTransport.java:588)
at org.fusesource.hawtdispatch.internal.NioDispatchSource$3.run(NioDispatchSource.java:209)
at org.fusesource.hawtdispatch.internal.SerialDispatchQueue.run(SerialDispatchQueue.java:100)
at org.fusesource.hawtdispatch.internal.pool.SimpleThread.run(SimpleThread.java:77)
"hawtdispatch-DEFAULT-2" #335554 daemon prio=5 os_prio=0 tid=0x00007ff798065800 nid=0x3e3b runnable [0x00007ffa635f4000]
java.lang.Thread.State: RUNNABLE
at sun.nio.ch.EPollArrayWrapper.interrupt(Native Method)
at sun.nio.ch.EPollArrayWrapper.interrupt(EPollArrayWrapper.java:317)
at sun.nio.ch.EPollSelectorImpl.wakeup(EPollSelectorImpl.java:193)
- locked <0x0000000648e919a8> (a java.lang.Object)
at org.fusesource.hawtdispatch.internal.NioManager.wakeupIfSelecting(NioManager.java:157)
at org.fusesource.hawtdispatch.internal.pool.SimplePool.execute(SimplePool.java:121)
at org.fusesource.hawtdispatch.internal.GlobalDispatchQueue.execute(GlobalDispatchQueue.java:100)
at org.fusesource.hawtdispatch.internal.SerialDispatchQueue.triggerExecution(SerialDispatchQueue.java:128)
at org.fusesource.hawtdispatch.internal.SerialDispatchQueue.enqueue(SerialDispatchQueue.java:75)
at org.fusesource.hawtdispatch.internal.SerialDispatchQueue.execute(SerialDispatchQueue.java:52)
at org.fusesource.hawtdispatch.internal.NioDispatchSource.fire(NioDispatchSource.java:204)
at org.fusesource.hawtdispatch.internal.NioAttachment.selected(NioAttachment.java:45)
at org.fusesource.hawtdispatch.internal.NioManager.processSelected(NioManager.java:217)
at org.fusesource.hawtdispatch.internal.NioManager.select(NioManager.java:193)
at org.fusesource.hawtdispatch.internal.pool.SimplePool.park(SimplePool.java:130)
at org.fusesource.hawtdispatch.internal.pool.SimpleThread.run(SimpleThread.java:75)
"hawtdispatch-DEFAULT-1" #335553 daemon prio=5 os_prio=0 tid=0x00007ff79806c800 nid=0x3e3a runnable [0x00007ffa6aaf8000]
java.lang.Thread.State: RUNNABLE
at sun.nio.ch.EPollArrayWrapper.epollWait(Native Method)
at sun.nio.ch.EPollArrayWrapper.poll(EPollArrayWrapper.java:269)
at sun.nio.ch.EPollSelectorImpl.doSelect(EPollSelectorImpl.java:79)
at sun.nio.ch.SelectorImpl.lockAndDoSelect(SelectorImpl.java:86)
- locked <0x0000000648e91778> (a sun.nio.ch.Util$2)
- locked <0x0000000648e91768> (a java.util.Collections$UnmodifiableSet)
- locked <0x0000000648e91530> (a sun.nio.ch.EPollSelectorImpl)
at sun.nio.ch.SelectorImpl.select(SelectorImpl.java:97)
at sun.nio.ch.SelectorImpl.select(SelectorImpl.java:101)
at org.fusesource.hawtdispatch.internal.NioManager$SelectStrategy.select(NioManager.java:52)
at org.fusesource.hawtdispatch.internal.NioManager.select(NioManager.java:182)
at org.fusesource.hawtdispatch.internal.pool.SimplePool.park(SimplePool.java:130)
at org.fusesource.hawtdispatch.internal.pool.SimpleThread.run(SimpleThread.java:75)
"threadDeathWatcher-2-1" #1301 daemon prio=1 os_prio=0 tid=0x00007ffacc3dd800 nid=0x7750 waiting on condition [0x00007ffa88cd3000]
java.lang.Thread.State: TIMED_WAITING (sleeping)
at java.lang.Thread.sleep(Native Method)
at io.netty.util.ThreadDeathWatcher$Watcher.run(ThreadDeathWatcher.java:137)
at io.netty.util.concurrent.DefaultThreadFactory$DefaultRunnableDecorator.run(DefaultThreadFactory.java:137)
at java.lang.Thread.run(Thread.java:745)
"Service Thread" #17 daemon prio=9 os_prio=0 tid=0x00007ffacc380000 nid=0x6c6b runnable [0x0000000000000000]
java.lang.Thread.State: RUNNABLE
"C1 CompilerThread11" #16 daemon prio=9 os_prio=0 tid=0x00007ffacc373000 nid=0x6c6a waiting on condition [0x0000000000000000]
java.lang.Thread.State: RUNNABLE
"C1 CompilerThread10" #15 daemon prio=9 os_prio=0 tid=0x00007ffacc371000 nid=0x6c69 waiting on condition [0x0000000000000000]
java.lang.Thread.State: RUNNABLE
"C1 CompilerThread9" #14 daemon prio=9 os_prio=0 tid=0x00007ffacc36f000 nid=0x6c68 waiting on condition [0x0000000000000000]
java.lang.Thread.State: RUNNABLE
"C1 CompilerThread8" #13 daemon prio=9 os_prio=0 tid=0x00007ffacc36d000 nid=0x6c67 waiting on condition [0x0000000000000000]
java.lang.Thread.State: RUNNABLE
"C2 CompilerThread7" #12 daemon prio=9 os_prio=0 tid=0x00007ffacc36b000 nid=0x6c66 waiting on condition [0x0000000000000000]
java.lang.Thread.State: RUNNABLE
"C2 CompilerThread6" #11 daemon prio=9 os_prio=0 tid=0x00007ffacc369000 nid=0x6c65 waiting on condition [0x0000000000000000]
java.lang.Thread.State: RUNNABLE
"C2 CompilerThread5" #10 daemon prio=9 os_prio=0 tid=0x00007ffacc366800 nid=0x6c64 waiting on condition [0x0000000000000000]
java.lang.Thread.State: RUNNABLE
"C2 CompilerThread4" #9 daemon prio=9 os_prio=0 tid=0x00007ffacc35c800 nid=0x6c63 waiting on condition [0x0000000000000000]
java.lang.Thread.State: RUNNABLE
"C2 CompilerThread3" #8 daemon prio=9 os_prio=0 tid=0x00007ffacc35a800 nid=0x6c62 waiting on condition [0x0000000000000000]
java.lang.Thread.State: RUNNABLE
"C2 CompilerThread2" #7 daemon prio=9 os_prio=0 tid=0x00007ffacc356000 nid=0x6c61 waiting on condition [0x0000000000000000]
java.lang.Thread.State: RUNNABLE
"C2 CompilerThread1" #6 daemon prio=9 os_prio=0 tid=0x00007ffacc354000 nid=0x6c60 waiting on condition [0x0000000000000000]
java.lang.Thread.State: RUNNABLE
"C2 CompilerThread0" #5 daemon prio=9 os_prio=0 tid=0x00007ffacc351000 nid=0x6c5f waiting on condition [0x0000000000000000]
java.lang.Thread.State: RUNNABLE
"Signal Dispatcher" #4 daemon prio=9 os_prio=0 tid=0x00007ffacc34f000 nid=0x6c5e runnable [0x0000000000000000]
java.lang.Thread.State: RUNNABLE
"Finalizer" #3 daemon prio=8 os_prio=0 tid=0x00007ffacc323800 nid=0x6c5d in Object.wait() [0x00007ffa915d4000]
java.lang.Thread.State: WAITING (on object monitor)
at java.lang.Object.wait(Native Method)
at java.lang.ref.ReferenceQueue.remove(ReferenceQueue.java:143)
- locked <0x000000064765ec80> (a java.lang.ref.ReferenceQueue$Lock)
at java.lang.ref.ReferenceQueue.remove(ReferenceQueue.java:164)
at java.lang.ref.Finalizer$FinalizerThread.run(Finalizer.java:209)
"Reference Handler" #2 daemon prio=10 os_prio=0 tid=0x00007ffacc321000 nid=0x6c5c in Object.wait() [0x00007ffa916d5000]
java.lang.Thread.State: WAITING (on object monitor)
at java.lang.Object.wait(Native Method)
at java.lang.Object.wait(Object.java:502)
at java.lang.ref.Reference$ReferenceHandler.run(Reference.java:157)
- locked <0x000000064765cb38> (a java.lang.ref.Reference$Lock)
"main" #1 prio=5 os_prio=0 tid=0x00007ffacc00a800 nid=0x6c48 waiting on condition [0x00007ffad3219000]
java.lang.Thread.State: TIMED_WAITING (parking)
at sun.misc.Unsafe.park(Native Method)
- parking to wait for <0x00000007a034ec28> (a java.util.concurrent.CountDownLatch$Sync)
at java.util.concurrent.locks.LockSupport.parkNanos(LockSupport.java:215)
at java.util.concurrent.locks.AbstractQueuedSynchronizer.doAcquireSharedNanos(AbstractQueuedSynchronizer.java:1037)
at java.util.concurrent.locks.AbstractQueuedSynchronizer.tryAcquireSharedNanos(AbstractQueuedSynchronizer.java:1328)
at java.util.concurrent.CountDownLatch.await(CountDownLatch.java:277)
at org.apache.activemq.artemis.tests.integration.xa.XaTimeoutTest.testTimeoutOnConsumerResend(XaTimeoutTest.java:453)
at sun.reflect.NativeMethodAccessorImpl.invoke0(Native Method)
at sun.reflect.NativeMethodAccessorImpl.invoke(NativeMethodAccessorImpl.java:62)
at sun.reflect.DelegatingMethodAccessorImpl.invoke(DelegatingMethodAccessorImpl.java:43)
at java.lang.reflect.Method.invoke(Method.java:497)
at org.junit.runners.model.FrameworkMethod$1.runReflectiveCall(FrameworkMethod.java:47)
at org.junit.internal.runners.model.ReflectiveCallable.run(ReflectiveCallable.java:12)
at org.junit.runners.model.FrameworkMethod.invokeExplosively(FrameworkMethod.java:44)
at org.junit.internal.runners.statements.InvokeMethod.evaluate(InvokeMethod.java:17)
at org.junit.internal.runners.statements.RunBefores.evaluate(RunBefores.java:26)
at org.junit.internal.runners.statements.RunAfters.evaluate(RunAfters.java:27)
at org.junit.rules.TestWatcher$1.evaluate(TestWatcher.java:55)
at org.junit.rules.ExternalResource$1.evaluate(ExternalResource.java:48)
at org.junit.rules.ExternalResource$1.evaluate(ExternalResource.java:48)
at org.junit.rules.TestWatcher$1.evaluate(TestWatcher.java:55)
at org.junit.rules.RunRules.evaluate(RunRules.java:20)
at org.junit.runners.ParentRunner.runLeaf(ParentRunner.java:271)
at org.junit.runners.BlockJUnit4ClassRunner.runChild(BlockJUnit4ClassRunner.java:70)
at org.junit.runners.BlockJUnit4ClassRunner.runChild(BlockJUnit4ClassRunner.java:50)
at org.junit.runners.ParentRunner$3.run(ParentRunner.java:238)
at org.junit.runners.ParentRunner$1.schedule(ParentRunner.java:63)
at org.junit.runners.ParentRunner.runChildren(ParentRunner.java:236)
at org.junit.runners.ParentRunner.access$000(ParentRunner.java:53)
at org.junit.runners.ParentRunner$2.evaluate(ParentRunner.java:229)
at org.junit.runners.ParentRunner.run(ParentRunner.java:309)
at org.apache.maven.surefire.junit4.JUnit4Provider.execute(JUnit4Provider.java:283)
at org.apache.maven.surefire.junit4.JUnit4Provider.executeWithRerun(JUnit4Provider.java:173)
at org.apache.maven.surefire.junit4.JUnit4Provider.executeTestSet(JUnit4Provider.java:153)
at org.apache.maven.surefire.junit4.JUnit4Provider.invoke(JUnit4Provider.java:128)
at org.apache.maven.surefire.booter.ForkedBooter.invokeProviderInSameClassLoader(ForkedBooter.java:203)
at org.apache.maven.surefire.booter.ForkedBooter.runSuitesInProcess(ForkedBooter.java:155)
at org.apache.maven.surefire.booter.ForkedBooter.main(ForkedBooter.java:103)
"VM Thread" os_prio=0 tid=0x00007ffacc31c000 nid=0x6c5b runnable
"GC task thread#0 (ParallelGC)" os_prio=0 tid=0x00007ffacc020000 nid=0x6c49 runnable
"GC task thread#1 (ParallelGC)" os_prio=0 tid=0x00007ffacc021800 nid=0x6c4a runnable
"GC task thread#2 (ParallelGC)" os_prio=0 tid=0x00007ffacc023800 nid=0x6c4b runnable
"GC task thread#3 (ParallelGC)" os_prio=0 tid=0x00007ffacc025000 nid=0x6c4c runnable
"GC task thread#4 (ParallelGC)" os_prio=0 tid=0x00007ffacc027000 nid=0x6c4d runnable
"GC task thread#5 (ParallelGC)" os_prio=0 tid=0x00007ffacc028800 nid=0x6c4e runnable
"GC task thread#6 (ParallelGC)" os_prio=0 tid=0x00007ffacc02a800 nid=0x6c4f runnable
"GC task thread#7 (ParallelGC)" os_prio=0 tid=0x00007ffacc02c000 nid=0x6c50 runnable
"GC task thread#8 (ParallelGC)" os_prio=0 tid=0x00007ffacc02e000 nid=0x6c51 runnable
"GC task thread#9 (ParallelGC)" os_prio=0 tid=0x00007ffacc02f800 nid=0x6c52 runnable
"GC task thread#10 (ParallelGC)" os_prio=0 tid=0x00007ffacc031800 nid=0x6c53 runnable
"GC task thread#11 (ParallelGC)" os_prio=0 tid=0x00007ffacc033000 nid=0x6c54 runnable
"GC task thread#12 (ParallelGC)" os_prio=0 tid=0x00007ffacc035000 nid=0x6c55 runnable
"GC task thread#13 (ParallelGC)" os_prio=0 tid=0x00007ffacc036800 nid=0x6c56 runnable
"GC task thread#14 (ParallelGC)" os_prio=0 tid=0x00007ffacc038800 nid=0x6c57 runnable
"GC task thread#15 (ParallelGC)" os_prio=0 tid=0x00007ffacc03a000 nid=0x6c58 runnable
"GC task thread#16 (ParallelGC)" os_prio=0 tid=0x00007ffacc03c000 nid=0x6c59 runnable
"GC task thread#17 (ParallelGC)" os_prio=0 tid=0x00007ffacc03d800 nid=0x6c5a runnable
"VM Periodic Task Thread" os_prio=0 tid=0x00007ffacc382800 nid=0x6c6c waiting on condition
JNI global references: 292
+ echo '************ END zombies jstack extract'
************ END zombies jstack extract
+ JIRA_COMMENT='
{color:red}-1 core zombie tests{color}. There are 7 zombie test(s): at org.apache.hadoop.hbase.master.TestAssignmentManagerOnCluster.testMoveRegion(TestAssignmentManagerOnCluster.java:389)
at org.apache.hadoop.hbase.master.TestAssignmentManagerOnCluster.testReportRegionStateTransition(TestAssignmentManagerOnCluster.java:1209)
at org.apache.hadoop.hbase.master.TestDistributedLogSplitting.testThreeRSAbort(TestDistributedLogSplitting.java:1071)
at org.apache.hadoop.hbase.client.TestHCM.testConnectionClose(TestHCM.java:398)
at org.apache.hadoop.hbase.client.TestHCM.testConnectionCloseAllowsInterrupt(TestHCM.java:281)
at org.apache.hadoop.hbase.master.procedure.TestMasterFailoverWithProcedures.testRecoveryAndDoubleExecution(TestMasterFailoverWithProcedures.java:449)
at org.apache.hadoop.hbase.master.procedure.TestMasterFailoverWithProcedures.testTruncateWithFailoverAtStep(TestMasterFailoverWithProcedures.java:339)
at org.apache.hadoop.hbase.master.procedure.TestMasterFailoverWithProcedures.testTruncateWithFailover(TestMasterFailoverWithProcedures.java:312)
at org.apache.activemq.artemis.tests.integration.xa.XaTimeoutTest.testChangingTimeoutGetsPickedUp(XaTimeoutTest.java:526)'
+ BAD=1
+ jps
+ grep surefirebooter
+ cut -d ' ' -f 1
+ xargs kill -9
POST BUILD TASK : SUCCESS
END OF POST BUILD TASK : 0
Archiving artifacts
Sending artifact delta relative to HBase-1.0 #1014
Archived 1931 artifacts
Archive block size is 32768
Received 28 blocks and 437873642 bytes
Compression is 0.2%
Took 2 min 29 sec
Recording test results
Updating HBASE-14313
Build failed in Jenkins: HBase-1.0 #1032
Posted by Apache Jenkins Server <je...@builds.apache.org>.
See <https://builds.apache.org/job/HBase-1.0/1032/changes>
Changes:
[tedyu] HBASE-14269 FuzzyRowFilter omits certain rows when multiple fuzzy keys exist (hongbin ma)
------------------------------------------
[...truncated 1911 lines...]
Tests run: 7, Failures: 0, Errors: 0, Skipped: 0, Time elapsed: 32.766 sec - in org.apache.hadoop.hbase.security.access.TestTablePermissions
Running org.apache.hadoop.hbase.security.access.TestNamespaceCommands
Tests run: 8, Failures: 0, Errors: 0, Skipped: 0, Time elapsed: 28.116 sec - in org.apache.hadoop.hbase.security.access.TestCellACLWithMultipleVersions
Running org.apache.hadoop.hbase.security.access.TestAccessController
Running org.apache.hadoop.hbase.security.access.TestAccessController2
Tests run: 7, Failures: 0, Errors: 0, Skipped: 0, Time elapsed: 13.983 sec - in org.apache.hadoop.hbase.security.access.TestNamespaceCommands
Running org.apache.hadoop.hbase.security.token.TestZKSecretWatcher
Tests run: 1, Failures: 0, Errors: 0, Skipped: 0, Time elapsed: 13.228 sec - in org.apache.hadoop.hbase.security.token.TestZKSecretWatcher
Running org.apache.hadoop.hbase.security.token.TestTokenAuthentication
Tests run: 3, Failures: 0, Errors: 0, Skipped: 0, Time elapsed: 0.522 sec - in org.apache.hadoop.hbase.security.token.TestTokenAuthentication
Tests run: 5, Failures: 0, Errors: 0, Skipped: 0, Time elapsed: 28.002 sec - in org.apache.hadoop.hbase.security.access.TestAccessController2
Running org.apache.hadoop.hbase.security.visibility.TestEnforcingScanLabelGenerator
Tests run: 1, Failures: 0, Errors: 0, Skipped: 0, Time elapsed: 1.872 sec - in org.apache.hadoop.hbase.security.visibility.TestEnforcingScanLabelGenerator
Running org.apache.hadoop.hbase.security.visibility.TestVisibilityWithCheckAuths
Tests run: 2, Failures: 0, Errors: 0, Skipped: 0, Time elapsed: 3.38 sec - in org.apache.hadoop.hbase.security.visibility.TestVisibilityWithCheckAuths
Running org.apache.hadoop.hbase.security.visibility.TestVisibilityLabelsWithSLGStack
Tests run: 1, Failures: 0, Errors: 0, Skipped: 0, Time elapsed: 1.767 sec - in org.apache.hadoop.hbase.security.visibility.TestVisibilityLabelsWithSLGStack
Running org.apache.hadoop.hbase.security.visibility.TestVisibilityLabelsWithACL
Running org.apache.hadoop.hbase.security.visibility.TestVisibilityLablesWithGroups
Tests run: 1, Failures: 0, Errors: 0, Skipped: 0, Time elapsed: 3.02 sec - in org.apache.hadoop.hbase.security.visibility.TestVisibilityLablesWithGroups
Tests run: 5, Failures: 0, Errors: 0, Skipped: 0, Time elapsed: 7.206 sec - in org.apache.hadoop.hbase.security.visibility.TestVisibilityLabelsWithACL
Running org.apache.hadoop.hbase.security.visibility.TestWithDisabledAuthorization
Tests run: 2, Failures: 0, Errors: 0, Skipped: 0, Time elapsed: 2.831 sec - in org.apache.hadoop.hbase.security.visibility.TestWithDisabledAuthorization
Running org.apache.hadoop.hbase.security.visibility.TestVisibilityLabelsOpWithDifferentUsersNoACL
Tests run: 1, Failures: 0, Errors: 0, Skipped: 0, Time elapsed: 2.258 sec - in org.apache.hadoop.hbase.security.visibility.TestVisibilityLabelsOpWithDifferentUsersNoACL
Running org.apache.hadoop.hbase.security.visibility.TestVisibilityLabelsWithDistributedLogReplay
Running org.apache.hadoop.hbase.security.visibility.TestDefaultScanLabelGeneratorStack
Tests run: 54, Failures: 0, Errors: 0, Skipped: 0, Time elapsed: 90.631 sec - in org.apache.hadoop.hbase.security.access.TestAccessController
Tests run: 1, Failures: 0, Errors: 0, Skipped: 0, Time elapsed: 1.995 sec - in org.apache.hadoop.hbase.security.visibility.TestDefaultScanLabelGeneratorStack
Running org.apache.hadoop.hbase.security.visibility.TestVisibilityLabelsWithDefaultVisLabelService
Running org.apache.hadoop.hbase.security.visibility.TestVisibilityLabelsWithDeletes
Tests run: 23, Failures: 0, Errors: 0, Skipped: 0, Time elapsed: 16.819 sec - in org.apache.hadoop.hbase.security.visibility.TestVisibilityLabelsWithDistributedLogReplay
Running org.apache.hadoop.hbase.security.visibility.TestVisibilityLabelsWithCustomVisLabService
Tests run: 23, Failures: 0, Errors: 0, Skipped: 0, Time elapsed: 19.966 sec - in org.apache.hadoop.hbase.security.visibility.TestVisibilityLabelsWithDefaultVisLabelService
Running org.apache.hadoop.hbase.security.visibility.TestVisibilityLabelsReplication
Tests run: 19, Failures: 0, Errors: 0, Skipped: 0, Time elapsed: 14.466 sec - in org.apache.hadoop.hbase.security.visibility.TestVisibilityLabelsWithCustomVisLabService
Running org.apache.hadoop.hbase.security.visibility.TestVisibilityLabelReplicationWithExpAsString
Tests run: 9, Failures: 0, Errors: 0, Skipped: 0, Time elapsed: 284.841 sec - in org.apache.hadoop.hbase.snapshot.TestExportSnapshot
Running org.apache.hadoop.hbase.fs.TestBlockReorder
Tests run: 1, Failures: 0, Errors: 0, Skipped: 0, Time elapsed: 18.387 sec - in org.apache.hadoop.hbase.security.visibility.TestVisibilityLabelsReplication
Tests run: 1, Failures: 0, Errors: 0, Skipped: 0, Time elapsed: 17.682 sec - in org.apache.hadoop.hbase.security.visibility.TestVisibilityLabelReplicationWithExpAsString
Running org.apache.hadoop.hbase.TestInfoServers
Tests run: 3, Failures: 0, Errors: 0, Skipped: 0, Time elapsed: 20.433 sec - in org.apache.hadoop.hbase.fs.TestBlockReorder
Tests run: 39, Failures: 0, Errors: 0, Skipped: 0, Time elapsed: 52.06 sec - in org.apache.hadoop.hbase.security.visibility.TestVisibilityLabelsWithDeletes
Tests run: 3, Failures: 0, Errors: 0, Skipped: 0, Time elapsed: 2.234 sec - in org.apache.hadoop.hbase.TestInfoServers
Running org.apache.hadoop.hbase.wal.TestWALReaderOnSecureWAL
Running org.apache.hadoop.hbase.wal.TestWALFactory
Tests run: 2, Failures: 0, Errors: 0, Skipped: 0, Time elapsed: 1.718 sec - in org.apache.hadoop.hbase.wal.TestWALReaderOnSecureWAL
Running org.apache.hadoop.hbase.wal.TestSecureWAL
Tests run: 1, Failures: 0, Errors: 0, Skipped: 0, Time elapsed: 1.43 sec - in org.apache.hadoop.hbase.wal.TestSecureWAL
Running org.apache.hadoop.hbase.wal.TestDefaultWALProviderWithHLogKey
Tests run: 9, Failures: 0, Errors: 0, Skipped: 0, Time elapsed: 283.896 sec - in org.apache.hadoop.hbase.snapshot.TestSecureExportSnapshot
Running org.apache.hadoop.hbase.wal.TestWALFiltering
Running org.apache.hadoop.hbase.wal.TestWALSplit
Running org.apache.hadoop.hbase.wal.TestBoundedRegionGroupingProvider
Tests run: 5, Failures: 0, Errors: 0, Skipped: 0, Time elapsed: 7.256 sec - in org.apache.hadoop.hbase.wal.TestDefaultWALProviderWithHLogKey
Tests run: 9, Failures: 0, Errors: 0, Skipped: 0, Time elapsed: 16.094 sec - in org.apache.hadoop.hbase.wal.TestWALFactory
Running org.apache.hadoop.hbase.wal.TestDefaultWALProvider
Running org.apache.hadoop.hbase.wal.TestWALSplitCompressed
Tests run: 5, Failures: 0, Errors: 0, Skipped: 0, Time elapsed: 9.236 sec - in org.apache.hadoop.hbase.wal.TestDefaultWALProvider
Tests run: 5, Failures: 0, Errors: 0, Skipped: 0, Time elapsed: 21.043 sec - in org.apache.hadoop.hbase.wal.TestBoundedRegionGroupingProvider
Tests run: 1, Failures: 0, Errors: 0, Skipped: 0, Time elapsed: 24.309 sec - in org.apache.hadoop.hbase.wal.TestWALFiltering
Running org.apache.hadoop.hbase.zookeeper.TestHQuorumPeer
Running org.apache.hadoop.hbase.backup.example.TestZooKeeperTableArchiveClient
Tests run: 3, Failures: 0, Errors: 0, Skipped: 0, Time elapsed: 1.264 sec - in org.apache.hadoop.hbase.zookeeper.TestHQuorumPeer
Running org.apache.hadoop.hbase.zookeeper.lock.TestZKInterProcessReadWriteLock
Tests run: 3, Failures: 0, Errors: 0, Skipped: 0, Time elapsed: 3.825 sec - in org.apache.hadoop.hbase.backup.example.TestZooKeeperTableArchiveClient
Running org.apache.hadoop.hbase.backup.TestHFileArchiving
Running org.apache.hadoop.hbase.zookeeper.TestZKTableStateManager
Tests run: 1, Failures: 0, Errors: 0, Skipped: 0, Time elapsed: 0.729 sec - in org.apache.hadoop.hbase.zookeeper.TestZKTableStateManager
Running org.apache.hadoop.hbase.zookeeper.TestRecoverableZooKeeper
Tests run: 1, Failures: 0, Errors: 0, Skipped: 0, Time elapsed: 1.239 sec - in org.apache.hadoop.hbase.zookeeper.TestRecoverableZooKeeper
Running org.apache.hadoop.hbase.zookeeper.TestZKLeaderManager
Tests run: 1, Failures: 0, Errors: 0, Skipped: 0, Time elapsed: 0.117 sec - in org.apache.hadoop.hbase.zookeeper.TestZKLeaderManager
Running org.apache.hadoop.hbase.zookeeper.TestZooKeeperACL
Tests run: 6, Failures: 0, Errors: 0, Skipped: 0, Time elapsed: 0.287 sec - in org.apache.hadoop.hbase.zookeeper.TestZooKeeperACL
Running org.apache.hadoop.hbase.zookeeper.TestZooKeeperNodeTracker
Tests run: 3, Failures: 0, Errors: 0, Skipped: 0, Time elapsed: 0.924 sec - in org.apache.hadoop.hbase.zookeeper.TestZooKeeperNodeTracker
Running org.apache.hadoop.hbase.zookeeper.TestZKMulti
Tests run: 12, Failures: 0, Errors: 0, Skipped: 0, Time elapsed: 1.589 sec - in org.apache.hadoop.hbase.zookeeper.TestZKMulti
Tests run: 6, Failures: 0, Errors: 0, Skipped: 0, Time elapsed: 24.469 sec - in org.apache.hadoop.hbase.zookeeper.lock.TestZKInterProcessReadWriteLock
Tests run: 5, Failures: 0, Errors: 0, Skipped: 0, Time elapsed: 39.874 sec - in org.apache.hadoop.hbase.backup.TestHFileArchiving
Running org.apache.hadoop.hbase.mapreduce.TestHLogRecordReader
Tests run: 2, Failures: 0, Errors: 0, Skipped: 0, Time elapsed: 0.796 sec - in org.apache.hadoop.hbase.mapreduce.TestHLogRecordReader
Running org.apache.hadoop.hbase.mapreduce.TestTableInputFormatScan2
Running org.apache.hadoop.hbase.mapreduce.TestTableMapReduce
Running org.apache.hadoop.hbase.mapreduce.TestImportExport
Tests run: 31, Failures: 0, Errors: 0, Skipped: 0, Time elapsed: 193.136 sec - in org.apache.hadoop.hbase.wal.TestWALSplit
Tests run: 31, Failures: 0, Errors: 0, Skipped: 0, Time elapsed: 188.669 sec - in org.apache.hadoop.hbase.wal.TestWALSplitCompressed
Running org.apache.hadoop.hbase.mapreduce.TestWALPlayer
Running org.apache.hadoop.hbase.mapreduce.TestCopyTable
Tests run: 2, Failures: 0, Errors: 0, Skipped: 0, Time elapsed: 154.627 sec - in org.apache.hadoop.hbase.mapreduce.TestTableMapReduce
Running org.apache.hadoop.hbase.mapreduce.TestImportTSVWithOperationAttributes
Tests run: 4, Failures: 0, Errors: 0, Skipped: 0, Time elapsed: 51.324 sec - in org.apache.hadoop.hbase.mapreduce.TestWALPlayer
Running org.apache.hadoop.hbase.mapreduce.TestRowCounter
Tests run: 2, Failures: 0, Errors: 0, Skipped: 0, Time elapsed: 59.772 sec - in org.apache.hadoop.hbase.mapreduce.TestImportTSVWithOperationAttributes
Tests run: 7, Failures: 0, Errors: 0, Skipped: 0, Time elapsed: 241.626 sec - in org.apache.hadoop.hbase.mapreduce.TestTableInputFormatScan2
Running org.apache.hadoop.hbase.mapreduce.TestLoadIncrementalHFilesUseSecurityEndPoint
Running org.apache.hadoop.hbase.mapreduce.TestImportTsv
Tests run: 5, Failures: 0, Errors: 0, Skipped: 0, Time elapsed: 118.774 sec - in org.apache.hadoop.hbase.mapreduce.TestCopyTable
Running org.apache.hadoop.hbase.mapreduce.TestSecureLoadIncrementalHFiles
Tests run: 16, Failures: 0, Errors: 0, Skipped: 0, Time elapsed: 53.749 sec - in org.apache.hadoop.hbase.mapreduce.TestLoadIncrementalHFilesUseSecurityEndPoint
Running org.apache.hadoop.hbase.mapreduce.TestTableInputFormat
Tests run: 16, Failures: 0, Errors: 0, Skipped: 0, Time elapsed: 61.412 sec - in org.apache.hadoop.hbase.mapreduce.TestSecureLoadIncrementalHFiles
Running org.apache.hadoop.hbase.mapreduce.TestTimeRangeMapRed
Tests run: 12, Failures: 0, Errors: 0, Skipped: 0, Time elapsed: 375.525 sec - in org.apache.hadoop.hbase.mapreduce.TestImportExport
Running org.apache.hadoop.hbase.mapreduce.TestTableSnapshotInputFormat
Tests run: 6, Failures: 0, Errors: 0, Skipped: 0, Time elapsed: 188.44 sec - in org.apache.hadoop.hbase.mapreduce.TestRowCounter
Tests run: 8, Failures: 0, Errors: 0, Skipped: 0, Time elapsed: 84.29 sec - in org.apache.hadoop.hbase.mapreduce.TestTableInputFormat
Tests run: 1, Failures: 0, Errors: 0, Skipped: 0, Time elapsed: 67.566 sec - in org.apache.hadoop.hbase.mapreduce.TestTimeRangeMapRed
Running org.apache.hadoop.hbase.mapreduce.TestLoadIncrementalHFiles
Running org.apache.hadoop.hbase.mapreduce.TestImportTSVWithTTLs
Running org.apache.hadoop.hbase.mapreduce.TestHRegionPartitioner
Tests run: 1, Failures: 0, Errors: 0, Skipped: 0, Time elapsed: 3.979 sec - in org.apache.hadoop.hbase.mapreduce.TestHRegionPartitioner
Running org.apache.hadoop.hbase.mapreduce.TestLoadIncrementalHFilesSplitRecovery
Tests run: 1, Failures: 0, Errors: 0, Skipped: 0, Time elapsed: 39.727 sec - in org.apache.hadoop.hbase.mapreduce.TestImportTSVWithTTLs
Tests run: 5, Failures: 0, Errors: 0, Skipped: 0, Time elapsed: 17.216 sec - in org.apache.hadoop.hbase.mapreduce.TestLoadIncrementalHFilesSplitRecovery
Running org.apache.hadoop.hbase.mapreduce.TestHFileOutputFormat
Tests run: 16, Failures: 0, Errors: 0, Skipped: 0, Time elapsed: 53.655 sec - in org.apache.hadoop.hbase.mapreduce.TestLoadIncrementalHFiles
Tests run: 10, Failures: 0, Errors: 0, Skipped: 0, Time elapsed: 222.433 sec - in org.apache.hadoop.hbase.mapreduce.TestImportTsv
Running org.apache.hadoop.hbase.mapreduce.TestHFileOutputFormat2
Running org.apache.hadoop.hbase.mapreduce.TestImportTSVWithVisibilityLabels
Running org.apache.hadoop.hbase.mapreduce.TestMultithreadedTableMapper
Tests run: 1, Failures: 0, Errors: 0, Skipped: 0, Time elapsed: 98.146 sec - in org.apache.hadoop.hbase.mapreduce.TestMultithreadedTableMapper
Running org.apache.hadoop.hbase.mapreduce.TestTableInputFormatScan1
Tests run: 5, Failures: 0, Errors: 0, Skipped: 0, Time elapsed: 174.18 sec - in org.apache.hadoop.hbase.mapreduce.TestImportTSVWithVisibilityLabels
Tests run: 8, Failures: 0, Errors: 0, Skipped: 0, Time elapsed: 275.898 sec - in org.apache.hadoop.hbase.mapreduce.TestTableSnapshotInputFormat
Running org.apache.hadoop.hbase.mapreduce.TestWALRecordReader
Tests run: 2, Failures: 0, Errors: 0, Skipped: 0, Time elapsed: 0.785 sec - in org.apache.hadoop.hbase.mapreduce.TestWALRecordReader
Running org.apache.hadoop.hbase.mapreduce.TestCellCounter
Running org.apache.hadoop.hbase.mapreduce.TestMultiTableInputFormat
Tests run: 13, Failures: 0, Errors: 0, Skipped: 1, Time elapsed: 271.888 sec - in org.apache.hadoop.hbase.mapreduce.TestHFileOutputFormat
Running org.apache.hadoop.hbase.mapreduce.TestSecureLoadIncrementalHFilesSplitRecovery
Tests run: 13, Failures: 0, Errors: 0, Skipped: 1, Time elapsed: 281.643 sec - in org.apache.hadoop.hbase.mapreduce.TestHFileOutputFormat2
Tests run: 5, Failures: 0, Errors: 0, Skipped: 0, Time elapsed: 15.896 sec - in org.apache.hadoop.hbase.mapreduce.TestSecureLoadIncrementalHFilesSplitRecovery
Running org.apache.hadoop.hbase.filter.TestScanRowPrefix
Running org.apache.hadoop.hbase.filter.TestFilterWithScanLimits
Tests run: 1, Failures: 0, Errors: 0, Skipped: 0, Time elapsed: 3.995 sec - in org.apache.hadoop.hbase.filter.TestScanRowPrefix
Tests run: 1, Failures: 0, Errors: 0, Skipped: 0, Time elapsed: 3.81 sec - in org.apache.hadoop.hbase.filter.TestFilterWithScanLimits
Running org.apache.hadoop.hbase.filter.TestFuzzyRowAndColumnRangeFilter
Tests run: 1, Failures: 0, Errors: 0, Skipped: 0, Time elapsed: 2.879 sec - in org.apache.hadoop.hbase.filter.TestFuzzyRowAndColumnRangeFilter
Running org.apache.hadoop.hbase.filter.TestColumnRangeFilter
Running org.apache.hadoop.hbase.filter.TestFilterWrapper
Tests run: 1, Failures: 0, Errors: 0, Skipped: 0, Time elapsed: 8.269 sec - in org.apache.hadoop.hbase.filter.TestColumnRangeFilter
Tests run: 1, Failures: 0, Errors: 0, Skipped: 0, Time elapsed: 1.935 sec - in org.apache.hadoop.hbase.filter.TestFilterWrapper
Running org.apache.hadoop.hbase.filter.TestFuzzyRowFilterEndToEnd
Running org.apache.hadoop.hbase.TestMetaTableAccessor
Tests run: 10, Failures: 0, Errors: 0, Skipped: 0, Time elapsed: 8.519 sec - in org.apache.hadoop.hbase.TestMetaTableAccessor
Tests run: 7, Failures: 0, Errors: 0, Skipped: 0, Time elapsed: 228.411 sec - in org.apache.hadoop.hbase.mapreduce.TestTableInputFormatScan1
Tests run: 4, Failures: 0, Errors: 0, Skipped: 0, Time elapsed: 167.953 sec - in org.apache.hadoop.hbase.mapreduce.TestMultiTableInputFormat
Tests run: 7, Failures: 0, Errors: 0, Skipped: 0, Time elapsed: 192.929 sec - in org.apache.hadoop.hbase.mapreduce.TestCellCounter
Tests run: 2, Failures: 0, Errors: 0, Skipped: 0, Time elapsed: 259.296 sec - in org.apache.hadoop.hbase.filter.TestFuzzyRowFilterEndToEnd
Results :
Failed tests:
TestMultiParallel.testFlushCommitsNoAbort:241->doTestFlushCommits:293->validateLoadedData:676 null
Tests run: 2405, Failures: 1, Errors: 0, Skipped: 18
[INFO] ------------------------------------------------------------------------
[INFO] Reactor Summary:
[INFO]
[INFO] Apache HBase ...................................... SUCCESS [4.785s]
[INFO] Apache HBase - Checkstyle ......................... SUCCESS [0.744s]
[INFO] Apache HBase - Resource Bundle .................... SUCCESS [0.285s]
[INFO] Apache HBase - Annotations ........................ SUCCESS [0.879s]
[INFO] Apache HBase - Common ............................. SUCCESS [1:00.115s]
[INFO] Apache HBase - Protocol ........................... SUCCESS [9.487s]
[INFO] Apache HBase - Client ............................. SUCCESS [1:19.516s]
[INFO] Apache HBase - Hadoop Compatibility ............... SUCCESS [7.255s]
[INFO] Apache HBase - Hadoop Two Compatibility ........... SUCCESS [6.516s]
[INFO] Apache HBase - Prefix Tree ........................ SUCCESS [8.536s]
[INFO] Apache HBase - Server ............................. FAILURE [1:09:46.882s]
[INFO] Apache HBase - Testing Util ....................... SKIPPED
[INFO] Apache HBase - Thrift ............................. SKIPPED
[INFO] Apache HBase - Rest ............................... SKIPPED
[INFO] Apache HBase - Shell .............................. SKIPPED
[INFO] Apache HBase - Integration Tests .................. SKIPPED
[INFO] Apache HBase - Examples ........................... SKIPPED
[INFO] Apache HBase - Assembly ........................... SKIPPED
[INFO] ------------------------------------------------------------------------
[INFO] BUILD FAILURE
[INFO] ------------------------------------------------------------------------
[INFO] Total time: 1:12:46.568s
[INFO] Finished at: Thu Aug 27 05:53:27 UTC 2015
[INFO] Final Memory: 46M/1004M
[INFO] ------------------------------------------------------------------------
[ERROR] Failed to execute goal org.apache.maven.plugins:maven-surefire-plugin:2.18:test (secondPartTestsExecution) on project hbase-server: There are test failures.
[ERROR]
[ERROR] Please refer to <https://builds.apache.org/job/HBase-1.0/ws/hbase-server/target/surefire-reports> for the individual test results.
[ERROR] -> [Help 1]
[ERROR]
[ERROR] To see the full stack trace of the errors, re-run Maven with the -e switch.
[ERROR] Re-run Maven using the -X switch to enable full debug logging.
[ERROR]
[ERROR] For more information about the errors and possible solutions, please read the following articles:
[ERROR] [Help 1] http://cwiki.apache.org/confluence/display/MAVEN/MojoFailureException
[ERROR]
[ERROR] After correcting the problems, you can resume the build with the command
[ERROR] mvn <goals> -rf :hbase-server
Build step 'Invoke top-level Maven targets' marked build as failure
Performing Post build task...
Match found for :.* : True
Logical operation result is TRUE
Running script : ZOMBIE_TESTS_COUNT=`jps | grep surefirebooter | wc -l`
if [[ $ZOMBIE_TESTS_COUNT != 0 ]] ; then
#It seems sometimes the tests are not dying immediately. Let's give them 10s
echo "Suspicious java process found - waiting 10s to see if there are just slow to stop"
sleep 10
ZOMBIE_TESTS_COUNT=`jps | grep surefirebooter | wc -l`
if [[ $ZOMBIE_TESTS_COUNT != 0 ]] ; then
echo "There are $ZOMBIE_TESTS_COUNT zombie tests, they should have been killed by surefire but survived"
echo "************ BEGIN zombies jstack extract"
ZB_STACK=`jps | grep surefirebooter | cut -d ' ' -f 1 | xargs -n 1 jstack | grep ".test" | grep "\.java"`
jps | grep surefirebooter | cut -d ' ' -f 1 | xargs -n 1 jstack
echo "************ END zombies jstack extract"
JIRA_COMMENT="$JIRA_COMMENT
{color:red}-1 core zombie tests{color}. There are ${ZOMBIE_TESTS_COUNT} zombie test(s): ${ZB_STACK}"
BAD=1
jps | grep surefirebooter | cut -d ' ' -f 1 | xargs kill -9
else
echo "We're ok: there is no zombie test, but some tests took some time to stop"
fi
else
echo "We're ok: there is no zombie test"
fi
[HBase-1.0] $ /bin/bash -xe /tmp/hudson2153066788007521229.sh
++ jps
++ grep surefirebooter
++ wc -l
+ ZOMBIE_TESTS_COUNT=0
+ [[ 0 != 0 ]]
+ echo 'We'\''re ok: there is no zombie test'
We're ok: there is no zombie test
POST BUILD TASK : SUCCESS
END OF POST BUILD TASK : 0
Archiving artifacts
Sending artifact delta relative to HBase-1.0 #1014
Archived 1931 artifacts
Archive block size is 32768
Received 28 blocks and 418741130 bytes
Compression is 0.2%
Took 1 min 45 sec
Recording test results
Updating HBASE-14269