You are viewing a plain text version of this content. The canonical link for it is here.
Posted to builds@beam.apache.org by Apache Jenkins Server <je...@builds.apache.org> on 2023/05/10 10:00:57 UTC

Build failed in Jenkins: beam_SeedJob_Standalone #10023

See <https://ci-beam.apache.org/job/beam_SeedJob_Standalone/10023/display/redirect>

Changes:


------------------------------------------
Started by timer
Running as SYSTEM
[EnvInject] - Loading node environment variables.
Building remotely on apache-beam-jenkins-11 (beam) in workspace <https://ci-beam.apache.org/job/beam_SeedJob_Standalone/ws/>
The recommended git tool is: NONE
No credentials specified
 > git rev-parse --resolve-git-dir <https://ci-beam.apache.org/job/beam_SeedJob_Standalone/ws/.git> # timeout=10
Fetching changes from the remote Git repository
 > git config remote.origin.url https://github.com/apache/beam.git # timeout=10
Fetching upstream changes from https://github.com/apache/beam.git
 > git --version # timeout=10
 > git --version # 'git version 2.25.1'
 > git fetch --tags --force --progress -- https://github.com/apache/beam.git +refs/heads/*:refs/remotes/origin/* +refs/pull/${ghprbPullId}/*:refs/remotes/origin/pr/${ghprbPullId}/* # timeout=10
 > git rev-parse origin/master^{commit} # timeout=10
Checking out Revision 86f56e92e55e02d2f6586662bebcd907e50dacbe (origin/master)
 > git config core.sparsecheckout # timeout=10
 > git checkout -f 86f56e92e55e02d2f6586662bebcd907e50dacbe # timeout=10
Commit message: "Add Pubsub lite write metrics and DLQ support (#26482)"
 > git rev-list --no-walk 86f56e92e55e02d2f6586662bebcd907e50dacbe # timeout=10
Cleaning workspace
 > git rev-parse --verify HEAD # timeout=10
Resetting working tree
 > git reset --hard # timeout=10
 > git clean -fdx # timeout=10
[beam_SeedJob_Standalone] $ /bin/bash -xe /tmp/jenkins627335479481372377.sh
+ cd .test-infra/jenkins/committers_list_generator
+ python3.8 -m venv ve3
+ source ./ve3/bin/activate
++ deactivate nondestructive
++ '[' -n '' ']'
++ '[' -n '' ']'
++ '[' -n /bin/bash -o -n '' ']'
++ hash -r
++ '[' -n '' ']'
++ unset VIRTUAL_ENV
++ '[' '!' nondestructive = nondestructive ']'
++ VIRTUAL_ENV=<https://ci-beam.apache.org/job/beam_SeedJob_Standalone/ws/.test-infra/jenkins/committers_list_generator/ve3>
++ export VIRTUAL_ENV
++ _OLD_VIRTUAL_PATH=/usr/local/sbin:/usr/local/bin:/usr/sbin:/usr/bin:/sbin:/bin:/usr/games:/usr/local/games:/snap/bin
++ PATH=<https://ci-beam.apache.org/job/beam_SeedJob_Standalone/ws/.test-infra/jenkins/committers_list_generator/ve3/bin>:/usr/local/sbin:/usr/local/bin:/usr/sbin:/usr/bin:/sbin:/bin:/usr/games:/usr/local/games:/snap/bin
++ export PATH
++ '[' -n '' ']'
++ '[' -z '' ']'
++ _OLD_VIRTUAL_PS1=
++ '[' 'x(ve3) ' '!=' x ']'
++ PS1='(ve3) '
++ export PS1
++ '[' -n /bin/bash -o -n '' ']'
++ hash -r
+ pip install --retries 10 --upgrade pip setuptools wheel
Collecting pip
  Using cached pip-23.1.2-py3-none-any.whl (2.1 MB)
Collecting setuptools
  Using cached setuptools-67.7.2-py3-none-any.whl (1.1 MB)
Collecting wheel
  Using cached wheel-0.40.0-py3-none-any.whl (64 kB)
Installing collected packages: pip, setuptools, wheel
  Attempting uninstall: pip
    Found existing installation: pip 20.0.2
    Uninstalling pip-20.0.2:
      Successfully uninstalled pip-20.0.2
  Attempting uninstall: setuptools
    Found existing installation: setuptools 44.0.0
    Uninstalling setuptools-44.0.0:
      Successfully uninstalled setuptools-44.0.0
Successfully installed pip-23.1.2 setuptools-67.7.2 wheel-0.40.0
+ pip install --retries 10 -r requirements.txt
Collecting python-ldap (from -r requirements.txt (line 17))
  Using cached python_ldap-3.4.3-cp38-cp38-linux_x86_64.whl
Collecting jinja2 (from -r requirements.txt (line 18))
  Using cached Jinja2-3.1.2-py3-none-any.whl (133 kB)
Collecting pyasn1>=0.3.7 (from python-ldap->-r requirements.txt (line 17))
  Using cached pyasn1-0.5.0-py2.py3-none-any.whl (83 kB)
Collecting pyasn1-modules>=0.1.5 (from python-ldap->-r requirements.txt (line 17))
  Using cached pyasn1_modules-0.3.0-py2.py3-none-any.whl (181 kB)
Collecting MarkupSafe>=2.0 (from jinja2->-r requirements.txt (line 18))
  Using cached MarkupSafe-2.1.2-cp38-cp38-manylinux_2_17_x86_64.manylinux2014_x86_64.whl (25 kB)
Installing collected packages: pyasn1, MarkupSafe, pyasn1-modules, jinja2, python-ldap
Successfully installed MarkupSafe-2.1.2 jinja2-3.1.2 pyasn1-0.5.0 pyasn1-modules-0.3.0 python-ldap-3.4.3
+ python main.py -o ..
INFO:root:Generating Committers.groovy
ERROR:root:Couldnt generate the list of committers with args: Namespace(ldap_uris='ldaps://ldap-us.apache.org:636 ldaps://ldap-eu.apache.org:636', output_dir='..')
Traceback (most recent call last):
  File "main.py", line 67, in get_committers_github_usernames
    people = connection.search_s(
  File "<https://ci-beam.apache.org/job/beam_SeedJob_Standalone/ws/.test-infra/jenkins/committers_list_generator/ve3/lib/python3.8/site-packages/ldap/ldapobject.py",> line 631, in search_s
    return self.search_ext_s(base,scope,filterstr,attrlist,attrsonly,None,None,timeout=self.timeout)
  File "<https://ci-beam.apache.org/job/beam_SeedJob_Standalone/ws/.test-infra/jenkins/committers_list_generator/ve3/lib/python3.8/site-packages/ldap/ldapobject.py",> line 625, in search_ext_s
    return self.result(msgid,all=1,timeout=timeout)[1]
  File "<https://ci-beam.apache.org/job/beam_SeedJob_Standalone/ws/.test-infra/jenkins/committers_list_generator/ve3/lib/python3.8/site-packages/ldap/ldapobject.py",> line 535, in result
    resp_type, resp_data, resp_msgid = self.result2(msgid,all,timeout)
  File "<https://ci-beam.apache.org/job/beam_SeedJob_Standalone/ws/.test-infra/jenkins/committers_list_generator/ve3/lib/python3.8/site-packages/ldap/ldapobject.py",> line 539, in result2
    resp_type, resp_data, resp_msgid, resp_ctrls = self.result3(msgid,all,timeout)
  File "<https://ci-beam.apache.org/job/beam_SeedJob_Standalone/ws/.test-infra/jenkins/committers_list_generator/ve3/lib/python3.8/site-packages/ldap/ldapobject.py",> line 543, in result3
    resp_type, resp_data, resp_msgid, decoded_resp_ctrls, retoid, retval = self.result4(
  File "<https://ci-beam.apache.org/job/beam_SeedJob_Standalone/ws/.test-infra/jenkins/committers_list_generator/ve3/lib/python3.8/site-packages/ldap/ldapobject.py",> line 553, in result4
    ldap_result = self._ldap_call(self._l.result4,msgid,all,timeout,add_ctrls,add_intermediates,add_extop)
  File "<https://ci-beam.apache.org/job/beam_SeedJob_Standalone/ws/.test-infra/jenkins/committers_list_generator/ve3/lib/python3.8/site-packages/ldap/ldapobject.py",> line 128, in _ldap_call
    result = func(*args,**kwargs)
ldap.INSUFFICIENT_ACCESS: {'msgtype': 101, 'msgid': 1, 'result': 50, 'desc': 'Insufficient access', 'ctrls': []}

The above exception was the direct cause of the following exception:

Traceback (most recent call last):
  File "main.py", line 132, in <module>
    generate_groovy(args.output_dir, args.ldap_uris)
  File "main.py", line 52, in generate_groovy
    github_usernames=get_committers_github_usernames(
  File "main.py", line 101, in get_committers_github_usernames
    raise CommittersGeneratorException("Could not fetch LDAP data") from e
CommittersGeneratorException: Could not fetch LDAP data
+ echo 'ERROR: Failed to fetch committers'
ERROR: Failed to fetch committers
+ exit 3
Build step 'Execute shell' changed build result to UNSTABLE
Processing DSL script .test-infra/jenkins/job_00_seed.groovy
ERROR: (job_00_seed.groovy, line 82) No such property: GITHUB_USERNAMES for class: Committers
Not sending mail to unregistered user noreply@github.com

---------------------------------------------------------------------
To unsubscribe, e-mail: builds-unsubscribe@beam.apache.org
For additional commands, e-mail: builds-help@beam.apache.org


Jenkins build is back to normal : beam_SeedJob_Standalone #10026

Posted by Apache Jenkins Server <je...@builds.apache.org>.
See <https://ci-beam.apache.org/job/beam_SeedJob_Standalone/10026/display/redirect>


---------------------------------------------------------------------
To unsubscribe, e-mail: builds-unsubscribe@beam.apache.org
For additional commands, e-mail: builds-help@beam.apache.org


Build failed in Jenkins: beam_SeedJob_Standalone #10025

Posted by Apache Jenkins Server <je...@builds.apache.org>.
See <https://ci-beam.apache.org/job/beam_SeedJob_Standalone/10025/display/redirect?page=changes>

Changes:

[jakubrauch] Add synchronized to getExtensionRegistry() lazy initialization

[Kenneth Knowles] Revert "Eliminate nullness errors from sdks/java/extensions/ml"

[noreply] Fix json int64 serialization for perf alert commenting(#26617)

[noreply] Beam 2.47.0 Release Website Updates (#26439)

[noreply] #25962 Fix for Java SDF-based Kafka ingestion being stuck at certain

[noreply] Add ReadChangeStream end time logic, minor cleanup (#26355)


------------------------------------------
Started by timer
Running as SYSTEM
[EnvInject] - Loading node environment variables.
Building remotely on apache-beam-jenkins-9 (beam) in workspace <https://ci-beam.apache.org/job/beam_SeedJob_Standalone/ws/>
The recommended git tool is: NONE
No credentials specified
 > git rev-parse --resolve-git-dir <https://ci-beam.apache.org/job/beam_SeedJob_Standalone/ws/.git> # timeout=10
Fetching changes from the remote Git repository
 > git config remote.origin.url https://github.com/apache/beam.git # timeout=10
Fetching upstream changes from https://github.com/apache/beam.git
 > git --version # timeout=10
 > git --version # 'git version 2.25.1'
 > git fetch --tags --force --progress -- https://github.com/apache/beam.git +refs/heads/*:refs/remotes/origin/* +refs/pull/${ghprbPullId}/*:refs/remotes/origin/pr/${ghprbPullId}/* # timeout=10
 > git rev-parse origin/master^{commit} # timeout=10
Checking out Revision 2cfb914c5de05607ecb5eda6e3f0bc6bb66b62ee (origin/master)
 > git config core.sparsecheckout # timeout=10
 > git checkout -f 2cfb914c5de05607ecb5eda6e3f0bc6bb66b62ee # timeout=10
Commit message: "Merge pull request #25913: Add synchronized to getExtensionRegistry() lazy initialization"
 > git rev-list --no-walk ff82ffb07e56933ef0035b3b35e39cb07317ab21 # timeout=10
Cleaning workspace
 > git rev-parse --verify HEAD # timeout=10
Resetting working tree
 > git reset --hard # timeout=10
 > git clean -fdx # timeout=10
[beam_SeedJob_Standalone] $ /bin/bash -xe /tmp/jenkins419899559005613226.sh
+ cd .test-infra/jenkins/committers_list_generator
+ python3.8 -m venv ve3
+ source ./ve3/bin/activate
++ deactivate nondestructive
++ '[' -n '' ']'
++ '[' -n '' ']'
++ '[' -n /bin/bash -o -n '' ']'
++ hash -r
++ '[' -n '' ']'
++ unset VIRTUAL_ENV
++ '[' '!' nondestructive = nondestructive ']'
++ VIRTUAL_ENV=<https://ci-beam.apache.org/job/beam_SeedJob_Standalone/ws/.test-infra/jenkins/committers_list_generator/ve3>
++ export VIRTUAL_ENV
++ _OLD_VIRTUAL_PATH=/usr/local/sbin:/usr/local/bin:/usr/sbin:/usr/bin:/sbin:/bin:/usr/games:/usr/local/games:/snap/bin
++ PATH=<https://ci-beam.apache.org/job/beam_SeedJob_Standalone/ws/.test-infra/jenkins/committers_list_generator/ve3/bin>:/usr/local/sbin:/usr/local/bin:/usr/sbin:/usr/bin:/sbin:/bin:/usr/games:/usr/local/games:/snap/bin
++ export PATH
++ '[' -n '' ']'
++ '[' -z '' ']'
++ _OLD_VIRTUAL_PS1=
++ '[' 'x(ve3) ' '!=' x ']'
++ PS1='(ve3) '
++ export PS1
++ '[' -n /bin/bash -o -n '' ']'
++ hash -r
+ pip install --retries 10 --upgrade pip setuptools wheel
Collecting pip
  Using cached pip-23.1.2-py3-none-any.whl (2.1 MB)
Collecting setuptools
  Using cached setuptools-67.7.2-py3-none-any.whl (1.1 MB)
Collecting wheel
  Using cached wheel-0.40.0-py3-none-any.whl (64 kB)
Installing collected packages: pip, setuptools, wheel
  Attempting uninstall: pip
    Found existing installation: pip 20.0.2
    Uninstalling pip-20.0.2:
      Successfully uninstalled pip-20.0.2
  Attempting uninstall: setuptools
    Found existing installation: setuptools 44.0.0
    Uninstalling setuptools-44.0.0:
      Successfully uninstalled setuptools-44.0.0
Successfully installed pip-23.1.2 setuptools-67.7.2 wheel-0.40.0
+ pip install --retries 10 -r requirements.txt
Collecting python-ldap (from -r requirements.txt (line 17))
  Using cached python_ldap-3.4.3-cp38-cp38-linux_x86_64.whl
Collecting jinja2 (from -r requirements.txt (line 18))
  Using cached Jinja2-3.1.2-py3-none-any.whl (133 kB)
Collecting pyasn1>=0.3.7 (from python-ldap->-r requirements.txt (line 17))
  Using cached pyasn1-0.5.0-py2.py3-none-any.whl (83 kB)
Collecting pyasn1-modules>=0.1.5 (from python-ldap->-r requirements.txt (line 17))
  Using cached pyasn1_modules-0.3.0-py2.py3-none-any.whl (181 kB)
Collecting MarkupSafe>=2.0 (from jinja2->-r requirements.txt (line 18))
  Using cached MarkupSafe-2.1.2-cp38-cp38-manylinux_2_17_x86_64.manylinux2014_x86_64.whl (25 kB)
Installing collected packages: pyasn1, MarkupSafe, pyasn1-modules, jinja2, python-ldap
Successfully installed MarkupSafe-2.1.2 jinja2-3.1.2 pyasn1-0.5.0 pyasn1-modules-0.3.0 python-ldap-3.4.3
+ python main.py -o ..
INFO:root:Generating Committers.groovy
ERROR:root:Couldnt generate the list of committers with args: Namespace(ldap_uris='ldaps://ldap-us.apache.org:636 ldaps://ldap-eu.apache.org:636', output_dir='..')
Traceback (most recent call last):
  File "main.py", line 67, in get_committers_github_usernames
    people = connection.search_s(
  File "<https://ci-beam.apache.org/job/beam_SeedJob_Standalone/ws/.test-infra/jenkins/committers_list_generator/ve3/lib/python3.8/site-packages/ldap/ldapobject.py",> line 631, in search_s
    return self.search_ext_s(base,scope,filterstr,attrlist,attrsonly,None,None,timeout=self.timeout)
  File "<https://ci-beam.apache.org/job/beam_SeedJob_Standalone/ws/.test-infra/jenkins/committers_list_generator/ve3/lib/python3.8/site-packages/ldap/ldapobject.py",> line 625, in search_ext_s
    return self.result(msgid,all=1,timeout=timeout)[1]
  File "<https://ci-beam.apache.org/job/beam_SeedJob_Standalone/ws/.test-infra/jenkins/committers_list_generator/ve3/lib/python3.8/site-packages/ldap/ldapobject.py",> line 535, in result
    resp_type, resp_data, resp_msgid = self.result2(msgid,all,timeout)
  File "<https://ci-beam.apache.org/job/beam_SeedJob_Standalone/ws/.test-infra/jenkins/committers_list_generator/ve3/lib/python3.8/site-packages/ldap/ldapobject.py",> line 539, in result2
    resp_type, resp_data, resp_msgid, resp_ctrls = self.result3(msgid,all,timeout)
  File "<https://ci-beam.apache.org/job/beam_SeedJob_Standalone/ws/.test-infra/jenkins/committers_list_generator/ve3/lib/python3.8/site-packages/ldap/ldapobject.py",> line 543, in result3
    resp_type, resp_data, resp_msgid, decoded_resp_ctrls, retoid, retval = self.result4(
  File "<https://ci-beam.apache.org/job/beam_SeedJob_Standalone/ws/.test-infra/jenkins/committers_list_generator/ve3/lib/python3.8/site-packages/ldap/ldapobject.py",> line 553, in result4
    ldap_result = self._ldap_call(self._l.result4,msgid,all,timeout,add_ctrls,add_intermediates,add_extop)
  File "<https://ci-beam.apache.org/job/beam_SeedJob_Standalone/ws/.test-infra/jenkins/committers_list_generator/ve3/lib/python3.8/site-packages/ldap/ldapobject.py",> line 128, in _ldap_call
    result = func(*args,**kwargs)
ldap.INSUFFICIENT_ACCESS: {'msgtype': 101, 'msgid': 1, 'result': 50, 'desc': 'Insufficient access', 'ctrls': []}

The above exception was the direct cause of the following exception:

Traceback (most recent call last):
  File "main.py", line 132, in <module>
    generate_groovy(args.output_dir, args.ldap_uris)
  File "main.py", line 52, in generate_groovy
    github_usernames=get_committers_github_usernames(
  File "main.py", line 101, in get_committers_github_usernames
    raise CommittersGeneratorException("Could not fetch LDAP data") from e
CommittersGeneratorException: Could not fetch LDAP data
+ echo 'ERROR: Failed to fetch committers'
ERROR: Failed to fetch committers
+ exit 3
Build step 'Execute shell' changed build result to UNSTABLE
Processing DSL script .test-infra/jenkins/job_00_seed.groovy
ERROR: (job_00_seed.groovy, line 82) No such property: GITHUB_USERNAMES for class: Committers
Not sending mail to unregistered user noreply@github.com
Not sending mail to unregistered user jakubrauch@google.com

---------------------------------------------------------------------
To unsubscribe, e-mail: builds-unsubscribe@beam.apache.org
For additional commands, e-mail: builds-help@beam.apache.org


Build failed in Jenkins: beam_SeedJob_Standalone #10024

Posted by Apache Jenkins Server <je...@builds.apache.org>.
See <https://ci-beam.apache.org/job/beam_SeedJob_Standalone/10024/display/redirect?page=changes>

Changes:

[noreply] Use default value for pg_router_host if it's not specified (#26629)

[noreply] Bump go.mongodb.org/mongo-driver from 1.11.5 to 1.11.6 in /sdks (#26626)


------------------------------------------
Started by timer
Running as SYSTEM
[EnvInject] - Loading node environment variables.
Building remotely on apache-beam-jenkins-9 (beam) in workspace <https://ci-beam.apache.org/job/beam_SeedJob_Standalone/ws/>
The recommended git tool is: NONE
No credentials specified
 > git rev-parse --resolve-git-dir <https://ci-beam.apache.org/job/beam_SeedJob_Standalone/ws/.git> # timeout=10
Fetching changes from the remote Git repository
 > git config remote.origin.url https://github.com/apache/beam.git # timeout=10
Fetching upstream changes from https://github.com/apache/beam.git
 > git --version # timeout=10
 > git --version # 'git version 2.25.1'
 > git fetch --tags --force --progress -- https://github.com/apache/beam.git +refs/heads/*:refs/remotes/origin/* +refs/pull/${ghprbPullId}/*:refs/remotes/origin/pr/${ghprbPullId}/* # timeout=10
 > git rev-parse origin/master^{commit} # timeout=10
Checking out Revision ff82ffb07e56933ef0035b3b35e39cb07317ab21 (origin/master)
 > git config core.sparsecheckout # timeout=10
 > git checkout -f ff82ffb07e56933ef0035b3b35e39cb07317ab21 # timeout=10
Commit message: "Bump go.mongodb.org/mongo-driver from 1.11.5 to 1.11.6 in /sdks (#26626)"
 > git rev-list --no-walk 86f56e92e55e02d2f6586662bebcd907e50dacbe # timeout=10
Cleaning workspace
 > git rev-parse --verify HEAD # timeout=10
Resetting working tree
 > git reset --hard # timeout=10
 > git clean -fdx # timeout=10
[beam_SeedJob_Standalone] $ /bin/bash -xe /tmp/jenkins4700217969228853976.sh
+ cd .test-infra/jenkins/committers_list_generator
+ python3.8 -m venv ve3
+ source ./ve3/bin/activate
++ deactivate nondestructive
++ '[' -n '' ']'
++ '[' -n '' ']'
++ '[' -n /bin/bash -o -n '' ']'
++ hash -r
++ '[' -n '' ']'
++ unset VIRTUAL_ENV
++ '[' '!' nondestructive = nondestructive ']'
++ VIRTUAL_ENV=<https://ci-beam.apache.org/job/beam_SeedJob_Standalone/ws/.test-infra/jenkins/committers_list_generator/ve3>
++ export VIRTUAL_ENV
++ _OLD_VIRTUAL_PATH=/usr/local/sbin:/usr/local/bin:/usr/sbin:/usr/bin:/sbin:/bin:/usr/games:/usr/local/games:/snap/bin
++ PATH=<https://ci-beam.apache.org/job/beam_SeedJob_Standalone/ws/.test-infra/jenkins/committers_list_generator/ve3/bin>:/usr/local/sbin:/usr/local/bin:/usr/sbin:/usr/bin:/sbin:/bin:/usr/games:/usr/local/games:/snap/bin
++ export PATH
++ '[' -n '' ']'
++ '[' -z '' ']'
++ _OLD_VIRTUAL_PS1=
++ '[' 'x(ve3) ' '!=' x ']'
++ PS1='(ve3) '
++ export PS1
++ '[' -n /bin/bash -o -n '' ']'
++ hash -r
+ pip install --retries 10 --upgrade pip setuptools wheel
Collecting pip
  Using cached pip-23.1.2-py3-none-any.whl (2.1 MB)
Collecting setuptools
  Using cached setuptools-67.7.2-py3-none-any.whl (1.1 MB)
Collecting wheel
  Using cached wheel-0.40.0-py3-none-any.whl (64 kB)
Installing collected packages: pip, setuptools, wheel
  Attempting uninstall: pip
    Found existing installation: pip 20.0.2
    Uninstalling pip-20.0.2:
      Successfully uninstalled pip-20.0.2
  Attempting uninstall: setuptools
    Found existing installation: setuptools 44.0.0
    Uninstalling setuptools-44.0.0:
      Successfully uninstalled setuptools-44.0.0
Successfully installed pip-23.1.2 setuptools-67.7.2 wheel-0.40.0
+ pip install --retries 10 -r requirements.txt
Collecting python-ldap (from -r requirements.txt (line 17))
  Using cached python_ldap-3.4.3-cp38-cp38-linux_x86_64.whl
Collecting jinja2 (from -r requirements.txt (line 18))
  Using cached Jinja2-3.1.2-py3-none-any.whl (133 kB)
Collecting pyasn1>=0.3.7 (from python-ldap->-r requirements.txt (line 17))
  Using cached pyasn1-0.5.0-py2.py3-none-any.whl (83 kB)
Collecting pyasn1-modules>=0.1.5 (from python-ldap->-r requirements.txt (line 17))
  Using cached pyasn1_modules-0.3.0-py2.py3-none-any.whl (181 kB)
Collecting MarkupSafe>=2.0 (from jinja2->-r requirements.txt (line 18))
  Using cached MarkupSafe-2.1.2-cp38-cp38-manylinux_2_17_x86_64.manylinux2014_x86_64.whl (25 kB)
Installing collected packages: pyasn1, MarkupSafe, pyasn1-modules, jinja2, python-ldap
Successfully installed MarkupSafe-2.1.2 jinja2-3.1.2 pyasn1-0.5.0 pyasn1-modules-0.3.0 python-ldap-3.4.3
+ python main.py -o ..
INFO:root:Generating Committers.groovy
ERROR:root:Couldnt generate the list of committers with args: Namespace(ldap_uris='ldaps://ldap-us.apache.org:636 ldaps://ldap-eu.apache.org:636', output_dir='..')
Traceback (most recent call last):
  File "main.py", line 67, in get_committers_github_usernames
    people = connection.search_s(
  File "<https://ci-beam.apache.org/job/beam_SeedJob_Standalone/ws/.test-infra/jenkins/committers_list_generator/ve3/lib/python3.8/site-packages/ldap/ldapobject.py",> line 631, in search_s
    return self.search_ext_s(base,scope,filterstr,attrlist,attrsonly,None,None,timeout=self.timeout)
  File "<https://ci-beam.apache.org/job/beam_SeedJob_Standalone/ws/.test-infra/jenkins/committers_list_generator/ve3/lib/python3.8/site-packages/ldap/ldapobject.py",> line 625, in search_ext_s
    return self.result(msgid,all=1,timeout=timeout)[1]
  File "<https://ci-beam.apache.org/job/beam_SeedJob_Standalone/ws/.test-infra/jenkins/committers_list_generator/ve3/lib/python3.8/site-packages/ldap/ldapobject.py",> line 535, in result
    resp_type, resp_data, resp_msgid = self.result2(msgid,all,timeout)
  File "<https://ci-beam.apache.org/job/beam_SeedJob_Standalone/ws/.test-infra/jenkins/committers_list_generator/ve3/lib/python3.8/site-packages/ldap/ldapobject.py",> line 539, in result2
    resp_type, resp_data, resp_msgid, resp_ctrls = self.result3(msgid,all,timeout)
  File "<https://ci-beam.apache.org/job/beam_SeedJob_Standalone/ws/.test-infra/jenkins/committers_list_generator/ve3/lib/python3.8/site-packages/ldap/ldapobject.py",> line 543, in result3
    resp_type, resp_data, resp_msgid, decoded_resp_ctrls, retoid, retval = self.result4(
  File "<https://ci-beam.apache.org/job/beam_SeedJob_Standalone/ws/.test-infra/jenkins/committers_list_generator/ve3/lib/python3.8/site-packages/ldap/ldapobject.py",> line 553, in result4
    ldap_result = self._ldap_call(self._l.result4,msgid,all,timeout,add_ctrls,add_intermediates,add_extop)
  File "<https://ci-beam.apache.org/job/beam_SeedJob_Standalone/ws/.test-infra/jenkins/committers_list_generator/ve3/lib/python3.8/site-packages/ldap/ldapobject.py",> line 128, in _ldap_call
    result = func(*args,**kwargs)
ldap.INSUFFICIENT_ACCESS: {'msgtype': 101, 'msgid': 1, 'result': 50, 'desc': 'Insufficient access', 'ctrls': []}

The above exception was the direct cause of the following exception:

Traceback (most recent call last):
  File "main.py", line 132, in <module>
    generate_groovy(args.output_dir, args.ldap_uris)
  File "main.py", line 52, in generate_groovy
    github_usernames=get_committers_github_usernames(
  File "main.py", line 101, in get_committers_github_usernames
    raise CommittersGeneratorException("Could not fetch LDAP data") from e
CommittersGeneratorException: Could not fetch LDAP data
+ echo 'ERROR: Failed to fetch committers'
ERROR: Failed to fetch committers
+ exit 3
Build step 'Execute shell' changed build result to UNSTABLE
Processing DSL script .test-infra/jenkins/job_00_seed.groovy
ERROR: (job_00_seed.groovy, line 82) No such property: GITHUB_USERNAMES for class: Committers
Not sending mail to unregistered user noreply@github.com

---------------------------------------------------------------------
To unsubscribe, e-mail: builds-unsubscribe@beam.apache.org
For additional commands, e-mail: builds-help@beam.apache.org