You are viewing a plain text version of this content. The canonical link for it is here.
Posted to builds@beam.apache.org by Apache Jenkins Server <je...@builds.apache.org> on 2022/02/06 07:44:52 UTC
Build failed in Jenkins: beam_Release_NightlySnapshot #1454
See <https://ci-beam.apache.org/job/beam_Release_NightlySnapshot/1454/display/redirect>
Changes:
------------------------------------------
[...truncated 510.74 KB...]
> Task :sdks:java:testing:kafka-service:publish
> Task :sdks:java:testing:nexmark:generatePomFileForMavenJavaPublication
> Task :sdks:java:testing:nexmark:createCheckerFrameworkManifest
> Task :sdks:java:testing:nexmark:compileJava FROM-CACHE
> Task :sdks:java:testing:nexmark:processResources
> Task :sdks:java:testing:nexmark:classes
> Task :sdks:java:testing:nexmark:generatePomPropertiesFileForMavenJavaPublication
> Task :sdks:java:testing:nexmark:jar
> Task :sdks:java:testing:nexmark:javadoc FROM-CACHE
> Task :sdks:java:testing:nexmark:javadocJar
> Task :sdks:java:testing:nexmark:sourcesJar
> Task :sdks:java:testing:nexmark:compileTestJava FROM-CACHE
> Task :sdks:java:testing:nexmark:processTestResources NO-SOURCE
> Task :sdks:java:testing:nexmark:testClasses UP-TO-DATE
> Task :sdks:java:testing:nexmark:testJar
> Task :sdks:java:testing:nexmark:testSourcesJar
> Task :sdks:java:testing:nexmark:publishMavenJavaPublicationToApache.snapshots.httpsRepository
> Task :sdks:java:testing:nexmark:publishMavenJavaPublicationToTestPublicationLocalRepository
> Task :sdks:java:testing:nexmark:publish
> Task :sdks:java:testing:test-utils:javadoc FROM-CACHE
> Task :sdks:java:testing:test-utils:javadocJar
> Task :sdks:java:testing:test-utils:sourcesJar
> Task :sdks:java:testing:test-utils:testSourcesJar
> Task :sdks:java:testing:test-utils:publishMavenJavaPublicationToApache.snapshots.httpsRepository
> Task :sdks:java:testing:test-utils:publishMavenJavaPublicationToTestPublicationLocalRepository
> Task :sdks:java:testing:test-utils:publish
> Task :sdks:java:testing:tpcds:generatePomFileForMavenJavaPublication
> Task :sdks:java:testing:tpcds:createCheckerFrameworkManifest
> Task :sdks:java:testing:tpcds:compileJava FROM-CACHE
> Task :sdks:java:testing:tpcds:processResources
> Task :sdks:java:testing:tpcds:classes
> Task :sdks:java:testing:tpcds:generatePomPropertiesFileForMavenJavaPublication
> Task :sdks:java:testing:tpcds:jar
> Task :sdks:java:testing:tpcds:javadoc FROM-CACHE
> Task :sdks:java:testing:tpcds:javadocJar
> Task :sdks:java:testing:tpcds:sourcesJar
> Task :sdks:java:testing:tpcds:compileTestJava FROM-CACHE
> Task :sdks:java:testing:tpcds:processTestResources NO-SOURCE
> Task :sdks:java:testing:tpcds:testClasses UP-TO-DATE
> Task :sdks:java:testing:tpcds:testJar
> Task :sdks:java:testing:tpcds:testSourcesJar
> Task :sdks:java:testing:tpcds:publishMavenJavaPublicationToApache.snapshots.httpsRepository
> Task :sdks:java:testing:tpcds:publishMavenJavaPublicationToTestPublicationLocalRepository
> Task :sdks:java:testing:tpcds:publish
> Task :sdks:java:extensions:sql:datacatalog:generatePomFileForMavenJavaPublication
> Task :sdks:java:extensions:sql:datacatalog:createCheckerFrameworkManifest
> Task :sdks:java:extensions:sql:datacatalog:compileJava FROM-CACHE
> Task :sdks:java:extensions:sql:datacatalog:processResources NO-SOURCE
> Task :sdks:java:extensions:sql:datacatalog:classes UP-TO-DATE
> Task :sdks:java:extensions:sql:datacatalog:generatePomPropertiesFileForMavenJavaPublication
> Task :sdks:java:extensions:sql:datacatalog:jar
> Task :sdks:java:extensions:sql:datacatalog:javadoc FROM-CACHE
> Task :sdks:java:extensions:sql:datacatalog:javadocJar
> Task :sdks:java:extensions:sql:datacatalog:sourcesJar
> Task :runners:direct-java:jar
> Task :sdks:java:extensions:sql:datacatalog:compileTestJava FROM-CACHE
> Task :sdks:java:extensions:sql:datacatalog:processTestResources NO-SOURCE
> Task :sdks:java:extensions:sql:datacatalog:testClasses UP-TO-DATE
> Task :sdks:java:extensions:sql:datacatalog:testJar
> Task :sdks:java:extensions:sql:datacatalog:testSourcesJar
> Task :sdks:java:extensions:sql:datacatalog:publishMavenJavaPublicationToApache.snapshots.httpsRepository
> Task :sdks:java:extensions:sql:datacatalog:publishMavenJavaPublicationToTestPublicationLocalRepository
> Task :sdks:java:extensions:sql:datacatalog:publish
> Task :sdks:java:extensions:sql:expansion-service:javadoc FROM-CACHE
> Task :sdks:java:extensions:sql:expansion-service:javadocJar
> Task :sdks:java:extensions:sql:expansion-service:compileTestJava NO-SOURCE
> Task :sdks:java:extensions:sql:expansion-service:processTestResources NO-SOURCE
> Task :sdks:java:extensions:sql:expansion-service:testClasses UP-TO-DATE
> Task :sdks:java:extensions:sql:expansion-service:shadowTestJar FROM-CACHE
> Task :sdks:java:extensions:sql:expansion-service:sourcesJar
> Task :sdks:java:extensions:sql:expansion-service:testSourcesJar
> Task :sdks:java:extensions:sql:expansion-service:publishMavenJavaPublicationToApache.snapshots.httpsRepository
> Task :sdks:java:extensions:sql:expansion-service:publishMavenJavaPublicationToTestPublicationLocalRepository
> Task :sdks:java:extensions:sql:expansion-service:publish
> Task :sdks:java:extensions:sql:hcatalog:generatePomFileForMavenJavaPublication
> Task :sdks:java:extensions:sql:hcatalog:compileJava FAILED
error: cannot access Statistic
class file for org.apache.beam.vendor.calcite.v1_28_0.org.apache.calcite.schema.Statistic not found
Consult the following stack trace for details.
com.sun.tools.javac.code.Symbol$CompletionFailure: class file for org.apache.beam.vendor.calcite.v1_28_0.org.apache.calcite.schema.Statistic not found
1 error
> Task :sdks:java:extensions:sql:hcatalog:processResources NO-SOURCE
> Task :sdks:java:extensions:sql:hcatalog:generatePomPropertiesFileForMavenJavaPublication
> Task :sdks:java:extensions:sql:hcatalog:sourcesJar
> Task :sdks:java:extensions:sql:hcatalog:processTestResources NO-SOURCE
> Task :sdks:java:extensions:sql:hcatalog:testSourcesJar
> Task :sdks:java:extensions:sql:jdbc:generatePomFileForMavenJavaPublication
> Task :sdks:java:extensions:sql:jdbc:createCheckerFrameworkManifest
> Task :sdks:java:extensions:sql:jdbc:compileJava FROM-CACHE
> Task :sdks:java:extensions:sql:jdbc:processResources
> Task :sdks:java:extensions:sql:jdbc:classes
> Task :sdks:java:extensions:sql:jdbc:javadoc FROM-CACHE
> Task :sdks:java:extensions:sql:jdbc:javadocJar
> Task :sdks:java:extensions:sql:jdbc:generatePomPropertiesFileForMavenJavaPublication
> Task :sdks:java:extensions:sql:jdbc:shadowJar
> Task :sdks:java:extensions:sql:jdbc:compileTestJava FROM-CACHE
> Task :sdks:java:extensions:sql:jdbc:processTestResources NO-SOURCE
> Task :sdks:java:extensions:sql:jdbc:testClasses UP-TO-DATE
> Task :sdks:java:extensions:sql:jdbc:shadowTestJar FROM-CACHE
> Task :sdks:java:extensions:sql:jdbc:sourcesJar
> Task :sdks:java:extensions:sql:jdbc:testSourcesJar
> Task :sdks:java:extensions:sql:jdbc:publishMavenJavaPublicationToApache.snapshots.httpsRepository
> Task :sdks:java:extensions:sql:jdbc:publishMavenJavaPublicationToTestPublicationLocalRepository
> Task :sdks:java:extensions:sql:jdbc:publish
> Task :sdks:java:extensions:sql:perf-tests:generatePomFileForMavenJavaPublication
> Task :sdks:java:extensions:sql:perf-tests:createCheckerFrameworkManifest
> Task :sdks:java:extensions:sql:perf-tests:compileJava NO-SOURCE
> Task :sdks:java:extensions:sql:perf-tests:processResources NO-SOURCE
> Task :sdks:java:extensions:sql:perf-tests:classes UP-TO-DATE
> Task :sdks:java:extensions:sql:perf-tests:generatePomPropertiesFileForMavenJavaPublication
> Task :sdks:java:extensions:sql:perf-tests:jar
> Task :sdks:java:extensions:sql:perf-tests:javadoc NO-SOURCE
> Task :sdks:java:extensions:sql:perf-tests:javadocJar
> Task :sdks:java:extensions:sql:perf-tests:sourcesJar
> Task :sdks:java:extensions:sql:perf-tests:compileTestJava FROM-CACHE
> Task :sdks:java:extensions:sql:perf-tests:processTestResources NO-SOURCE
> Task :sdks:java:extensions:sql:perf-tests:testClasses UP-TO-DATE
> Task :sdks:java:extensions:sql:perf-tests:testJar
> Task :sdks:java:extensions:sql:perf-tests:testSourcesJar
> Task :sdks:java:extensions:sql:perf-tests:publishMavenJavaPublicationToApache.snapshots.httpsRepository
> Task :sdks:java:extensions:sql:perf-tests:publishMavenJavaPublicationToTestPublicationLocalRepository
> Task :sdks:java:extensions:sql:perf-tests:publish
> Task :sdks:java:extensions:sql:udf:javadoc FROM-CACHE
> Task :sdks:java:extensions:sql:udf:javadocJar
> Task :sdks:java:extensions:sql:udf:sourcesJar
> Task :sdks:java:extensions:sql:udf:compileTestJava NO-SOURCE
> Task :sdks:java:extensions:sql:udf:processTestResources NO-SOURCE
> Task :sdks:java:extensions:sql:udf:testClasses UP-TO-DATE
> Task :sdks:java:extensions:sql:udf:testJar
> Task :sdks:java:extensions:sql:udf:testSourcesJar
> Task :sdks:java:extensions:sql:udf:publishMavenJavaPublicationToApache.snapshots.httpsRepository
> Task :sdks:java:extensions:sql:udf:publishMavenJavaPublicationToTestPublicationLocalRepository
> Task :sdks:java:extensions:sql:udf:publish
> Task :sdks:java:extensions:sql:zetasql:javadoc FROM-CACHE
> Task :sdks:java:extensions:sql:zetasql:javadocJar
> Task :sdks:java:extensions:sql:zetasql:sourcesJar
> Task :sdks:java:extensions:sql:zetasql:compileTestJava FROM-CACHE
> Task :sdks:java:extensions:sql:zetasql:processTestResources NO-SOURCE
> Task :sdks:java:extensions:sql:zetasql:testClasses UP-TO-DATE
> Task :sdks:java:extensions:sql:zetasql:testJar
> Task :sdks:java:extensions:sql:zetasql:testSourcesJar
> Task :sdks:java:extensions:sql:zetasql:publishMavenJavaPublicationToApache.snapshots.httpsRepository
> Task :sdks:java:extensions:sql:zetasql:publishMavenJavaPublicationToTestPublicationLocalRepository
> Task :sdks:java:extensions:sql:zetasql:publish
> Task :sdks:java:io:debezium:expansion-service:generatePomFileForMavenJavaPublication
> Task :sdks:java:io:debezium:expansion-service:createCheckerFrameworkManifest
> Task :sdks:java:io:debezium:expansion-service:compileJava NO-SOURCE
> Task :sdks:java:io:debezium:expansion-service:processResources NO-SOURCE
> Task :sdks:java:io:debezium:expansion-service:classes UP-TO-DATE
> Task :sdks:java:io:debezium:expansion-service:javadoc NO-SOURCE
> Task :sdks:java:io:debezium:expansion-service:javadocJar
> Task :sdks:java:io:debezium:expansion-service:generatePomPropertiesFileForMavenJavaPublication
> Task :sdks:java:io:debezium:expansion-service:shadowJar
> Task :sdks:java:io:debezium:expansion-service:compileTestJava NO-SOURCE
> Task :sdks:java:io:debezium:expansion-service:processTestResources NO-SOURCE
> Task :sdks:java:io:debezium:expansion-service:testClasses UP-TO-DATE
> Task :sdks:java:io:debezium:expansion-service:shadowTestJar FROM-CACHE
> Task :sdks:java:io:debezium:expansion-service:sourcesJar
> Task :sdks:java:io:debezium:expansion-service:testSourcesJar
> Task :sdks:java:io:debezium:expansion-service:publishMavenJavaPublicationToApache.snapshots.httpsRepository
> Task :sdks:java:io:debezium:expansion-service:publishMavenJavaPublicationToTestPublicationLocalRepository
> Task :sdks:java:io:debezium:expansion-service:publish
> Task :sdks:java:io:google-cloud-platform:expansion-service:generatePomFileForMavenJavaPublication
> Task :sdks:java:io:google-cloud-platform:expansion-service:createCheckerFrameworkManifest
> Task :sdks:java:io:google-cloud-platform:expansion-service:compileJava NO-SOURCE
> Task :sdks:java:io:google-cloud-platform:expansion-service:processResources NO-SOURCE
> Task :sdks:java:io:google-cloud-platform:expansion-service:classes UP-TO-DATE
> Task :sdks:java:io:google-cloud-platform:expansion-service:javadoc NO-SOURCE
> Task :sdks:java:io:google-cloud-platform:expansion-service:javadocJar
> Task :sdks:java:io:google-cloud-platform:expansion-service:generatePomPropertiesFileForMavenJavaPublication
> Task :sdks:java:io:google-cloud-platform:expansion-service:shadowJar
> Task :sdks:java:io:google-cloud-platform:expansion-service:compileTestJava NO-SOURCE
> Task :sdks:java:io:google-cloud-platform:expansion-service:processTestResources NO-SOURCE
> Task :sdks:java:io:google-cloud-platform:expansion-service:testClasses UP-TO-DATE
> Task :sdks:java:io:google-cloud-platform:expansion-service:shadowTestJar FROM-CACHE
> Task :sdks:java:io:google-cloud-platform:expansion-service:sourcesJar
> Task :sdks:java:io:google-cloud-platform:expansion-service:testSourcesJar
> Task :sdks:java:io:google-cloud-platform:expansion-service:publishMavenJavaPublicationToApache.snapshots.httpsRepository
> Task :sdks:java:io:google-cloud-platform:expansion-service:publishMavenJavaPublicationToTestPublicationLocalRepository
> Task :sdks:java:io:google-cloud-platform:expansion-service:publish
> Task :sdks:java:io:kinesis:expansion-service:generatePomFileForMavenJavaPublication
> Task :sdks:java:io:kinesis:expansion-service:createCheckerFrameworkManifest
> Task :sdks:java:io:kinesis:expansion-service:compileJava NO-SOURCE
> Task :sdks:java:io:kinesis:expansion-service:processResources NO-SOURCE
> Task :sdks:java:io:kinesis:expansion-service:classes UP-TO-DATE
> Task :sdks:java:io:kinesis:expansion-service:javadoc NO-SOURCE
> Task :sdks:java:io:kinesis:expansion-service:javadocJar
> Task :sdks:java:io:kinesis:expansion-service:generatePomPropertiesFileForMavenJavaPublication
> Task :sdks:java:io:kinesis:expansion-service:shadowJar
> Task :sdks:java:io:kinesis:expansion-service:compileTestJava NO-SOURCE
> Task :sdks:java:io:kinesis:expansion-service:processTestResources NO-SOURCE
> Task :sdks:java:io:kinesis:expansion-service:testClasses UP-TO-DATE
> Task :sdks:java:io:kinesis:expansion-service:shadowTestJar FROM-CACHE
> Task :sdks:java:io:kinesis:expansion-service:sourcesJar
> Task :sdks:java:io:kinesis:expansion-service:testSourcesJar
> Task :sdks:java:io:kinesis:expansion-service:publishMavenJavaPublicationToApache.snapshots.httpsRepository
> Task :sdks:java:io:kinesis:expansion-service:publishMavenJavaPublicationToTestPublicationLocalRepository
> Task :sdks:java:io:kinesis:expansion-service:publish
> Task :sdks:java:io:snowflake:expansion-service:generatePomFileForMavenJavaPublication
> Task :sdks:java:io:snowflake:expansion-service:createCheckerFrameworkManifest
> Task :sdks:java:io:snowflake:expansion-service:compileJava NO-SOURCE
> Task :sdks:java:io:snowflake:expansion-service:processResources NO-SOURCE
> Task :sdks:java:io:snowflake:expansion-service:classes UP-TO-DATE
> Task :sdks:java:io:snowflake:expansion-service:javadoc NO-SOURCE
> Task :sdks:java:io:snowflake:expansion-service:javadocJar
> Task :sdks:java:io:snowflake:expansion-service:generatePomPropertiesFileForMavenJavaPublication
> Task :sdks:java:io:snowflake:expansion-service:shadowJar
> Task :sdks:java:io:snowflake:expansion-service:compileTestJava NO-SOURCE
> Task :sdks:java:io:snowflake:expansion-service:processTestResources NO-SOURCE
> Task :sdks:java:io:snowflake:expansion-service:testClasses UP-TO-DATE
> Task :sdks:java:io:snowflake:expansion-service:shadowTestJar FROM-CACHE
> Task :sdks:java:io:snowflake:expansion-service:sourcesJar
> Task :sdks:java:io:snowflake:expansion-service:testSourcesJar
> Task :sdks:java:io:snowflake:expansion-service:publishMavenJavaPublicationToApache.snapshots.httpsRepository
> Task :sdks:java:io:snowflake:expansion-service:publishMavenJavaPublicationToTestPublicationLocalRepository
> Task :sdks:java:io:snowflake:expansion-service:publish
FAILURE: Build failed with an exception.
* What went wrong:
Execution failed for task ':sdks:java:extensions:sql:hcatalog:compileJava'.
> Compilation failed; see the compiler error output for details.
* Try:
> Run with --stacktrace option to get the stack trace.
> Run with --info or --debug option to get more log output.
> Run with --scan to get full insights.
* Get more help at https://help.gradle.org
Deprecated Gradle features were used in this build, making it incompatible with Gradle 8.0.
You can use '--warning-mode all' to show the individual deprecation warnings and determine if they come from your own scripts or plugins.
See https://docs.gradle.org/7.3.2/userguide/command_line_interface.html#sec:command_line_warnings
Execution optimizations have been disabled for 16 invalid unit(s) of work during this build to ensure correctness.
Please consult deprecation warnings for more details.
BUILD FAILED in 42m 51s
1384 actionable tasks: 1103 executed, 271 from cache, 10 up-to-date
Publishing build scan...
https://gradle.com/s/7brh33quays6c
Build step 'Invoke Gradle script' changed build result to FAILURE
Build step 'Invoke Gradle script' marked build as failure
---------------------------------------------------------------------
To unsubscribe, e-mail: builds-unsubscribe@beam.apache.org
For additional commands, e-mail: builds-help@beam.apache.org
Build failed in Jenkins: beam_Release_NightlySnapshot #1456
Posted by Apache Jenkins Server <je...@builds.apache.org>.
See <https://ci-beam.apache.org/job/beam_Release_NightlySnapshot/1456/display/redirect?page=changes>
Changes:
[noreply] Update README.md
[marco.robles] Update README with latest PreCommit Jobs
[marco.robles] Update Postcommit jobs with latest jobs
[marco.robles] Update Performace job tests in readme
[marco.robles] update load job tests with latest updates
[marco.robles] update other jobs test with latest updates
[marco.robles] mismatch links fix
[marco.robles] update trigger phrase for some postCommit jobs
[marco.robles] correct trigger phrases in readme
[marco.robles] add pending jobs to readme
[noreply] Update README.md
[mmack] [BEAM-13246] Add support for S3 Bucket Key at the object level (AWS Sdk
[Kyle Weaver] [BEAM-12976] Log projection pushdown optimizations.
[benjamin.gonzalez] [BEAM-12572] Change jobs to run as cron jobs
[Ismaël Mejía] [BEAM-13839] Upgrade zstd-jni to version 1.5.2-1
[mmack] [BEAM-13840] Fix usage of legacy rawtypes in AWS modules
[alexander.zhuravlev] [BEAM-13820] Changed color of delete icon in pipeline options dropdown,
[noreply] [BEAM-11971] Revert "Fix timer consistency in direct runner" (#16748)
[noreply] [BEAM-13193] Aggregates fn api outbound data/timers of different
[noreply] [BEAM-13767] Migrate a bundle of grade tasks to use configuration
[noreply] Merge pull request #16653 from [BEAM-12164]: Add integration tests for
[noreply] Merge pull request #16728 from [BEAM-13823] Update docs for SnowflakeIO
[noreply] Merge pull request #16660 from [BEAM-13771][Playground] Send multifile
[noreply] Merge pull request #16646 from [BEAM-13643][Playground] Setup running
[noreply] [BEAM-13015] Add state caching benchmark and move benchmarks to their
[noreply] [BEAM-13419] Check for initialization in dataflow runner (#16765)
[noreply] Merge pull request #16701 from [BEAM-13786] [Playground] [Bugfix] Update
[noreply] Merge pull request #16754 from [BEAM-13838][Playground] Add logs in case
[noreply] [BEAM-13293] consistent naming for expansion service address and flag
[noreply] Merge pull request #16700 from [BEAM-13790][Playground] Change logic of
[Pablo Estrada] Output successful rows from BQ Streaming Inserts
[noreply] [BEAM-13830] update dependency for debeziumio expansion service (#16743)
[noreply] [BEAM-13761] consistent namings for expansion address in Debezium IO
[noreply] [BEAM-13806] Shutting down SchemaIO expansion services from Go VR
[noreply] [release-2.36.0] Update website/changelog for release 2.36.0 (#16627)
[noreply] [BEAM-13848] Update numpy intersphinx link (#16767)
[noreply] [release-23.6.0] Fix JIRA link for 2.36 blog (#16771)
[noreply] [BEAM-13647] Use role for Go worker binary. (#16729)
[schapman] BEAM-13439 Type annotation for ptransform_fn
[noreply] [BEAM-13606] Fail bundles with failed BigTable mutations (#16751)
[marco.robles] fix broken links in jobs & remove the invalid ones
[Kyle Weaver] Update Dataflow Python dev container images.
[Kiley Sok] Add java 17 to changes
[noreply] [BEAM-12914] Add missing 3.9 opcodes to type inference. (#16761)
[noreply] [BEAM-13321] Initial BigQueryIO externalization. (#16489)
[noreply] [BEAM-13193] Enable process bundle response elements embedding in Java
[noreply] [BEAM-13830] added a debeziumio_expansion_addr flag to GoSDK (#16780)
[noreply] Apply spotless. (#16783)
[Daniel Oliveira] [BEAM-13732] Switch x-lang BigQueryIO expansion service to GCP one.
[noreply] [BEAM-13858] Fix broken github action on :sdks:go:examples:wordCount
[Kiley Sok] add jira for runner v2
[noreply] [BEAM-13732] Go SDK BigQuery IO wrapper. Initial implementation.
[noreply] [BEAM-13732] Add example for Go BigQuery IO wrapper. (#16786)
[noreply] Update CHANGES.md with Go SDK milestones. (#16787)
[noreply] [BEAM-13193] Allow BeamFnDataOutboundObserver to flush elements.
------------------------------------------
[...truncated 565.28 KB...]
> Task :sdks:java:testing:nexmark:javadocJar
> Task :sdks:java:testing:nexmark:sourcesJar
> Task :sdks:java:testing:nexmark:compileTestJava
Note: Some input files use unchecked or unsafe operations.
Note: Recompile with -Xlint:unchecked for details.
> Task :sdks:java:testing:nexmark:processTestResources NO-SOURCE
> Task :sdks:java:testing:nexmark:testClasses
> Task :sdks:java:testing:nexmark:testJar
> Task :sdks:java:testing:nexmark:testSourcesJar
> Task :sdks:java:testing:nexmark:publishMavenJavaPublicationToApache.snapshots.httpsRepository
> Task :sdks:java:testing:nexmark:publishMavenJavaPublicationToTestPublicationLocalRepository
> Task :sdks:java:testing:nexmark:publish
> Task :sdks:java:testing:test-utils:javadoc
> Task :sdks:java:testing:test-utils:javadocJar
> Task :sdks:java:testing:test-utils:sourcesJar
> Task :sdks:java:testing:test-utils:testSourcesJar
> Task :sdks:java:testing:test-utils:publishMavenJavaPublicationToApache.snapshots.httpsRepository
> Task :sdks:java:testing:test-utils:publishMavenJavaPublicationToTestPublicationLocalRepository
> Task :sdks:java:testing:test-utils:publish
> Task :sdks:java:testing:tpcds:generatePomFileForMavenJavaPublication
> Task :sdks:java:testing:tpcds:createCheckerFrameworkManifest
> Task :sdks:java:testing:tpcds:compileJava
Note: <https://ci-beam.apache.org/job/beam_Release_NightlySnapshot/ws/src/sdks/java/testing/tpcds/src/main/java/org/apache/beam/sdk/tpcds/SqlTransformRunner.java> uses or overrides a deprecated API.
Note: Recompile with -Xlint:deprecation for details.
> Task :sdks:java:testing:tpcds:processResources
> Task :sdks:java:testing:tpcds:classes
> Task :sdks:java:testing:tpcds:generatePomPropertiesFileForMavenJavaPublication
> Task :sdks:java:testing:tpcds:jar
> Task :sdks:java:testing:tpcds:javadoc
> Task :sdks:java:testing:tpcds:javadocJar
> Task :sdks:java:testing:tpcds:sourcesJar
> Task :sdks:java:testing:tpcds:compileTestJava
> Task :sdks:java:testing:tpcds:processTestResources NO-SOURCE
> Task :sdks:java:testing:tpcds:testClasses
> Task :sdks:java:testing:tpcds:testJar
> Task :sdks:java:testing:tpcds:testSourcesJar
> Task :sdks:java:testing:tpcds:publishMavenJavaPublicationToApache.snapshots.httpsRepository
> Task :sdks:java:testing:tpcds:publishMavenJavaPublicationToTestPublicationLocalRepository
> Task :sdks:java:testing:tpcds:publish
> Task :sdks:java:extensions:sql:datacatalog:generatePomFileForMavenJavaPublication
> Task :sdks:java:extensions:sql:datacatalog:createCheckerFrameworkManifest
> Task :sdks:java:extensions:sql:datacatalog:compileJava
> Task :sdks:java:extensions:sql:datacatalog:processResources NO-SOURCE
> Task :sdks:java:extensions:sql:datacatalog:classes
> Task :sdks:java:extensions:sql:datacatalog:generatePomPropertiesFileForMavenJavaPublication
> Task :sdks:java:extensions:sql:datacatalog:jar
> Task :sdks:java:extensions:sql:datacatalog:javadoc
> Task :sdks:java:extensions:sql:datacatalog:javadocJar
> Task :sdks:java:extensions:sql:datacatalog:sourcesJar
> Task :runners:direct-java:jar
> Task :sdks:java:extensions:sql:datacatalog:compileTestJava
> Task :sdks:java:extensions:sql:datacatalog:processTestResources NO-SOURCE
> Task :sdks:java:extensions:sql:datacatalog:testClasses
> Task :sdks:java:extensions:sql:datacatalog:testJar
> Task :sdks:java:extensions:sql:datacatalog:testSourcesJar
> Task :sdks:java:extensions:sql:datacatalog:publishMavenJavaPublicationToApache.snapshots.httpsRepository
> Task :sdks:java:extensions:sql:datacatalog:publishMavenJavaPublicationToTestPublicationLocalRepository
> Task :sdks:java:extensions:sql:datacatalog:publish
> Task :sdks:java:extensions:sql:expansion-service:javadoc FROM-CACHE
> Task :sdks:java:extensions:sql:expansion-service:javadocJar
> Task :sdks:java:extensions:sql:expansion-service:compileTestJava NO-SOURCE
> Task :sdks:java:extensions:sql:expansion-service:processTestResources NO-SOURCE
> Task :sdks:java:extensions:sql:expansion-service:testClasses UP-TO-DATE
> Task :sdks:java:extensions:sql:expansion-service:shadowTestJar
> Task :sdks:java:extensions:sql:expansion-service:sourcesJar
> Task :sdks:java:extensions:sql:expansion-service:testSourcesJar
> Task :sdks:java:extensions:sql:expansion-service:publishMavenJavaPublicationToApache.snapshots.httpsRepository
> Task :sdks:java:extensions:sql:expansion-service:publishMavenJavaPublicationToTestPublicationLocalRepository
> Task :sdks:java:extensions:sql:expansion-service:publish
> Task :sdks:java:extensions:sql:hcatalog:generatePomFileForMavenJavaPublication
> Task :sdks:java:extensions:sql:hcatalog:compileJava FAILED
error: cannot access Statistic
class file for org.apache.beam.vendor.calcite.v1_28_0.org.apache.calcite.schema.Statistic not found
Consult the following stack trace for details.
com.sun.tools.javac.code.Symbol$CompletionFailure: class file for org.apache.beam.vendor.calcite.v1_28_0.org.apache.calcite.schema.Statistic not found
1 error
> Task :sdks:java:extensions:sql:hcatalog:processResources NO-SOURCE
> Task :sdks:java:extensions:sql:hcatalog:generatePomPropertiesFileForMavenJavaPublication
> Task :sdks:java:extensions:sql:hcatalog:sourcesJar
> Task :sdks:java:extensions:sql:hcatalog:processTestResources NO-SOURCE
> Task :sdks:java:extensions:sql:hcatalog:testSourcesJar
> Task :sdks:java:extensions:sql:jdbc:generatePomFileForMavenJavaPublication
> Task :sdks:java:extensions:sql:jdbc:createCheckerFrameworkManifest
> Task :sdks:java:extensions:sql:jdbc:compileJava FROM-CACHE
> Task :sdks:java:extensions:sql:jdbc:processResources
> Task :sdks:java:extensions:sql:jdbc:classes
> Task :sdks:java:extensions:sql:jdbc:javadoc FROM-CACHE
> Task :sdks:java:extensions:sql:jdbc:javadocJar
> Task :sdks:java:extensions:sql:jdbc:generatePomPropertiesFileForMavenJavaPublication
> Task :sdks:java:extensions:sql:jdbc:shadowJar
> Task :sdks:java:extensions:sql:jdbc:compileTestJava FROM-CACHE
> Task :sdks:java:extensions:sql:jdbc:processTestResources NO-SOURCE
> Task :sdks:java:extensions:sql:jdbc:testClasses UP-TO-DATE
> Task :sdks:java:extensions:sql:jdbc:shadowTestJar
> Task :sdks:java:extensions:sql:jdbc:sourcesJar
> Task :sdks:java:extensions:sql:jdbc:testSourcesJar
> Task :sdks:java:extensions:sql:jdbc:publishMavenJavaPublicationToApache.snapshots.httpsRepository
> Task :sdks:java:extensions:sql:jdbc:publishMavenJavaPublicationToTestPublicationLocalRepository
> Task :sdks:java:extensions:sql:jdbc:publish
> Task :sdks:java:extensions:sql:perf-tests:generatePomFileForMavenJavaPublication
> Task :sdks:java:extensions:sql:perf-tests:createCheckerFrameworkManifest
> Task :sdks:java:extensions:sql:perf-tests:compileJava NO-SOURCE
> Task :sdks:java:extensions:sql:perf-tests:processResources NO-SOURCE
> Task :sdks:java:extensions:sql:perf-tests:classes UP-TO-DATE
> Task :sdks:java:extensions:sql:perf-tests:generatePomPropertiesFileForMavenJavaPublication
> Task :sdks:java:extensions:sql:perf-tests:jar
> Task :sdks:java:extensions:sql:perf-tests:javadoc NO-SOURCE
> Task :sdks:java:extensions:sql:perf-tests:javadocJar
> Task :sdks:java:extensions:sql:perf-tests:sourcesJar
> Task :sdks:java:extensions:sql:perf-tests:compileTestJava FROM-CACHE
> Task :sdks:java:extensions:sql:perf-tests:processTestResources NO-SOURCE
> Task :sdks:java:extensions:sql:perf-tests:testClasses UP-TO-DATE
> Task :sdks:java:extensions:sql:perf-tests:testJar
> Task :sdks:java:extensions:sql:perf-tests:testSourcesJar
> Task :sdks:java:extensions:sql:perf-tests:publishMavenJavaPublicationToApache.snapshots.httpsRepository
> Task :sdks:java:extensions:sql:perf-tests:publishMavenJavaPublicationToTestPublicationLocalRepository
> Task :sdks:java:extensions:sql:perf-tests:publish
> Task :sdks:java:extensions:sql:udf:javadoc FROM-CACHE
> Task :sdks:java:extensions:sql:udf:javadocJar
> Task :sdks:java:extensions:sql:udf:sourcesJar
> Task :sdks:java:extensions:sql:udf:compileTestJava NO-SOURCE
> Task :sdks:java:extensions:sql:udf:processTestResources NO-SOURCE
> Task :sdks:java:extensions:sql:udf:testClasses UP-TO-DATE
> Task :sdks:java:extensions:sql:udf:testJar
> Task :sdks:java:extensions:sql:udf:testSourcesJar
> Task :sdks:java:extensions:sql:udf:publishMavenJavaPublicationToApache.snapshots.httpsRepository
> Task :sdks:java:extensions:sql:udf:publishMavenJavaPublicationToTestPublicationLocalRepository
> Task :sdks:java:extensions:sql:udf:publish
> Task :sdks:java:extensions:sql:zetasql:javadoc FROM-CACHE
> Task :sdks:java:extensions:sql:zetasql:javadocJar
> Task :sdks:java:extensions:sql:zetasql:sourcesJar
> Task :sdks:java:extensions:sql:zetasql:compileTestJava FROM-CACHE
> Task :sdks:java:extensions:sql:zetasql:processTestResources NO-SOURCE
> Task :sdks:java:extensions:sql:zetasql:testClasses UP-TO-DATE
> Task :sdks:java:extensions:sql:zetasql:testJar
> Task :sdks:java:extensions:sql:zetasql:testSourcesJar
> Task :sdks:java:extensions:sql:zetasql:publishMavenJavaPublicationToApache.snapshots.httpsRepository
> Task :sdks:java:extensions:sql:zetasql:publishMavenJavaPublicationToTestPublicationLocalRepository
> Task :sdks:java:extensions:sql:zetasql:publish
> Task :sdks:java:io:debezium:expansion-service:generatePomFileForMavenJavaPublication
> Task :sdks:java:io:debezium:expansion-service:createCheckerFrameworkManifest
> Task :sdks:java:io:debezium:expansion-service:compileJava NO-SOURCE
> Task :sdks:java:io:debezium:expansion-service:processResources NO-SOURCE
> Task :sdks:java:io:debezium:expansion-service:classes UP-TO-DATE
> Task :sdks:java:io:debezium:expansion-service:javadoc NO-SOURCE
> Task :sdks:java:io:debezium:expansion-service:javadocJar
> Task :sdks:java:io:debezium:expansion-service:generatePomPropertiesFileForMavenJavaPublication
> Task :sdks:java:io:debezium:expansion-service:shadowJar
> Task :sdks:java:io:debezium:expansion-service:compileTestJava NO-SOURCE
> Task :sdks:java:io:debezium:expansion-service:processTestResources NO-SOURCE
> Task :sdks:java:io:debezium:expansion-service:testClasses UP-TO-DATE
> Task :sdks:java:io:debezium:expansion-service:shadowTestJar
> Task :sdks:java:io:debezium:expansion-service:sourcesJar
> Task :sdks:java:io:debezium:expansion-service:testSourcesJar
> Task :sdks:java:io:debezium:expansion-service:publishMavenJavaPublicationToApache.snapshots.httpsRepository
> Task :sdks:java:io:debezium:expansion-service:publishMavenJavaPublicationToTestPublicationLocalRepository
> Task :sdks:java:io:debezium:expansion-service:publish
> Task :sdks:java:io:google-cloud-platform:expansion-service:generatePomFileForMavenJavaPublication
> Task :sdks:java:extensions:schemaio-expansion-service:jar
> Task :sdks:java:io:google-cloud-platform:expansion-service:createCheckerFrameworkManifest
> Task :sdks:java:io:google-cloud-platform:expansion-service:compileJava NO-SOURCE
> Task :sdks:java:io:google-cloud-platform:expansion-service:processResources NO-SOURCE
> Task :sdks:java:io:google-cloud-platform:expansion-service:classes UP-TO-DATE
> Task :sdks:java:io:google-cloud-platform:expansion-service:javadoc NO-SOURCE
> Task :sdks:java:io:google-cloud-platform:expansion-service:javadocJar
> Task :sdks:java:io:google-cloud-platform:expansion-service:generatePomPropertiesFileForMavenJavaPublication
> Task :sdks:java:io:google-cloud-platform:expansion-service:shadowJar
> Task :sdks:java:io:google-cloud-platform:expansion-service:compileTestJava NO-SOURCE
> Task :sdks:java:io:google-cloud-platform:expansion-service:processTestResources NO-SOURCE
> Task :sdks:java:io:google-cloud-platform:expansion-service:testClasses UP-TO-DATE
> Task :sdks:java:io:google-cloud-platform:expansion-service:shadowTestJar
> Task :sdks:java:io:google-cloud-platform:expansion-service:sourcesJar
> Task :sdks:java:io:google-cloud-platform:expansion-service:testSourcesJar
> Task :sdks:java:io:google-cloud-platform:expansion-service:publishMavenJavaPublicationToApache.snapshots.httpsRepository
> Task :sdks:java:io:google-cloud-platform:expansion-service:publishMavenJavaPublicationToTestPublicationLocalRepository
> Task :sdks:java:io:google-cloud-platform:expansion-service:publish
> Task :sdks:java:io:kinesis:expansion-service:generatePomFileForMavenJavaPublication
> Task :sdks:java:io:kinesis:expansion-service:createCheckerFrameworkManifest
> Task :sdks:java:io:kinesis:expansion-service:compileJava NO-SOURCE
> Task :sdks:java:io:kinesis:expansion-service:processResources NO-SOURCE
> Task :sdks:java:io:kinesis:expansion-service:classes UP-TO-DATE
> Task :sdks:java:io:kinesis:expansion-service:javadoc NO-SOURCE
> Task :sdks:java:io:kinesis:expansion-service:javadocJar
> Task :sdks:java:io:kinesis:expansion-service:generatePomPropertiesFileForMavenJavaPublication
> Task :sdks:java:io:kinesis:expansion-service:shadowJar
> Task :sdks:java:io:kinesis:expansion-service:compileTestJava NO-SOURCE
> Task :sdks:java:io:kinesis:expansion-service:processTestResources NO-SOURCE
> Task :sdks:java:io:kinesis:expansion-service:testClasses UP-TO-DATE
> Task :sdks:java:io:kinesis:expansion-service:shadowTestJar
> Task :sdks:java:io:kinesis:expansion-service:sourcesJar
> Task :sdks:java:io:kinesis:expansion-service:testSourcesJar
> Task :sdks:java:io:kinesis:expansion-service:publishMavenJavaPublicationToApache.snapshots.httpsRepository
> Task :sdks:java:io:kinesis:expansion-service:publishMavenJavaPublicationToTestPublicationLocalRepository
> Task :sdks:java:io:kinesis:expansion-service:publish
> Task :sdks:java:io:snowflake:expansion-service:generatePomFileForMavenJavaPublication
> Task :sdks:java:io:snowflake:expansion-service:createCheckerFrameworkManifest
> Task :sdks:java:io:snowflake:expansion-service:compileJava NO-SOURCE
> Task :sdks:java:io:snowflake:expansion-service:processResources NO-SOURCE
> Task :sdks:java:io:snowflake:expansion-service:classes UP-TO-DATE
> Task :sdks:java:io:snowflake:expansion-service:javadoc NO-SOURCE
> Task :sdks:java:io:snowflake:expansion-service:javadocJar
> Task :sdks:java:io:snowflake:expansion-service:generatePomPropertiesFileForMavenJavaPublication
> Task :sdks:java:io:snowflake:expansion-service:shadowJar
> Task :sdks:java:io:snowflake:expansion-service:compileTestJava NO-SOURCE
> Task :sdks:java:io:snowflake:expansion-service:processTestResources NO-SOURCE
> Task :sdks:java:io:snowflake:expansion-service:testClasses UP-TO-DATE
> Task :sdks:java:io:snowflake:expansion-service:shadowTestJar
> Task :sdks:java:io:snowflake:expansion-service:sourcesJar
> Task :sdks:java:io:snowflake:expansion-service:testSourcesJar
> Task :sdks:java:io:snowflake:expansion-service:publishMavenJavaPublicationToApache.snapshots.httpsRepository
> Task :sdks:java:io:snowflake:expansion-service:publishMavenJavaPublicationToTestPublicationLocalRepository
> Task :sdks:java:io:snowflake:expansion-service:publish
FAILURE: Build failed with an exception.
* What went wrong:
Execution failed for task ':sdks:java:extensions:sql:hcatalog:compileJava'.
> Compilation failed; see the compiler error output for details.
* Try:
> Run with --stacktrace option to get the stack trace.
> Run with --info or --debug option to get more log output.
> Run with --scan to get full insights.
* Get more help at https://help.gradle.org
Deprecated Gradle features were used in this build, making it incompatible with Gradle 8.0.
You can use '--warning-mode all' to show the individual deprecation warnings and determine if they come from your own scripts or plugins.
See https://docs.gradle.org/7.3.2/userguide/command_line_interface.html#sec:command_line_warnings
Execution optimizations have been disabled for 16 invalid unit(s) of work during this build to ensure correctness.
Please consult deprecation warnings for more details.
BUILD FAILED in 1h 47m 48s
1385 actionable tasks: 1357 executed, 18 from cache, 10 up-to-date
Publishing build scan...
https://gradle.com/s/5mc5pbalwytuy
Build step 'Invoke Gradle script' changed build result to FAILURE
Build step 'Invoke Gradle script' marked build as failure
---------------------------------------------------------------------
To unsubscribe, e-mail: builds-unsubscribe@beam.apache.org
For additional commands, e-mail: builds-help@beam.apache.org
Build failed in Jenkins: beam_Release_NightlySnapshot #1455
Posted by Apache Jenkins Server <je...@builds.apache.org>.
See <https://ci-beam.apache.org/job/beam_Release_NightlySnapshot/1455/display/redirect?page=changes>
Changes:
[noreply] Merge pull request #16726 from [BEAM-12164]: Parses change streams
[mmack] [BEAM-13147] Avoid nullness issue during init of AwsModule (AWS Sdk v2)
------------------------------------------
[...truncated 522.21 KB...]
> Task :sdks:java:testing:nexmark:sourcesJar
> Task :sdks:java:testing:nexmark:compileTestJava
Note: Some input files use unchecked or unsafe operations.
Note: Recompile with -Xlint:unchecked for details.
> Task :sdks:java:testing:nexmark:processTestResources NO-SOURCE
> Task :sdks:java:testing:nexmark:testClasses
> Task :sdks:java:testing:nexmark:testJar
> Task :sdks:java:testing:nexmark:testSourcesJar
> Task :sdks:java:testing:nexmark:publishMavenJavaPublicationToApache.snapshots.httpsRepository
> Task :sdks:java:testing:nexmark:publishMavenJavaPublicationToTestPublicationLocalRepository
> Task :sdks:java:testing:nexmark:publish
> Task :sdks:java:testing:test-utils:javadoc FROM-CACHE
> Task :sdks:java:testing:test-utils:javadocJar
> Task :sdks:java:testing:test-utils:sourcesJar
> Task :sdks:java:testing:test-utils:testSourcesJar
> Task :sdks:java:testing:test-utils:publishMavenJavaPublicationToApache.snapshots.httpsRepository
> Task :sdks:java:testing:test-utils:publishMavenJavaPublicationToTestPublicationLocalRepository
> Task :sdks:java:testing:test-utils:publish
> Task :sdks:java:testing:tpcds:generatePomFileForMavenJavaPublication
> Task :sdks:java:testing:tpcds:createCheckerFrameworkManifest
> Task :sdks:java:testing:tpcds:compileJava FROM-CACHE
> Task :sdks:java:testing:tpcds:processResources
> Task :sdks:java:testing:tpcds:classes
> Task :sdks:java:testing:tpcds:generatePomPropertiesFileForMavenJavaPublication
> Task :sdks:java:testing:tpcds:jar
> Task :sdks:java:testing:tpcds:javadoc
> Task :sdks:java:testing:tpcds:javadocJar
> Task :sdks:java:testing:tpcds:sourcesJar
> Task :sdks:java:testing:tpcds:compileTestJava
> Task :sdks:java:testing:tpcds:processTestResources NO-SOURCE
> Task :sdks:java:testing:tpcds:testClasses
> Task :sdks:java:testing:tpcds:testJar
> Task :sdks:java:testing:tpcds:testSourcesJar
> Task :sdks:java:testing:tpcds:publishMavenJavaPublicationToApache.snapshots.httpsRepository
> Task :sdks:java:testing:tpcds:publishMavenJavaPublicationToTestPublicationLocalRepository
> Task :sdks:java:testing:tpcds:publish
> Task :sdks:java:extensions:sql:datacatalog:generatePomFileForMavenJavaPublication
> Task :sdks:java:extensions:sql:datacatalog:createCheckerFrameworkManifest
> Task :sdks:java:extensions:sql:datacatalog:compileJava FROM-CACHE
> Task :sdks:java:extensions:sql:datacatalog:processResources NO-SOURCE
> Task :sdks:java:extensions:sql:datacatalog:classes UP-TO-DATE
> Task :sdks:java:extensions:sql:datacatalog:generatePomPropertiesFileForMavenJavaPublication
> Task :sdks:java:extensions:sql:datacatalog:jar
> Task :sdks:java:extensions:sql:datacatalog:javadoc
> Task :sdks:java:extensions:sql:datacatalog:javadocJar
> Task :sdks:java:extensions:sql:datacatalog:sourcesJar
> Task :runners:direct-java:jar
> Task :sdks:java:extensions:sql:datacatalog:compileTestJava FROM-CACHE
> Task :sdks:java:extensions:sql:datacatalog:processTestResources NO-SOURCE
> Task :sdks:java:extensions:sql:datacatalog:testClasses UP-TO-DATE
> Task :sdks:java:extensions:sql:datacatalog:testJar
> Task :sdks:java:extensions:sql:datacatalog:testSourcesJar
> Task :sdks:java:extensions:sql:datacatalog:publishMavenJavaPublicationToApache.snapshots.httpsRepository
> Task :sdks:java:extensions:sql:datacatalog:publishMavenJavaPublicationToTestPublicationLocalRepository
> Task :sdks:java:extensions:sql:datacatalog:publish
> Task :sdks:java:extensions:sql:expansion-service:javadoc FROM-CACHE
> Task :sdks:java:extensions:sql:expansion-service:javadocJar
> Task :sdks:java:extensions:sql:expansion-service:compileTestJava NO-SOURCE
> Task :sdks:java:extensions:sql:expansion-service:processTestResources NO-SOURCE
> Task :sdks:java:extensions:sql:expansion-service:testClasses UP-TO-DATE
> Task :sdks:java:extensions:sql:expansion-service:shadowTestJar
> Task :sdks:java:extensions:sql:expansion-service:sourcesJar
> Task :sdks:java:extensions:sql:expansion-service:testSourcesJar
> Task :sdks:java:extensions:sql:expansion-service:publishMavenJavaPublicationToApache.snapshots.httpsRepository
> Task :sdks:java:extensions:sql:expansion-service:publishMavenJavaPublicationToTestPublicationLocalRepository
> Task :sdks:java:extensions:sql:expansion-service:publish
> Task :sdks:java:extensions:sql:hcatalog:generatePomFileForMavenJavaPublication
> Task :sdks:java:extensions:sql:hcatalog:compileJava FAILED
error: cannot access Statistic
class file for org.apache.beam.vendor.calcite.v1_28_0.org.apache.calcite.schema.Statistic not found
Consult the following stack trace for details.
com.sun.tools.javac.code.Symbol$CompletionFailure: class file for org.apache.beam.vendor.calcite.v1_28_0.org.apache.calcite.schema.Statistic not found
1 error
> Task :sdks:java:extensions:sql:hcatalog:processResources NO-SOURCE
> Task :sdks:java:extensions:sql:hcatalog:generatePomPropertiesFileForMavenJavaPublication
> Task :sdks:java:extensions:sql:hcatalog:sourcesJar
> Task :sdks:java:extensions:sql:hcatalog:processTestResources NO-SOURCE
> Task :sdks:java:extensions:sql:hcatalog:testSourcesJar
> Task :sdks:java:extensions:sql:jdbc:generatePomFileForMavenJavaPublication
> Task :sdks:java:extensions:sql:jdbc:createCheckerFrameworkManifest
> Task :sdks:java:extensions:sql:jdbc:compileJava FROM-CACHE
> Task :sdks:java:extensions:sql:jdbc:processResources
> Task :sdks:java:extensions:sql:jdbc:classes
> Task :sdks:java:extensions:sql:jdbc:javadoc FROM-CACHE
> Task :sdks:java:extensions:sql:jdbc:javadocJar
> Task :sdks:java:extensions:sql:jdbc:generatePomPropertiesFileForMavenJavaPublication
> Task :sdks:java:extensions:sql:jdbc:shadowJar
> Task :sdks:java:extensions:sql:jdbc:compileTestJava
Note: <https://ci-beam.apache.org/job/beam_Release_NightlySnapshot/ws/src/sdks/java/extensions/sql/jdbc/src/test/java/org/apache/beam/sdk/extensions/sql/jdbc/BeamSqlLineIT.java> uses or overrides a deprecated API.
Note: Recompile with -Xlint:deprecation for details.
Note: Some input files use unchecked or unsafe operations.
Note: Recompile with -Xlint:unchecked for details.
> Task :sdks:java:extensions:sql:jdbc:processTestResources NO-SOURCE
> Task :sdks:java:extensions:sql:jdbc:testClasses
> Task :sdks:java:extensions:sql:jdbc:shadowTestJar
> Task :sdks:java:extensions:sql:jdbc:sourcesJar
> Task :sdks:java:extensions:sql:jdbc:testSourcesJar
> Task :sdks:java:extensions:sql:jdbc:publishMavenJavaPublicationToApache.snapshots.httpsRepository
> Task :sdks:java:extensions:sql:jdbc:publishMavenJavaPublicationToTestPublicationLocalRepository
> Task :sdks:java:extensions:sql:jdbc:publish
> Task :sdks:java:extensions:sql:perf-tests:generatePomFileForMavenJavaPublication
> Task :sdks:java:extensions:sql:perf-tests:createCheckerFrameworkManifest
> Task :sdks:java:extensions:sql:perf-tests:compileJava NO-SOURCE
> Task :sdks:java:extensions:sql:perf-tests:processResources NO-SOURCE
> Task :sdks:java:extensions:sql:perf-tests:classes UP-TO-DATE
> Task :sdks:java:extensions:sql:perf-tests:generatePomPropertiesFileForMavenJavaPublication
> Task :sdks:java:extensions:sql:perf-tests:jar
> Task :sdks:java:extensions:sql:perf-tests:javadoc NO-SOURCE
> Task :sdks:java:extensions:sql:perf-tests:javadocJar
> Task :sdks:java:extensions:sql:perf-tests:sourcesJar
> Task :sdks:java:extensions:sql:perf-tests:compileTestJava
> Task :sdks:java:extensions:sql:perf-tests:processTestResources NO-SOURCE
> Task :sdks:java:extensions:sql:perf-tests:testClasses
> Task :sdks:java:extensions:sql:perf-tests:testJar
> Task :sdks:java:extensions:sql:perf-tests:testSourcesJar
> Task :sdks:java:extensions:sql:perf-tests:publishMavenJavaPublicationToApache.snapshots.httpsRepository
> Task :sdks:java:extensions:sql:perf-tests:publishMavenJavaPublicationToTestPublicationLocalRepository
> Task :sdks:java:extensions:sql:perf-tests:publish
> Task :sdks:java:extensions:sql:udf:javadoc FROM-CACHE
> Task :sdks:java:extensions:sql:udf:javadocJar
> Task :sdks:java:extensions:sql:udf:sourcesJar
> Task :sdks:java:extensions:sql:udf:compileTestJava NO-SOURCE
> Task :sdks:java:extensions:sql:udf:processTestResources NO-SOURCE
> Task :sdks:java:extensions:sql:udf:testClasses UP-TO-DATE
> Task :sdks:java:extensions:sql:udf:testJar
> Task :sdks:java:extensions:sql:udf:testSourcesJar
> Task :sdks:java:extensions:sql:udf:publishMavenJavaPublicationToApache.snapshots.httpsRepository
> Task :sdks:java:extensions:sql:udf:publishMavenJavaPublicationToTestPublicationLocalRepository
> Task :sdks:java:extensions:sql:udf:publish
> Task :sdks:java:extensions:sql:zetasql:javadoc FROM-CACHE
> Task :sdks:java:extensions:sql:zetasql:javadocJar
> Task :sdks:java:extensions:sql:zetasql:sourcesJar
> Task :sdks:java:extensions:sql:zetasql:compileTestJava FROM-CACHE
> Task :sdks:java:extensions:sql:zetasql:processTestResources NO-SOURCE
> Task :sdks:java:extensions:sql:zetasql:testClasses UP-TO-DATE
> Task :sdks:java:extensions:sql:zetasql:testJar
> Task :sdks:java:extensions:sql:zetasql:testSourcesJar
> Task :sdks:java:extensions:sql:zetasql:publishMavenJavaPublicationToApache.snapshots.httpsRepository
> Task :sdks:java:extensions:sql:zetasql:publishMavenJavaPublicationToTestPublicationLocalRepository
> Task :sdks:java:extensions:sql:zetasql:publish
> Task :sdks:java:io:debezium:expansion-service:generatePomFileForMavenJavaPublication
> Task :sdks:java:io:debezium:expansion-service:createCheckerFrameworkManifest
> Task :sdks:java:io:debezium:expansion-service:compileJava NO-SOURCE
> Task :sdks:java:io:debezium:expansion-service:processResources NO-SOURCE
> Task :sdks:java:io:debezium:expansion-service:classes UP-TO-DATE
> Task :sdks:java:io:debezium:expansion-service:javadoc NO-SOURCE
> Task :sdks:java:io:debezium:expansion-service:javadocJar
> Task :sdks:java:io:debezium:expansion-service:generatePomPropertiesFileForMavenJavaPublication
> Task :sdks:java:io:debezium:expansion-service:shadowJar
> Task :sdks:java:io:debezium:expansion-service:compileTestJava NO-SOURCE
> Task :sdks:java:io:debezium:expansion-service:processTestResources NO-SOURCE
> Task :sdks:java:io:debezium:expansion-service:testClasses UP-TO-DATE
> Task :sdks:java:io:debezium:expansion-service:shadowTestJar FROM-CACHE
> Task :sdks:java:io:debezium:expansion-service:sourcesJar
> Task :sdks:java:io:debezium:expansion-service:testSourcesJar
> Task :sdks:java:io:debezium:expansion-service:publishMavenJavaPublicationToApache.snapshots.httpsRepository
> Task :sdks:java:io:debezium:expansion-service:publishMavenJavaPublicationToTestPublicationLocalRepository
> Task :sdks:java:io:debezium:expansion-service:publish
> Task :sdks:java:io:google-cloud-platform:expansion-service:generatePomFileForMavenJavaPublication
> Task :sdks:java:io:google-cloud-platform:expansion-service:createCheckerFrameworkManifest
> Task :sdks:java:io:google-cloud-platform:expansion-service:compileJava NO-SOURCE
> Task :sdks:java:io:google-cloud-platform:expansion-service:processResources NO-SOURCE
> Task :sdks:java:io:google-cloud-platform:expansion-service:classes UP-TO-DATE
> Task :sdks:java:io:google-cloud-platform:expansion-service:javadoc NO-SOURCE
> Task :sdks:java:io:google-cloud-platform:expansion-service:javadocJar
> Task :sdks:java:io:google-cloud-platform:expansion-service:generatePomPropertiesFileForMavenJavaPublication
> Task :sdks:java:io:google-cloud-platform:expansion-service:shadowJar
> Task :sdks:java:io:google-cloud-platform:expansion-service:compileTestJava NO-SOURCE
> Task :sdks:java:io:google-cloud-platform:expansion-service:processTestResources NO-SOURCE
> Task :sdks:java:io:google-cloud-platform:expansion-service:testClasses UP-TO-DATE
> Task :sdks:java:io:google-cloud-platform:expansion-service:shadowTestJar
> Task :sdks:java:io:google-cloud-platform:expansion-service:sourcesJar
> Task :sdks:java:io:google-cloud-platform:expansion-service:testSourcesJar
> Task :sdks:java:io:google-cloud-platform:expansion-service:publishMavenJavaPublicationToApache.snapshots.httpsRepository
> Task :sdks:java:io:google-cloud-platform:expansion-service:publishMavenJavaPublicationToTestPublicationLocalRepository
> Task :sdks:java:io:google-cloud-platform:expansion-service:publish
> Task :sdks:java:io:kinesis:expansion-service:generatePomFileForMavenJavaPublication
> Task :sdks:java:io:kinesis:expansion-service:createCheckerFrameworkManifest
> Task :sdks:java:io:kinesis:expansion-service:compileJava NO-SOURCE
> Task :sdks:java:io:kinesis:expansion-service:processResources NO-SOURCE
> Task :sdks:java:io:kinesis:expansion-service:classes UP-TO-DATE
> Task :sdks:java:io:kinesis:expansion-service:javadoc NO-SOURCE
> Task :sdks:java:io:kinesis:expansion-service:javadocJar
> Task :sdks:java:io:kinesis:expansion-service:generatePomPropertiesFileForMavenJavaPublication
> Task :sdks:java:io:kinesis:expansion-service:shadowJar
> Task :sdks:java:io:kinesis:expansion-service:compileTestJava NO-SOURCE
> Task :sdks:java:io:kinesis:expansion-service:processTestResources NO-SOURCE
> Task :sdks:java:io:kinesis:expansion-service:testClasses UP-TO-DATE
> Task :sdks:java:io:kinesis:expansion-service:shadowTestJar FROM-CACHE
> Task :sdks:java:io:kinesis:expansion-service:sourcesJar
> Task :sdks:java:io:kinesis:expansion-service:testSourcesJar
> Task :sdks:java:io:kinesis:expansion-service:publishMavenJavaPublicationToApache.snapshots.httpsRepository
> Task :sdks:java:io:kinesis:expansion-service:publishMavenJavaPublicationToTestPublicationLocalRepository
> Task :sdks:java:io:kinesis:expansion-service:publish
> Task :sdks:java:io:snowflake:expansion-service:generatePomFileForMavenJavaPublication
> Task :sdks:java:io:snowflake:expansion-service:createCheckerFrameworkManifest
> Task :sdks:java:io:snowflake:expansion-service:compileJava NO-SOURCE
> Task :sdks:java:io:snowflake:expansion-service:processResources NO-SOURCE
> Task :sdks:java:io:snowflake:expansion-service:classes UP-TO-DATE
> Task :sdks:java:io:snowflake:expansion-service:javadoc NO-SOURCE
> Task :sdks:java:io:snowflake:expansion-service:javadocJar
> Task :sdks:java:io:snowflake:expansion-service:generatePomPropertiesFileForMavenJavaPublication
> Task :sdks:java:io:snowflake:expansion-service:shadowJar
> Task :sdks:java:io:snowflake:expansion-service:compileTestJava NO-SOURCE
> Task :sdks:java:io:snowflake:expansion-service:processTestResources NO-SOURCE
> Task :sdks:java:io:snowflake:expansion-service:testClasses UP-TO-DATE
> Task :sdks:java:io:snowflake:expansion-service:shadowTestJar FROM-CACHE
> Task :sdks:java:io:snowflake:expansion-service:sourcesJar
> Task :sdks:java:io:snowflake:expansion-service:testSourcesJar
> Task :sdks:java:io:snowflake:expansion-service:publishMavenJavaPublicationToApache.snapshots.httpsRepository
> Task :sdks:java:io:snowflake:expansion-service:publishMavenJavaPublicationToTestPublicationLocalRepository
> Task :sdks:java:io:snowflake:expansion-service:publish
FAILURE: Build failed with an exception.
* What went wrong:
Execution failed for task ':sdks:java:extensions:sql:hcatalog:compileJava'.
> Compilation failed; see the compiler error output for details.
* Try:
> Run with --stacktrace option to get the stack trace.
> Run with --info or --debug option to get more log output.
> Run with --scan to get full insights.
* Get more help at https://help.gradle.org
Deprecated Gradle features were used in this build, making it incompatible with Gradle 8.0.
You can use '--warning-mode all' to show the individual deprecation warnings and determine if they come from your own scripts or plugins.
See https://docs.gradle.org/7.3.2/userguide/command_line_interface.html#sec:command_line_warnings
Execution optimizations have been disabled for 16 invalid unit(s) of work during this build to ensure correctness.
Please consult deprecation warnings for more details.
BUILD FAILED in 1h 3s
1384 actionable tasks: 1131 executed, 243 from cache, 10 up-to-date
Publishing build scan...
https://gradle.com/s/hsnk22gpfzgja
Build step 'Invoke Gradle script' changed build result to FAILURE
Build step 'Invoke Gradle script' marked build as failure
---------------------------------------------------------------------
To unsubscribe, e-mail: builds-unsubscribe@beam.apache.org
For additional commands, e-mail: builds-help@beam.apache.org