You are viewing a plain text version of this content. The canonical link for it is here.
Posted to dev@lucene.apache.org by Apache Jenkins Server <je...@builds.apache.org> on 2019/01/23 22:06:49 UTC
[JENKINS] Lucene-Solr-BadApples-Tests-master - Build # 268 -
Failure
Build: https://builds.apache.org/job/Lucene-Solr-BadApples-Tests-master/268/
3 tests failed.
FAILED: org.apache.solr.cloud.TestRequestForwarding.testMultiCollectionQuery
Error Message:
Query 'q=cat%3Afootball%5E2' failed,
Stack Trace:
java.lang.RuntimeException: Query 'q=cat%3Afootball%5E2' failed,
at __randomizedtesting.SeedInfo.seed([93DD85DA4A365311:82AE42EB9640566D]:0)
at org.apache.solr.cloud.TestRequestForwarding.testMultiCollectionQuery(TestRequestForwarding.java:67)
at sun.reflect.NativeMethodAccessorImpl.invoke0(Native Method)
at sun.reflect.NativeMethodAccessorImpl.invoke(NativeMethodAccessorImpl.java:62)
at sun.reflect.DelegatingMethodAccessorImpl.invoke(DelegatingMethodAccessorImpl.java:43)
at java.lang.reflect.Method.invoke(Method.java:498)
at com.carrotsearch.randomizedtesting.RandomizedRunner.invoke(RandomizedRunner.java:1750)
at com.carrotsearch.randomizedtesting.RandomizedRunner$8.evaluate(RandomizedRunner.java:938)
at com.carrotsearch.randomizedtesting.RandomizedRunner$9.evaluate(RandomizedRunner.java:974)
at com.carrotsearch.randomizedtesting.RandomizedRunner$10.evaluate(RandomizedRunner.java:988)
at com.carrotsearch.randomizedtesting.rules.SystemPropertiesRestoreRule$1.evaluate(SystemPropertiesRestoreRule.java:57)
at org.apache.lucene.util.TestRuleSetupTeardownChained$1.evaluate(TestRuleSetupTeardownChained.java:49)
at org.apache.lucene.util.AbstractBeforeAfterRule$1.evaluate(AbstractBeforeAfterRule.java:45)
at org.apache.lucene.util.TestRuleThreadAndTestName$1.evaluate(TestRuleThreadAndTestName.java:48)
at org.apache.lucene.util.TestRuleIgnoreAfterMaxFailures$1.evaluate(TestRuleIgnoreAfterMaxFailures.java:64)
at org.apache.lucene.util.TestRuleMarkFailure$1.evaluate(TestRuleMarkFailure.java:47)
at com.carrotsearch.randomizedtesting.rules.StatementAdapter.evaluate(StatementAdapter.java:36)
at com.carrotsearch.randomizedtesting.ThreadLeakControl$StatementRunner.run(ThreadLeakControl.java:368)
at com.carrotsearch.randomizedtesting.ThreadLeakControl.forkTimeoutingTask(ThreadLeakControl.java:817)
at com.carrotsearch.randomizedtesting.ThreadLeakControl$3.evaluate(ThreadLeakControl.java:468)
at com.carrotsearch.randomizedtesting.RandomizedRunner.runSingleTest(RandomizedRunner.java:947)
at com.carrotsearch.randomizedtesting.RandomizedRunner$5.evaluate(RandomizedRunner.java:832)
at com.carrotsearch.randomizedtesting.RandomizedRunner$6.evaluate(RandomizedRunner.java:883)
at com.carrotsearch.randomizedtesting.RandomizedRunner$7.evaluate(RandomizedRunner.java:894)
at com.carrotsearch.randomizedtesting.rules.StatementAdapter.evaluate(StatementAdapter.java:36)
at com.carrotsearch.randomizedtesting.rules.SystemPropertiesRestoreRule$1.evaluate(SystemPropertiesRestoreRule.java:57)
at org.apache.lucene.util.AbstractBeforeAfterRule$1.evaluate(AbstractBeforeAfterRule.java:45)
at com.carrotsearch.randomizedtesting.rules.StatementAdapter.evaluate(StatementAdapter.java:36)
at org.apache.lucene.util.TestRuleStoreClassName$1.evaluate(TestRuleStoreClassName.java:41)
at com.carrotsearch.randomizedtesting.rules.NoShadowingOrOverridesOnMethodsRule$1.evaluate(NoShadowingOrOverridesOnMethodsRule.java:40)
at com.carrotsearch.randomizedtesting.rules.NoShadowingOrOverridesOnMethodsRule$1.evaluate(NoShadowingOrOverridesOnMethodsRule.java:40)
at com.carrotsearch.randomizedtesting.rules.StatementAdapter.evaluate(StatementAdapter.java:36)
at com.carrotsearch.randomizedtesting.rules.StatementAdapter.evaluate(StatementAdapter.java:36)
at com.carrotsearch.randomizedtesting.rules.StatementAdapter.evaluate(StatementAdapter.java:36)
at org.apache.lucene.util.TestRuleAssertionsRequired$1.evaluate(TestRuleAssertionsRequired.java:53)
at org.apache.lucene.util.TestRuleMarkFailure$1.evaluate(TestRuleMarkFailure.java:47)
at org.apache.lucene.util.TestRuleIgnoreAfterMaxFailures$1.evaluate(TestRuleIgnoreAfterMaxFailures.java:64)
at org.apache.lucene.util.TestRuleIgnoreTestSuites$1.evaluate(TestRuleIgnoreTestSuites.java:54)
at com.carrotsearch.randomizedtesting.rules.StatementAdapter.evaluate(StatementAdapter.java:36)
at com.carrotsearch.randomizedtesting.ThreadLeakControl$StatementRunner.run(ThreadLeakControl.java:368)
at java.lang.Thread.run(Thread.java:748)
Caused by: java.io.IOException: Server returned HTTP response code: 503 for URL: http://127.0.0.1:40618/solr/collection1/select?q=cat%3Afootball%5E2
at sun.net.www.protocol.http.HttpURLConnection.getInputStream0(HttpURLConnection.java:1894)
at sun.net.www.protocol.http.HttpURLConnection.getInputStream(HttpURLConnection.java:1492)
at java.net.URL.openStream(URL.java:1045)
at org.apache.solr.cloud.TestRequestForwarding.testMultiCollectionQuery(TestRequestForwarding.java:65)
... 39 more
FAILED: org.apache.solr.cloud.autoscaling.MetricTriggerIntegrationTest.testMetricTrigger
Error Message:
The trigger did not fire at all
Stack Trace:
java.lang.AssertionError: The trigger did not fire at all
at __randomizedtesting.SeedInfo.seed([93DD85DA4A365311:29D1B25515DE855E]:0)
at org.junit.Assert.fail(Assert.java:88)
at org.junit.Assert.assertTrue(Assert.java:41)
at org.apache.solr.cloud.autoscaling.MetricTriggerIntegrationTest.testMetricTrigger(MetricTriggerIntegrationTest.java:196)
at sun.reflect.NativeMethodAccessorImpl.invoke0(Native Method)
at sun.reflect.NativeMethodAccessorImpl.invoke(NativeMethodAccessorImpl.java:62)
at sun.reflect.DelegatingMethodAccessorImpl.invoke(DelegatingMethodAccessorImpl.java:43)
at java.lang.reflect.Method.invoke(Method.java:498)
at com.carrotsearch.randomizedtesting.RandomizedRunner.invoke(RandomizedRunner.java:1750)
at com.carrotsearch.randomizedtesting.RandomizedRunner$8.evaluate(RandomizedRunner.java:938)
at com.carrotsearch.randomizedtesting.RandomizedRunner$9.evaluate(RandomizedRunner.java:974)
at com.carrotsearch.randomizedtesting.RandomizedRunner$10.evaluate(RandomizedRunner.java:988)
at com.carrotsearch.randomizedtesting.rules.SystemPropertiesRestoreRule$1.evaluate(SystemPropertiesRestoreRule.java:57)
at org.apache.lucene.util.TestRuleSetupTeardownChained$1.evaluate(TestRuleSetupTeardownChained.java:49)
at org.apache.lucene.util.AbstractBeforeAfterRule$1.evaluate(AbstractBeforeAfterRule.java:45)
at org.apache.lucene.util.TestRuleThreadAndTestName$1.evaluate(TestRuleThreadAndTestName.java:48)
at org.apache.lucene.util.TestRuleIgnoreAfterMaxFailures$1.evaluate(TestRuleIgnoreAfterMaxFailures.java:64)
at org.apache.lucene.util.TestRuleMarkFailure$1.evaluate(TestRuleMarkFailure.java:47)
at com.carrotsearch.randomizedtesting.rules.StatementAdapter.evaluate(StatementAdapter.java:36)
at com.carrotsearch.randomizedtesting.ThreadLeakControl$StatementRunner.run(ThreadLeakControl.java:368)
at com.carrotsearch.randomizedtesting.ThreadLeakControl.forkTimeoutingTask(ThreadLeakControl.java:817)
at com.carrotsearch.randomizedtesting.ThreadLeakControl$3.evaluate(ThreadLeakControl.java:468)
at com.carrotsearch.randomizedtesting.RandomizedRunner.runSingleTest(RandomizedRunner.java:947)
at com.carrotsearch.randomizedtesting.RandomizedRunner$5.evaluate(RandomizedRunner.java:832)
at com.carrotsearch.randomizedtesting.RandomizedRunner$6.evaluate(RandomizedRunner.java:883)
at com.carrotsearch.randomizedtesting.RandomizedRunner$7.evaluate(RandomizedRunner.java:894)
at com.carrotsearch.randomizedtesting.rules.StatementAdapter.evaluate(StatementAdapter.java:36)
at com.carrotsearch.randomizedtesting.rules.SystemPropertiesRestoreRule$1.evaluate(SystemPropertiesRestoreRule.java:57)
at org.apache.lucene.util.AbstractBeforeAfterRule$1.evaluate(AbstractBeforeAfterRule.java:45)
at com.carrotsearch.randomizedtesting.rules.StatementAdapter.evaluate(StatementAdapter.java:36)
at org.apache.lucene.util.TestRuleStoreClassName$1.evaluate(TestRuleStoreClassName.java:41)
at com.carrotsearch.randomizedtesting.rules.NoShadowingOrOverridesOnMethodsRule$1.evaluate(NoShadowingOrOverridesOnMethodsRule.java:40)
at com.carrotsearch.randomizedtesting.rules.NoShadowingOrOverridesOnMethodsRule$1.evaluate(NoShadowingOrOverridesOnMethodsRule.java:40)
at com.carrotsearch.randomizedtesting.rules.StatementAdapter.evaluate(StatementAdapter.java:36)
at com.carrotsearch.randomizedtesting.rules.StatementAdapter.evaluate(StatementAdapter.java:36)
at com.carrotsearch.randomizedtesting.rules.StatementAdapter.evaluate(StatementAdapter.java:36)
at org.apache.lucene.util.TestRuleAssertionsRequired$1.evaluate(TestRuleAssertionsRequired.java:53)
at org.apache.lucene.util.TestRuleMarkFailure$1.evaluate(TestRuleMarkFailure.java:47)
at org.apache.lucene.util.TestRuleIgnoreAfterMaxFailures$1.evaluate(TestRuleIgnoreAfterMaxFailures.java:64)
at org.apache.lucene.util.TestRuleIgnoreTestSuites$1.evaluate(TestRuleIgnoreTestSuites.java:54)
at com.carrotsearch.randomizedtesting.rules.StatementAdapter.evaluate(StatementAdapter.java:36)
at com.carrotsearch.randomizedtesting.ThreadLeakControl$StatementRunner.run(ThreadLeakControl.java:368)
at java.lang.Thread.run(Thread.java:748)
FAILED: org.apache.solr.client.solrj.embedded.SolrExampleStreamingTest.testCommitWithinOnDelete
Error Message:
expected:<1> but was:<0>
Stack Trace:
junit.framework.AssertionFailedError: expected:<1> but was:<0>
at __randomizedtesting.SeedInfo.seed([6D4C3E501DCAFB89:158C9E1C74911B2]:0)
at junit.framework.Assert.fail(Assert.java:57)
at junit.framework.Assert.failNotEquals(Assert.java:329)
at junit.framework.Assert.assertEquals(Assert.java:78)
at junit.framework.Assert.assertEquals(Assert.java:159)
at junit.framework.Assert.assertEquals(Assert.java:166)
at org.apache.solr.client.solrj.SolrExampleTestsBase.testCommitWithinOnDelete(SolrExampleTestsBase.java:147)
at sun.reflect.NativeMethodAccessorImpl.invoke0(Native Method)
at sun.reflect.NativeMethodAccessorImpl.invoke(NativeMethodAccessorImpl.java:62)
at sun.reflect.DelegatingMethodAccessorImpl.invoke(DelegatingMethodAccessorImpl.java:43)
at java.lang.reflect.Method.invoke(Method.java:498)
at com.carrotsearch.randomizedtesting.RandomizedRunner.invoke(RandomizedRunner.java:1750)
at com.carrotsearch.randomizedtesting.RandomizedRunner$8.evaluate(RandomizedRunner.java:938)
at com.carrotsearch.randomizedtesting.RandomizedRunner$9.evaluate(RandomizedRunner.java:974)
at com.carrotsearch.randomizedtesting.RandomizedRunner$10.evaluate(RandomizedRunner.java:988)
at com.carrotsearch.randomizedtesting.rules.SystemPropertiesRestoreRule$1.evaluate(SystemPropertiesRestoreRule.java:57)
at org.apache.lucene.util.TestRuleSetupTeardownChained$1.evaluate(TestRuleSetupTeardownChained.java:49)
at org.apache.lucene.util.AbstractBeforeAfterRule$1.evaluate(AbstractBeforeAfterRule.java:45)
at org.apache.lucene.util.TestRuleThreadAndTestName$1.evaluate(TestRuleThreadAndTestName.java:48)
at org.apache.lucene.util.TestRuleIgnoreAfterMaxFailures$1.evaluate(TestRuleIgnoreAfterMaxFailures.java:64)
at org.apache.lucene.util.TestRuleMarkFailure$1.evaluate(TestRuleMarkFailure.java:47)
at com.carrotsearch.randomizedtesting.rules.StatementAdapter.evaluate(StatementAdapter.java:36)
at com.carrotsearch.randomizedtesting.ThreadLeakControl$StatementRunner.run(ThreadLeakControl.java:368)
at com.carrotsearch.randomizedtesting.ThreadLeakControl.forkTimeoutingTask(ThreadLeakControl.java:817)
at com.carrotsearch.randomizedtesting.ThreadLeakControl$3.evaluate(ThreadLeakControl.java:468)
at com.carrotsearch.randomizedtesting.RandomizedRunner.runSingleTest(RandomizedRunner.java:947)
at com.carrotsearch.randomizedtesting.RandomizedRunner$5.evaluate(RandomizedRunner.java:832)
at com.carrotsearch.randomizedtesting.RandomizedRunner$6.evaluate(RandomizedRunner.java:883)
at com.carrotsearch.randomizedtesting.RandomizedRunner$7.evaluate(RandomizedRunner.java:894)
at com.carrotsearch.randomizedtesting.rules.StatementAdapter.evaluate(StatementAdapter.java:36)
at com.carrotsearch.randomizedtesting.rules.SystemPropertiesRestoreRule$1.evaluate(SystemPropertiesRestoreRule.java:57)
at org.apache.lucene.util.AbstractBeforeAfterRule$1.evaluate(AbstractBeforeAfterRule.java:45)
at com.carrotsearch.randomizedtesting.rules.StatementAdapter.evaluate(StatementAdapter.java:36)
at org.apache.lucene.util.TestRuleStoreClassName$1.evaluate(TestRuleStoreClassName.java:41)
at com.carrotsearch.randomizedtesting.rules.NoShadowingOrOverridesOnMethodsRule$1.evaluate(NoShadowingOrOverridesOnMethodsRule.java:40)
at com.carrotsearch.randomizedtesting.rules.NoShadowingOrOverridesOnMethodsRule$1.evaluate(NoShadowingOrOverridesOnMethodsRule.java:40)
at com.carrotsearch.randomizedtesting.rules.StatementAdapter.evaluate(StatementAdapter.java:36)
at com.carrotsearch.randomizedtesting.rules.StatementAdapter.evaluate(StatementAdapter.java:36)
at com.carrotsearch.randomizedtesting.rules.StatementAdapter.evaluate(StatementAdapter.java:36)
at org.apache.lucene.util.TestRuleAssertionsRequired$1.evaluate(TestRuleAssertionsRequired.java:53)
at org.apache.lucene.util.TestRuleMarkFailure$1.evaluate(TestRuleMarkFailure.java:47)
at org.apache.lucene.util.TestRuleIgnoreAfterMaxFailures$1.evaluate(TestRuleIgnoreAfterMaxFailures.java:64)
at org.apache.lucene.util.TestRuleIgnoreTestSuites$1.evaluate(TestRuleIgnoreTestSuites.java:54)
at com.carrotsearch.randomizedtesting.rules.StatementAdapter.evaluate(StatementAdapter.java:36)
at com.carrotsearch.randomizedtesting.ThreadLeakControl$StatementRunner.run(ThreadLeakControl.java:368)
at java.lang.Thread.run(Thread.java:748)
Build Log:
[...truncated 13042 lines...]
[junit4] Suite: org.apache.solr.cloud.autoscaling.MetricTriggerIntegrationTest
[junit4] 2> 634880 INFO (SUITE-MetricTriggerIntegrationTest-seed#[93DD85DA4A365311]-worker) [ ] o.a.s.SolrTestCaseJ4 SecureRandom sanity checks: test.solr.allowed.securerandom=null & java.security.egd=file:/dev/./urandom
[junit4] 2> Creating dataDir: /home/jenkins/jenkins-slave/workspace/Lucene-Solr-BadApples-Tests-master/solr/build/solr-core/test/J2/temp/solr.cloud.autoscaling.MetricTriggerIntegrationTest_93DD85DA4A365311-001/init-core-data-001
[junit4] 2> 634881 WARN (SUITE-MetricTriggerIntegrationTest-seed#[93DD85DA4A365311]-worker) [ ] o.a.s.SolrTestCaseJ4 startTrackingSearchers: numOpens=190 numCloses=190
[junit4] 2> 634885 INFO (SUITE-MetricTriggerIntegrationTest-seed#[93DD85DA4A365311]-worker) [ ] o.a.s.SolrTestCaseJ4 Using PointFields (NUMERIC_POINTS_SYSPROP=true) w/NUMERIC_DOCVALUES_SYSPROP=false
[junit4] 2> 634886 INFO (SUITE-MetricTriggerIntegrationTest-seed#[93DD85DA4A365311]-worker) [ ] o.a.s.SolrTestCaseJ4 Randomized ssl (false) and clientAuth (false) via: @org.apache.solr.util.RandomizeSSL(reason=, ssl=NaN, value=NaN, clientAuth=NaN)
[junit4] 2> 634887 INFO (SUITE-MetricTriggerIntegrationTest-seed#[93DD85DA4A365311]-worker) [ ] o.a.s.c.MiniSolrCloudCluster Starting cluster of 2 servers in /home/jenkins/jenkins-slave/workspace/Lucene-Solr-BadApples-Tests-master/solr/build/solr-core/test/J2/temp/solr.cloud.autoscaling.MetricTriggerIntegrationTest_93DD85DA4A365311-001/tempDir-001
[junit4] 2> 634887 INFO (SUITE-MetricTriggerIntegrationTest-seed#[93DD85DA4A365311]-worker) [ ] o.a.s.c.ZkTestServer STARTING ZK TEST SERVER
[junit4] 2> 634893 INFO (ZkTestServer Run Thread) [ ] o.a.s.c.ZkTestServer client port:0.0.0.0/0.0.0.0:0
[junit4] 2> 634893 INFO (ZkTestServer Run Thread) [ ] o.a.s.c.ZkTestServer Starting server
[junit4] 2> 634993 INFO (SUITE-MetricTriggerIntegrationTest-seed#[93DD85DA4A365311]-worker) [ ] o.a.s.c.ZkTestServer start zk server on port:37510
[junit4] 2> 634993 INFO (SUITE-MetricTriggerIntegrationTest-seed#[93DD85DA4A365311]-worker) [ ] o.a.s.c.ZkTestServer parse host and port list: 127.0.0.1:37510
[junit4] 2> 634993 INFO (SUITE-MetricTriggerIntegrationTest-seed#[93DD85DA4A365311]-worker) [ ] o.a.s.c.ZkTestServer connecting to 127.0.0.1 37510
[junit4] 2> 635018 INFO (zkConnectionManagerCallback-1504-thread-1) [ ] o.a.s.c.c.ConnectionManager zkClient has connected
[junit4] 2> 635029 INFO (zkConnectionManagerCallback-1506-thread-1) [ ] o.a.s.c.c.ConnectionManager zkClient has connected
[junit4] 2> 635031 INFO (zkConnectionManagerCallback-1508-thread-1) [ ] o.a.s.c.c.ConnectionManager zkClient has connected
[junit4] 2> 635039 WARN (jetty-launcher-1509-thread-2) [ ] o.e.j.s.AbstractConnector Ignoring deprecated socket close linger time
[junit4] 2> 635039 WARN (jetty-launcher-1509-thread-1) [ ] o.e.j.s.AbstractConnector Ignoring deprecated socket close linger time
[junit4] 2> 635039 INFO (jetty-launcher-1509-thread-1) [ ] o.a.s.c.s.e.JettySolrRunner Start Jetty (original configured port=0)
[junit4] 2> 635039 INFO (jetty-launcher-1509-thread-1) [ ] o.a.s.c.s.e.JettySolrRunner Trying to start Jetty on port 0 try number 1 ...
[junit4] 2> 635040 INFO (jetty-launcher-1509-thread-1) [ ] o.e.j.s.Server jetty-9.4.14.v20181114; built: 2018-11-14T21:20:31.478Z; git: c4550056e785fb5665914545889f21dc136ad9e6; jvm 1.8.0_191-b12
[junit4] 2> 635046 INFO (jetty-launcher-1509-thread-2) [ ] o.a.s.c.s.e.JettySolrRunner Start Jetty (original configured port=0)
[junit4] 2> 635046 INFO (jetty-launcher-1509-thread-2) [ ] o.a.s.c.s.e.JettySolrRunner Trying to start Jetty on port 0 try number 1 ...
[junit4] 2> 635046 INFO (jetty-launcher-1509-thread-2) [ ] o.e.j.s.Server jetty-9.4.14.v20181114; built: 2018-11-14T21:20:31.478Z; git: c4550056e785fb5665914545889f21dc136ad9e6; jvm 1.8.0_191-b12
[junit4] 2> 635050 INFO (jetty-launcher-1509-thread-1) [ ] o.e.j.s.session DefaultSessionIdManager workerName=node0
[junit4] 2> 635050 INFO (jetty-launcher-1509-thread-1) [ ] o.e.j.s.session No SessionScavenger set, using defaults
[junit4] 2> 635050 INFO (jetty-launcher-1509-thread-1) [ ] o.e.j.s.session node0 Scavenging every 600000ms
[junit4] 2> 635051 INFO (jetty-launcher-1509-thread-1) [ ] o.e.j.s.h.ContextHandler Started o.e.j.s.ServletContextHandler@6bb279af{/solr,null,AVAILABLE}
[junit4] 2> 635082 INFO (jetty-launcher-1509-thread-2) [ ] o.e.j.s.session DefaultSessionIdManager workerName=node0
[junit4] 2> 635082 INFO (jetty-launcher-1509-thread-2) [ ] o.e.j.s.session No SessionScavenger set, using defaults
[junit4] 2> 635082 INFO (jetty-launcher-1509-thread-2) [ ] o.e.j.s.session node0 Scavenging every 600000ms
[junit4] 2> 635082 INFO (jetty-launcher-1509-thread-2) [ ] o.e.j.s.h.ContextHandler Started o.e.j.s.ServletContextHandler@75fdc21{/solr,null,AVAILABLE}
[junit4] 2> 635086 INFO (jetty-launcher-1509-thread-2) [ ] o.e.j.s.AbstractConnector Started ServerConnector@3ad4bfc0{HTTP/1.1,[http/1.1, h2c]}{127.0.0.1:41138}
[junit4] 2> 635086 INFO (jetty-launcher-1509-thread-2) [ ] o.e.j.s.Server Started @635161ms
[junit4] 2> 635086 INFO (jetty-launcher-1509-thread-2) [ ] o.a.s.c.s.e.JettySolrRunner Jetty properties: {hostContext=/solr, hostPort=41138}
[junit4] 2> 635087 ERROR (jetty-launcher-1509-thread-2) [ ] o.a.s.u.StartupLoggingUtils Missing Java Option solr.log.dir. Logging may be missing or incomplete.
[junit4] 2> 635087 INFO (jetty-launcher-1509-thread-2) [ ] o.a.s.s.SolrDispatchFilter Using logger factory org.apache.logging.slf4j.Log4jLoggerFactory
[junit4] 2> 635087 INFO (jetty-launcher-1509-thread-2) [ ] o.a.s.s.SolrDispatchFilter ___ _ Welcome to Apache Solr™ version 9.0.0
[junit4] 2> 635087 INFO (jetty-launcher-1509-thread-2) [ ] o.a.s.s.SolrDispatchFilter / __| ___| |_ _ Starting in cloud mode on port null
[junit4] 2> 635087 INFO (jetty-launcher-1509-thread-2) [ ] o.a.s.s.SolrDispatchFilter \__ \/ _ \ | '_| Install dir: null
[junit4] 2> 635087 INFO (jetty-launcher-1509-thread-2) [ ] o.a.s.s.SolrDispatchFilter |___/\___/_|_| Start time: 2019-01-23T20:00:51.472Z
[junit4] 2> 635088 INFO (jetty-launcher-1509-thread-1) [ ] o.e.j.s.AbstractConnector Started ServerConnector@563550f0{HTTP/1.1,[http/1.1, h2c]}{127.0.0.1:46631}
[junit4] 2> 635088 INFO (jetty-launcher-1509-thread-1) [ ] o.e.j.s.Server Started @635162ms
[junit4] 2> 635088 INFO (jetty-launcher-1509-thread-1) [ ] o.a.s.c.s.e.JettySolrRunner Jetty properties: {hostContext=/solr, hostPort=46631}
[junit4] 2> 635088 ERROR (jetty-launcher-1509-thread-1) [ ] o.a.s.u.StartupLoggingUtils Missing Java Option solr.log.dir. Logging may be missing or incomplete.
[junit4] 2> 635088 INFO (jetty-launcher-1509-thread-1) [ ] o.a.s.s.SolrDispatchFilter Using logger factory org.apache.logging.slf4j.Log4jLoggerFactory
[junit4] 2> 635088 INFO (jetty-launcher-1509-thread-1) [ ] o.a.s.s.SolrDispatchFilter ___ _ Welcome to Apache Solr™ version 9.0.0
[junit4] 2> 635088 INFO (jetty-launcher-1509-thread-1) [ ] o.a.s.s.SolrDispatchFilter / __| ___| |_ _ Starting in cloud mode on port null
[junit4] 2> 635088 INFO (jetty-launcher-1509-thread-1) [ ] o.a.s.s.SolrDispatchFilter \__ \/ _ \ | '_| Install dir: null
[junit4] 2> 635088 INFO (jetty-launcher-1509-thread-1) [ ] o.a.s.s.SolrDispatchFilter |___/\___/_|_| Start time: 2019-01-23T20:00:51.473Z
[junit4] 2> 635091 INFO (zkConnectionManagerCallback-1511-thread-1) [ ] o.a.s.c.c.ConnectionManager zkClient has connected
[junit4] 2> 635091 INFO (zkConnectionManagerCallback-1513-thread-1) [ ] o.a.s.c.c.ConnectionManager zkClient has connected
[junit4] 2> 635092 INFO (jetty-launcher-1509-thread-2) [ ] o.a.s.s.SolrDispatchFilter solr.xml found in ZooKeeper. Loading...
[junit4] 2> 635092 INFO (jetty-launcher-1509-thread-1) [ ] o.a.s.s.SolrDispatchFilter solr.xml found in ZooKeeper. Loading...
[junit4] 2> 635152 INFO (jetty-launcher-1509-thread-2) [ ] o.a.s.h.c.HttpShardHandlerFactory Host whitelist initialized: WhitelistHostChecker [whitelistHosts=null, whitelistHostCheckingEnabled=true]
[junit4] 2> 635153 WARN (jetty-launcher-1509-thread-2) [ ] o.e.j.u.s.S.config No Client EndPointIdentificationAlgorithm configured for SslContextFactory@5caa3217[provider=null,keyStore=null,trustStore=null]
[junit4] 2> 635157 WARN (jetty-launcher-1509-thread-2) [ ] o.e.j.u.s.S.config No Client EndPointIdentificationAlgorithm configured for SslContextFactory@2934b0c6[provider=null,keyStore=null,trustStore=null]
[junit4] 2> 635158 INFO (jetty-launcher-1509-thread-2) [ ] o.a.s.c.ZkContainer Zookeeper client=127.0.0.1:37510/solr
[junit4] 2> 635160 INFO (zkConnectionManagerCallback-1519-thread-1) [ ] o.a.s.c.c.ConnectionManager zkClient has connected
[junit4] 2> 635166 INFO (zkConnectionManagerCallback-1521-thread-1) [ ] o.a.s.c.c.ConnectionManager zkClient has connected
[junit4] 2> 635187 INFO (jetty-launcher-1509-thread-1) [ ] o.a.s.h.c.HttpShardHandlerFactory Host whitelist initialized: WhitelistHostChecker [whitelistHosts=null, whitelistHostCheckingEnabled=true]
[junit4] 2> 635189 WARN (jetty-launcher-1509-thread-1) [ ] o.e.j.u.s.S.config No Client EndPointIdentificationAlgorithm configured for SslContextFactory@310f0c86[provider=null,keyStore=null,trustStore=null]
[junit4] 2> 635192 WARN (jetty-launcher-1509-thread-1) [ ] o.e.j.u.s.S.config No Client EndPointIdentificationAlgorithm configured for SslContextFactory@279f08d1[provider=null,keyStore=null,trustStore=null]
[junit4] 2> 635193 INFO (jetty-launcher-1509-thread-1) [ ] o.a.s.c.ZkContainer Zookeeper client=127.0.0.1:37510/solr
[junit4] 2> 635194 INFO (zkConnectionManagerCallback-1529-thread-1) [ ] o.a.s.c.c.ConnectionManager zkClient has connected
[junit4] 2> 635197 INFO (zkConnectionManagerCallback-1531-thread-1) [ ] o.a.s.c.c.ConnectionManager zkClient has connected
[junit4] 2> 635205 INFO (jetty-launcher-1509-thread-1) [n:127.0.0.1:46631_solr ] o.a.s.c.OverseerElectionContext I am going to be the leader 127.0.0.1:46631_solr
[junit4] 2> 635206 INFO (jetty-launcher-1509-thread-1) [n:127.0.0.1:46631_solr ] o.a.s.c.Overseer Overseer (id=74063719956611080-127.0.0.1:46631_solr-n_0000000000) starting
[junit4] 2> 635212 INFO (zkConnectionManagerCallback-1538-thread-1) [ ] o.a.s.c.c.ConnectionManager zkClient has connected
[junit4] 2> 635215 INFO (jetty-launcher-1509-thread-1) [n:127.0.0.1:46631_solr ] o.a.s.c.s.i.ZkClientClusterStateProvider Cluster at 127.0.0.1:37510/solr ready
[junit4] 2> 635215 INFO (OverseerStateUpdate-74063719956611080-127.0.0.1:46631_solr-n_0000000000) [n:127.0.0.1:46631_solr ] o.a.s.c.Overseer Starting to work on the main queue : 127.0.0.1:46631_solr
[junit4] 2> 635217 INFO (jetty-launcher-1509-thread-1) [n:127.0.0.1:46631_solr ] o.a.s.c.ZkController Register node as live in ZooKeeper:/live_nodes/127.0.0.1:46631_solr
[junit4] 2> 635217 DEBUG (OverseerAutoScalingTriggerThread-74063719956611080-127.0.0.1:46631_solr-n_0000000000) [ ] o.a.s.c.a.OverseerTriggerThread Adding .auto_add_replicas and .scheduled_maintenance triggers
[junit4] 2> 635219 DEBUG (OverseerAutoScalingTriggerThread-74063719956611080-127.0.0.1:46631_solr-n_0000000000) [ ] o.a.s.c.a.OverseerTriggerThread Refreshing /autoscaling.json with znode version 1
[junit4] 2> 635219 INFO (zkCallback-1530-thread-1) [ ] o.a.s.c.c.ZkStateReader Updated live nodes from ZooKeeper... (0) -> (1)
[junit4] 2> 635220 INFO (zkCallback-1537-thread-1) [ ] o.a.s.c.c.ZkStateReader Updated live nodes from ZooKeeper... (0) -> (1)
[junit4] 2> 635220 DEBUG (OverseerAutoScalingTriggerThread-74063719956611080-127.0.0.1:46631_solr-n_0000000000) [ ] o.a.s.c.a.OverseerTriggerThread Current znodeVersion 1, lastZnodeVersion 0
[junit4] 2> 635220 DEBUG (OverseerAutoScalingTriggerThread-74063719956611080-127.0.0.1:46631_solr-n_0000000000) [ ] o.a.s.c.a.OverseerTriggerThread Processed trigger updates upto znodeVersion 1
[junit4] 2> 635231 INFO (jetty-launcher-1509-thread-2) [n:127.0.0.1:41138_solr ] o.a.s.c.c.ZkStateReader Updated live nodes from ZooKeeper... (0) -> (1)
[junit4] 2> 635233 INFO (jetty-launcher-1509-thread-2) [n:127.0.0.1:41138_solr ] o.a.s.c.ZkController Publish node=127.0.0.1:41138_solr as DOWN
[junit4] 2> 635234 INFO (jetty-launcher-1509-thread-2) [n:127.0.0.1:41138_solr ] o.a.s.c.TransientSolrCoreCacheDefault Allocating transient cache for 2147483647 transient cores
[junit4] 2> 635234 INFO (jetty-launcher-1509-thread-2) [n:127.0.0.1:41138_solr ] o.a.s.c.ZkController Register node as live in ZooKeeper:/live_nodes/127.0.0.1:41138_solr
[junit4] 2> 635236 INFO (zkCallback-1530-thread-1) [ ] o.a.s.c.c.ZkStateReader Updated live nodes from ZooKeeper... (1) -> (2)
[junit4] 2> 635246 INFO (jetty-launcher-1509-thread-1) [n:127.0.0.1:46631_solr ] o.a.s.h.a.MetricsHistoryHandler No .system collection, keeping metrics history in memory.
[junit4] 2> 635246 INFO (zkCallback-1537-thread-1) [ ] o.a.s.c.c.ZkStateReader Updated live nodes from ZooKeeper... (1) -> (2)
[junit4] 2> 635246 INFO (zkCallback-1520-thread-1) [ ] o.a.s.c.c.ZkStateReader Updated live nodes from ZooKeeper... (1) -> (2)
[junit4] 2> 635250 DEBUG (OverseerAutoScalingTriggerThread-74063719956611080-127.0.0.1:46631_solr-n_0000000000) [ ] o.a.s.c.a.NodeLostTrigger NodeLostTrigger .auto_add_replicas - Initial livenodes: [127.0.0.1:46631_solr, 127.0.0.1:41138_solr]
[junit4] 2> 635250 DEBUG (OverseerAutoScalingTriggerThread-74063719956611080-127.0.0.1:46631_solr-n_0000000000) [ ] o.a.s.c.a.OverseerTriggerThread -- cleaning old nodeLost / nodeAdded markers
[junit4] 2> 635251 DEBUG (OverseerAutoScalingTriggerThread-74063719956611080-127.0.0.1:46631_solr-n_0000000000) [ ] o.a.s.c.a.OverseerTriggerThread Current znodeVersion 1, lastZnodeVersion 1
[junit4] 2> 635251 DEBUG (ScheduledTrigger-1328-thread-2) [ ] o.a.s.c.a.NodeLostTrigger Running NodeLostTrigger: .auto_add_replicas with currently live nodes: 2 and last live nodes: 2
[junit4] 2> 635270 INFO (zkConnectionManagerCallback-1544-thread-1) [ ] o.a.s.c.c.ConnectionManager zkClient has connected
[junit4] 2> 635272 INFO (jetty-launcher-1509-thread-2) [n:127.0.0.1:41138_solr ] o.a.s.c.c.ZkStateReader Updated live nodes from ZooKeeper... (0) -> (2)
[junit4] 2> 635273 INFO (jetty-launcher-1509-thread-2) [n:127.0.0.1:41138_solr ] o.a.s.c.s.i.ZkClientClusterStateProvider Cluster at 127.0.0.1:37510/solr ready
[junit4] 2> 635274 INFO (jetty-launcher-1509-thread-2) [n:127.0.0.1:41138_solr ] o.a.s.h.a.MetricsHistoryHandler No .system collection, keeping metrics history in memory.
[junit4] 2> 635276 INFO (jetty-launcher-1509-thread-1) [n:127.0.0.1:46631_solr ] o.a.s.m.r.SolrJmxReporter JMX monitoring for 'solr_46631.solr.node' (registry 'solr.node') enabled at server: com.sun.jmx.mbeanserver.JmxMBeanServer@14716b0
[junit4] 2> 635285 INFO (jetty-launcher-1509-thread-1) [n:127.0.0.1:46631_solr ] o.a.s.m.r.SolrJmxReporter JMX monitoring for 'solr_46631.solr.jvm' (registry 'solr.jvm') enabled at server: com.sun.jmx.mbeanserver.JmxMBeanServer@14716b0
[junit4] 2> 635285 INFO (jetty-launcher-1509-thread-1) [n:127.0.0.1:46631_solr ] o.a.s.m.r.SolrJmxReporter JMX monitoring for 'solr_46631.solr.jetty' (registry 'solr.jetty') enabled at server: com.sun.jmx.mbeanserver.JmxMBeanServer@14716b0
[junit4] 2> 635286 INFO (jetty-launcher-1509-thread-1) [n:127.0.0.1:46631_solr ] o.a.s.c.CorePropertiesLocator Found 0 core definitions underneath /home/jenkins/jenkins-slave/workspace/Lucene-Solr-BadApples-Tests-master/solr/build/solr-core/test/J2/temp/solr.cloud.autoscaling.MetricTriggerIntegrationTest_93DD85DA4A365311-001/tempDir-001/node1/.
[junit4] 2> 635288 INFO (jetty-launcher-1509-thread-2) [n:127.0.0.1:41138_solr ] o.a.s.m.r.SolrJmxReporter JMX monitoring for 'solr_41138.solr.node' (registry 'solr.node') enabled at server: com.sun.jmx.mbeanserver.JmxMBeanServer@14716b0
[junit4] 2> 635297 INFO (jetty-launcher-1509-thread-2) [n:127.0.0.1:41138_solr ] o.a.s.m.r.SolrJmxReporter JMX monitoring for 'solr_41138.solr.jvm' (registry 'solr.jvm') enabled at server: com.sun.jmx.mbeanserver.JmxMBeanServer@14716b0
[junit4] 2> 635297 INFO (jetty-launcher-1509-thread-2) [n:127.0.0.1:41138_solr ] o.a.s.m.r.SolrJmxReporter JMX monitoring for 'solr_41138.solr.jetty' (registry 'solr.jetty') enabled at server: com.sun.jmx.mbeanserver.JmxMBeanServer@14716b0
[junit4] 2> 635298 INFO (jetty-launcher-1509-thread-2) [n:127.0.0.1:41138_solr ] o.a.s.c.CorePropertiesLocator Found 0 core definitions underneath /home/jenkins/jenkins-slave/workspace/Lucene-Solr-BadApples-Tests-master/solr/build/solr-core/test/J2/temp/solr.cloud.autoscaling.MetricTriggerIntegrationTest_93DD85DA4A365311-001/tempDir-001/node2/.
[junit4] 2> 635335 INFO (zkConnectionManagerCallback-1550-thread-1) [ ] o.a.s.c.c.ConnectionManager zkClient has connected
[junit4] 2> 635337 INFO (SUITE-MetricTriggerIntegrationTest-seed#[93DD85DA4A365311]-worker) [ ] o.a.s.c.c.ZkStateReader Updated live nodes from ZooKeeper... (0) -> (2)
[junit4] 2> 635337 INFO (SUITE-MetricTriggerIntegrationTest-seed#[93DD85DA4A365311]-worker) [ ] o.a.s.c.s.i.ZkClientClusterStateProvider Cluster at 127.0.0.1:37510/solr ready
[junit4] 2> 635346 INFO (qtp1339625008-4569) [n:127.0.0.1:41138_solr ] o.a.s.s.HttpSolrCall [admin] webapp=null path=/admin/autoscaling params={wt=javabin&version=2} status=0 QTime=1
[junit4] 2> 635350 INFO (qtp1166699727-4560) [n:127.0.0.1:46631_solr ] o.a.s.s.HttpSolrCall [admin] webapp=null path=/admin/metrics params={prefix=CONTAINER.fs.usableSpace,CONTAINER.fs.totalSpace,CORE.coreName&wt=javabin&version=2&group=solr.node,solr.core} status=0 QTime=0
[junit4] 2> 635350 INFO (qtp1166699727-4561) [n:127.0.0.1:46631_solr ] o.a.s.s.HttpSolrCall [admin] webapp=null path=/admin/metrics params={prefix=CONTAINER.fs.usableSpace,CONTAINER.fs.totalSpace,CORE.coreName&wt=javabin&version=2&group=solr.node,solr.core} status=0 QTime=0
[junit4] 2> 635354 INFO (qtp1166699727-4562) [n:127.0.0.1:46631_solr ] o.a.s.s.HttpSolrCall [admin] webapp=null path=/admin/metrics params={prefix=CONTAINER.fs.usableSpace,CONTAINER.fs.totalSpace,CORE.coreName&wt=javabin&version=2&group=solr.node,solr.core} status=0 QTime=0
[junit4] 2> 635354 INFO (qtp1166699727-4563) [n:127.0.0.1:46631_solr ] o.a.s.s.HttpSolrCall [admin] webapp=null path=/admin/metrics params={prefix=CONTAINER.fs.usableSpace,CONTAINER.fs.totalSpace,CORE.coreName&wt=javabin&version=2&group=solr.node,solr.core} status=0 QTime=0
[junit4] 2> 635355 INFO (qtp1166699727-4559) [n:127.0.0.1:46631_solr ] o.a.s.s.HttpSolrCall [admin] webapp=null path=/admin/metrics params={prefix=CONTAINER.fs.usableSpace,CONTAINER.fs.totalSpace,CORE.coreName&wt=javabin&version=2&group=solr.node,solr.core} status=0 QTime=0
[junit4] 2> 635356 INFO (qtp1339625008-4572) [n:127.0.0.1:41138_solr ] o.a.s.s.HttpSolrCall [admin] webapp=null path=/admin/metrics params={prefix=CONTAINER.fs.usableSpace,CONTAINER.fs.totalSpace,CORE.coreName&wt=javabin&version=2&group=solr.node,solr.core} status=0 QTime=0
[junit4] 2> 635357 INFO (qtp1339625008-4568) [n:127.0.0.1:41138_solr ] o.a.s.s.HttpSolrCall [admin] webapp=null path=/admin/metrics params={prefix=CONTAINER.fs.usableSpace,CONTAINER.fs.totalSpace,CORE.coreName&wt=javabin&version=2&group=solr.node,solr.core} status=0 QTime=0
[junit4] 2> 635358 INFO (qtp1339625008-4569) [n:127.0.0.1:41138_solr ] o.a.s.s.HttpSolrCall [admin] webapp=null path=/admin/metrics params={prefix=CONTAINER.fs.usableSpace,CONTAINER.fs.totalSpace,CORE.coreName&wt=javabin&version=2&group=solr.node,solr.core} status=0 QTime=0
[junit4] 2> 635358 INFO (qtp1339625008-4571) [n:127.0.0.1:41138_solr ] o.a.s.s.HttpSolrCall [admin] webapp=null path=/admin/metrics params={prefix=CONTAINER.fs.usableSpace,CONTAINER.fs.totalSpace,CORE.coreName&wt=javabin&version=2&group=solr.node,solr.core} status=0 QTime=0
[junit4] 2> 635359 INFO (qtp1339625008-4572) [n:127.0.0.1:41138_solr ] o.a.s.s.HttpSolrCall [admin] webapp=null path=/admin/metrics params={prefix=CONTAINER.fs.usableSpace,CONTAINER.fs.totalSpace,CORE.coreName&wt=javabin&version=2&group=solr.node,solr.core} status=0 QTime=0
[junit4] 2> 635359 DEBUG (qtp1339625008-4570) [n:127.0.0.1:41138_solr ] o.a.s.c.a.AutoScalingHandler Verified autoscaling configuration
[junit4] 2> 635360 INFO (qtp1339625008-4570) [n:127.0.0.1:41138_solr ] o.a.s.s.HttpSolrCall [admin] webapp=null path=/admin/autoscaling params={wt=javabin&version=2} status=0 QTime=12
[junit4] 2> 635360 DEBUG (zkCallback-1537-thread-1) [ ] o.a.s.c.a.OverseerTriggerThread Refreshing /autoscaling.json with znode version 2
[junit4] 2> 635363 DEBUG (OverseerAutoScalingTriggerThread-74063719956611080-127.0.0.1:46631_solr-n_0000000000) [ ] o.a.s.c.a.OverseerTriggerThread Processed trigger updates upto znodeVersion 2
[junit4] 2> 635367 DEBUG (OverseerAutoScalingTriggerThread-74063719956611080-127.0.0.1:46631_solr-n_0000000000) [ ] o.a.s.c.a.OverseerTriggerThread -- cleaning old nodeLost / nodeAdded markers
[junit4] 2> 635369 DEBUG (OverseerAutoScalingTriggerThread-74063719956611080-127.0.0.1:46631_solr-n_0000000000) [ ] o.a.s.c.a.OverseerTriggerThread Current znodeVersion 2, lastZnodeVersion 2
[junit4] 2> 635381 INFO (TEST-MetricTriggerIntegrationTest.testMetricTrigger-seed#[93DD85DA4A365311]) [ ] o.a.s.SolrTestCaseJ4 ###Starting testMetricTrigger
[junit4] 2> 635383 INFO (qtp1166699727-4561) [n:127.0.0.1:46631_solr ] o.a.s.h.a.CollectionsHandler Invoked Collection Action :create with params collection.configName=conf&maxShardsPerNode=2&name=testMetricTrigger&nrtReplicas=2&action=CREATE&numShards=2&wt=javabin&version=2 and sendToOCPQueue=true
[junit4] 2> 635385 INFO (OverseerThreadFactory-1330-thread-1-processing-n:127.0.0.1:46631_solr) [n:127.0.0.1:46631_solr ] o.a.s.c.a.c.CreateCollectionCmd Create collection testMetricTrigger
[junit4] 2> 635499 DEBUG (OverseerThreadFactory-1330-thread-1-processing-n:127.0.0.1:46631_solr) [n:127.0.0.1:46631_solr ] o.a.s.c.s.c.a.PolicyHelper Creating a new session
[junit4] 2> 635502 INFO (qtp1166699727-4563) [n:127.0.0.1:46631_solr ] o.a.s.s.HttpSolrCall [admin] webapp=null path=/admin/metrics params={prefix=CONTAINER.fs.usableSpace,CONTAINER.fs.totalSpace,CORE.coreName&wt=javabin&version=2&group=solr.node,solr.core} status=0 QTime=0
[junit4] 2> 635503 INFO (qtp1166699727-4559) [n:127.0.0.1:46631_solr ] o.a.s.s.HttpSolrCall [admin] webapp=null path=/admin/metrics params={prefix=CONTAINER.fs.usableSpace,CONTAINER.fs.totalSpace,CORE.coreName&wt=javabin&version=2&group=solr.node,solr.core} status=0 QTime=0
[junit4] 2> 635504 INFO (qtp1166699727-4560) [n:127.0.0.1:46631_solr ] o.a.s.s.HttpSolrCall [admin] webapp=null path=/admin/metrics params={prefix=CONTAINER.fs.usableSpace,CONTAINER.fs.totalSpace,CORE.coreName&wt=javabin&version=2&group=solr.node,solr.core} status=0 QTime=0
[junit4] 2> 635504 INFO (qtp1166699727-4562) [n:127.0.0.1:46631_solr ] o.a.s.s.HttpSolrCall [admin] webapp=null path=/admin/metrics params={prefix=CONTAINER.fs.usableSpace,CONTAINER.fs.totalSpace,CORE.coreName&wt=javabin&version=2&group=solr.node,solr.core} status=0 QTime=0
[junit4] 2> 635505 INFO (qtp1166699727-4563) [n:127.0.0.1:46631_solr ] o.a.s.s.HttpSolrCall [admin] webapp=null path=/admin/metrics params={prefix=CONTAINER.fs.usableSpace,CONTAINER.fs.totalSpace,CORE.coreName&wt=javabin&version=2&group=solr.node,solr.core} status=0 QTime=0
[junit4] 2> 635506 INFO (qtp1339625008-4568) [n:127.0.0.1:41138_solr ] o.a.s.s.HttpSolrCall [admin] webapp=null path=/admin/metrics params={prefix=CONTAINER.fs.usableSpace,CONTAINER.fs.totalSpace,CORE.coreName&wt=javabin&version=2&group=solr.node,solr.core} status=0 QTime=0
[junit4] 2> 635507 INFO (qtp1339625008-4569) [n:127.0.0.1:41138_solr ] o.a.s.s.HttpSolrCall [admin] webapp=null path=/admin/metrics params={prefix=CONTAINER.fs.usableSpace,CONTAINER.fs.totalSpace,CORE.coreName&wt=javabin&version=2&group=solr.node,solr.core} status=0 QTime=0
[junit4] 2> 635507 INFO (qtp1339625008-4571) [n:127.0.0.1:41138_solr ] o.a.s.s.HttpSolrCall [admin] webapp=null path=/admin/metrics params={prefix=CONTAINER.fs.usableSpace,CONTAINER.fs.totalSpace,CORE.coreName&wt=javabin&version=2&group=solr.node,solr.core} status=0 QTime=0
[junit4] 2> 635508 INFO (qtp1339625008-4572) [n:127.0.0.1:41138_solr ] o.a.s.s.HttpSolrCall [admin] webapp=null path=/admin/metrics params={prefix=CONTAINER.fs.usableSpace,CONTAINER.fs.totalSpace,CORE.coreName&wt=javabin&version=2&group=solr.node,solr.core} status=0 QTime=0
[junit4] 2> 635509 INFO (qtp1339625008-4570) [n:127.0.0.1:41138_solr ] o.a.s.s.HttpSolrCall [admin] webapp=null path=/admin/metrics params={prefix=CONTAINER.fs.usableSpace,CONTAINER.fs.totalSpace,CORE.coreName&wt=javabin&version=2&group=solr.node,solr.core} status=0 QTime=0
[junit4] 2> 635509 DEBUG (OverseerThreadFactory-1330-thread-1-processing-n:127.0.0.1:46631_solr) [n:127.0.0.1:46631_solr ] o.a.s.c.s.c.a.PolicyHelper New session created
[junit4] 2> 635511 DEBUG (OverseerThreadFactory-1330-thread-1-processing-n:127.0.0.1:46631_solr) [n:127.0.0.1:46631_solr ] o.a.s.c.s.c.a.PolicyHelper returnSession, curr-time 30611052833 sessionWrapper.createTime 30611052831485089, this.sessionWrapper.createTime 30611052831485089
[junit4] 2> 635513 INFO (OverseerStateUpdate-74063719956611080-127.0.0.1:46631_solr-n_0000000000) [n:127.0.0.1:46631_solr ] o.a.s.c.o.SliceMutator createReplica() {
[junit4] 2> "operation":"ADDREPLICA",
[junit4] 2> "collection":"testMetricTrigger",
[junit4] 2> "shard":"shard1",
[junit4] 2> "core":"testMetricTrigger_shard1_replica_n1",
[junit4] 2> "state":"down",
[junit4] 2> "base_url":"http://127.0.0.1:41138/solr",
[junit4] 2> "type":"NRT",
[junit4] 2> "waitForFinalState":"false"}
[junit4] 2> 635531 INFO (OverseerStateUpdate-74063719956611080-127.0.0.1:46631_solr-n_0000000000) [n:127.0.0.1:46631_solr ] o.a.s.c.o.SliceMutator createReplica() {
[junit4] 2> "operation":"ADDREPLICA",
[junit4] 2> "collection":"testMetricTrigger",
[junit4] 2> "shard":"shard1",
[junit4] 2> "core":"testMetricTrigger_shard1_replica_n3",
[junit4] 2> "state":"down",
[junit4] 2> "base_url":"http://127.0.0.1:46631/solr",
[junit4] 2> "type":"NRT",
[junit4] 2> "waitForFinalState":"false"}
[junit4] 2> 635532 INFO (OverseerStateUpdate-74063719956611080-127.0.0.1:46631_solr-n_0000000000) [n:127.0.0.1:46631_solr ] o.a.s.c.o.SliceMutator createReplica() {
[junit4] 2> "operation":"ADDREPLICA",
[junit4] 2> "collection":"testMetricTrigger",
[junit4] 2> "shard":"shard2",
[junit4] 2> "core":"testMetricTrigger_shard2_replica_n4",
[junit4] 2> "state":"down",
[junit4] 2> "base_url":"http://127.0.0.1:46631/solr",
[junit4] 2> "type":"NRT",
[junit4] 2> "waitForFinalState":"false"}
[junit4] 2> 635533 INFO (OverseerStateUpdate-74063719956611080-127.0.0.1:46631_solr-n_0000000000) [n:127.0.0.1:46631_solr ] o.a.s.c.o.SliceMutator createReplica() {
[junit4] 2> "operation":"ADDREPLICA",
[junit4] 2> "collection":"testMetricTrigger",
[junit4] 2> "shard":"shard2",
[junit4] 2> "core":"testMetricTrigger_shard2_replica_n5",
[junit4] 2> "state":"down",
[junit4] 2> "base_url":"http://127.0.0.1:41138/solr",
[junit4] 2> "type":"NRT",
[junit4] 2> "waitForFinalState":"false"}
[junit4] 2> 635746 INFO (qtp1339625008-4568) [n:127.0.0.1:41138_solr x:testMetricTrigger_shard1_replica_n1] o.a.s.h.a.CoreAdminOperation core create command qt=/admin/cores&coreNodeName=core_node2&collection.configName=conf&newCollection=true&name=testMetricTrigger_shard1_replica_n1&action=CREATE&numShards=2&collection=testMetricTrigger&shard=shard1&wt=javabin&version=2&replicaType=NRT
[junit4] 2> 635783 INFO (qtp1166699727-4559) [n:127.0.0.1:46631_solr x:testMetricTrigger_shard1_replica_n3] o.a.s.h.a.CoreAdminOperation core create command qt=/admin/cores&coreNodeName=core_node6&collection.configName=conf&newCollection=true&name=testMetricTrigger_shard1_replica_n3&action=CREATE&numShards=2&collection=testMetricTrigger&shard=shard1&wt=javabin&version=2&replicaType=NRT
[junit4] 2> 635783 INFO (qtp1166699727-4559) [n:127.0.0.1:46631_solr x:testMetricTrigger_shard1_replica_n3] o.a.s.c.TransientSolrCoreCacheDefault Allocating transient cache for 2147483647 transient cores
[junit4] 2> 635789 INFO (qtp1166699727-4562) [n:127.0.0.1:46631_solr x:testMetricTrigger_shard2_replica_n4] o.a.s.h.a.CoreAdminOperation core create command qt=/admin/cores&coreNodeName=core_node7&collection.configName=conf&newCollection=true&name=testMetricTrigger_shard2_replica_n4&action=CREATE&numShards=2&collection=testMetricTrigger&shard=shard2&wt=javabin&version=2&replicaType=NRT
[junit4] 2> 635820 INFO (qtp1339625008-4571) [n:127.0.0.1:41138_solr x:testMetricTrigger_shard2_replica_n5] o.a.s.h.a.CoreAdminOperation core create command qt=/admin/cores&coreNodeName=core_node8&collection.configName=conf&newCollection=true&name=testMetricTrigger_shard2_replica_n5&action=CREATE&numShards=2&collection=testMetricTrigger&shard=shard2&wt=javabin&version=2&replicaType=NRT
[junit4] 2> 636253 DEBUG (ScheduledTrigger-1328-thread-1) [ ] o.a.s.c.a.NodeLostTrigger Running NodeLostTrigger: .auto_add_replicas with currently live nodes: 2 and last live nodes: 2
[junit4] 2> 636839 INFO (qtp1166699727-4562) [n:127.0.0.1:46631_solr c:testMetricTrigger s:shard2 r:core_node7 x:testMetricTrigger_shard2_replica_n4] o.a.s.c.SolrConfig Using Lucene MatchVersion: 9.0.0
[junit4] 2> 636846 INFO (qtp1166699727-4562) [n:127.0.0.1:46631_solr c:testMetricTrigger s:shard2 r:core_node7 x:testMetricTrigger_shard2_replica_n4] o.a.s.s.IndexSchema [testMetricTrigger_shard2_replica_n4] Schema name=minimal
[junit4] 2> 636863 INFO (qtp1166699727-4562) [n:127.0.0.1:46631_solr c:testMetricTrigger s:shard2 r:core_node7 x:testMetricTrigger_shard2_replica_n4] o.a.s.s.IndexSchema Loaded schema minimal/1.1 with uniqueid field id
[junit4] 2> 636863 INFO (qtp1166699727-4562) [n:127.0.0.1:46631_solr c:testMetricTrigger s:shard2 r:core_node7 x:testMetricTrigger_shard2_replica_n4] o.a.s.c.CoreContainer Creating SolrCore 'testMetricTrigger_shard2_replica_n4' using configuration from collection testMetricTrigger, trusted=true
[junit4] 2> 636864 INFO (qtp1166699727-4562) [n:127.0.0.1:46631_solr c:testMetricTrigger s:shard2 r:core_node7 x:testMetricTrigger_shard2_replica_n4] o.a.s.m.r.SolrJmxReporter JMX monitoring for 'solr_46631.solr.core.testMetricTrigger.shard2.replica_n4' (registry 'solr.core.testMetricTrigger.shard2.replica_n4') enabled at server: com.sun.jmx.mbeanserver.JmxMBeanServer@14716b0
[junit4] 2> 636864 INFO (qtp1166699727-4562) [n:127.0.0.1:46631_solr c:testMetricTrigger s:shard2 r:core_node7 x:testMetricTrigger_shard2_replica_n4] o.a.s.c.SolrCore [[testMetricTrigger_shard2_replica_n4] ] Opening new SolrCore at [/home/jenkins/jenkins-slave/workspace/Lucene-Solr-BadApples-Tests-master/solr/build/solr-core/test/J2/temp/solr.cloud.autoscaling.MetricTriggerIntegrationTest_93DD85DA4A365311-001/tempDir-001/node1/testMetricTrigger_shard2_replica_n4], dataDir=[/home/jenkins/jenkins-slave/workspace/Lucene-Solr-BadApples-Tests-master/solr/build/solr-core/test/J2/temp/solr.cloud.autoscaling.MetricTriggerIntegrationTest_93DD85DA4A365311-001/tempDir-001/node1/./testMetricTrigger_shard2_replica_n4/data/]
[junit4] 2> 636875 INFO (qtp1339625008-4571) [n:127.0.0.1:41138_solr c:testMetricTrigger s:shard2 r:core_node8 x:testMetricTrigger_shard2_replica_n5] o.a.s.c.SolrConfig Using Lucene MatchVersion: 9.0.0
[junit4] 2> 636877 INFO (qtp1339625008-4568) [n:127.0.0.1:41138_solr c:testMetricTrigger s:shard1 r:core_node2 x:testMetricTrigger_shard1_replica_n1] o.a.s.c.SolrConfig Using Lucene MatchVersion: 9.0.0
[junit4] 2> 636897 INFO (qtp1339625008-4571) [n:127.0.0.1:41138_solr c:testMetricTrigger s:shard2 r:core_node8 x:testMetricTrigger_shard2_replica_n5] o.a.s.s.IndexSchema [testMetricTrigger_shard2_replica_n5] Schema name=minimal
[junit4] 2> 636899 INFO (qtp1339625008-4568) [n:127.0.0.1:41138_solr c:testMetricTrigger s:shard1 r:core_node2 x:testMetricTrigger_shard1_replica_n1] o.a.s.s.IndexSchema [testMetricTrigger_shard1_replica_n1] Schema name=minimal
[junit4] 2> 636901 INFO (qtp1339625008-4568) [n:127.0.0.1:41138_solr c:testMetricTrigger s:shard1 r:core_node2 x:testMetricTrigger_shard1_replica_n1] o.a.s.s.IndexSchema Loaded schema minimal/1.1 with uniqueid field id
[junit4] 2> 636901 INFO (qtp1339625008-4568) [n:127.0.0.1:41138_solr c:testMetricTrigger s:shard1 r:core_node2 x:testMetricTrigger_shard1_replica_n1] o.a.s.c.CoreContainer Creating SolrCore 'testMetricTrigger_shard1_replica_n1' using configuration from collection testMetricTrigger, trusted=true
[junit4] 2> 636901 INFO (qtp1339625008-4568) [n:127.0.0.1:41138_solr c:testMetricTrigger s:shard1 r:core_node2 x:testMetricTrigger_shard1_replica_n1] o.a.s.m.r.SolrJmxReporter JMX monitoring for 'solr_41138.solr.core.testMetricTrigger.shard1.replica_n1' (registry 'solr.core.testMetricTrigger.shard1.replica_n1') enabled at server: com.sun.jmx.mbeanserver.JmxMBeanServer@14716b0
[junit4] 2> 636903 INFO (qtp1339625008-4571) [n:127.0.0.1:41138_solr c:testMetricTrigger s:shard2 r:core_node8 x:testMetricTrigger_shard2_replica_n5] o.a.s.s.IndexSchema Loaded schema minimal/1.1 with uniqueid field id
[junit4] 2> 636903 INFO (qtp1339625008-4571) [n:127.0.0.1:41138_solr c:testMetricTrigger s:shard2 r:core_node8 x:testMetricTrigger_shard2_replica_n5] o.a.s.c.CoreContainer Creating SolrCore 'testMetricTrigger_shard2_replica_n5' using configuration from collection testMetricTrigger, trusted=true
[junit4] 2> 636904 INFO (qtp1339625008-4571) [n:127.0.0.1:41138_solr c:testMetricTrigger s:shard2 r:core_node8 x:testMetricTrigger_shard2_replica_n5] o.a.s.m.r.SolrJmxReporter JMX monitoring for 'solr_41138.solr.core.testMetricTrigger.shard2.replica_n5' (registry 'solr.core.testMetricTrigger.shard2.replica_n5') enabled at server: com.sun.jmx.mbeanserver.JmxMBeanServer@14716b0
[junit4] 2> 636904 INFO (qtp1339625008-4571) [n:127.0.0.1:41138_solr c:testMetricTrigger s:shard2 r:core_node8 x:testMetricTrigger_shard2_replica_n5] o.a.s.c.SolrCore [[testMetricTrigger_shard2_replica_n5] ] Opening new SolrCore at [/home/jenkins/jenkins-slave/workspace/Lucene-Solr-BadApples-Tests-master/solr/build/solr-core/test/J2/temp/solr.cloud.autoscaling.MetricTriggerIntegrationTest_93DD85DA4A365311-001/tempDir-001/node2/testMetricTrigger_shard2_replica_n5], dataDir=[/home/jenkins/jenkins-slave/workspace/Lucene-Solr-BadApples-Tests-master/solr/build/solr-core/test/J2/temp/solr.cloud.autoscaling.MetricTriggerIntegrationTest_93DD85DA4A365311-001/tempDir-001/node2/./testMetricTrigger_shard2_replica_n5/data/]
[junit4] 2> 636905 INFO (qtp1166699727-4559) [n:127.0.0.1:46631_solr c:testMetricTrigger s:shard1 r:core_node6 x:testMetricTrigger_shard1_replica_n3] o.a.s.c.SolrConfig Using Lucene MatchVersion: 9.0.0
[junit4] 2> 636906 INFO (qtp1339625008-4568) [n:127.0.0.1:41138_solr c:testMetricTrigger s:shard1 r:core_node2 x:testMetricTrigger_shard1_replica_n1] o.a.s.c.SolrCore [[testMetricTrigger_shard1_replica_n1] ] Opening new SolrCore at [/home/jenkins/jenkins-slave/workspace/Lucene-Solr-BadApples-Tests-master/solr/build/solr-core/test/J2/temp/solr.cloud.autoscaling.MetricTriggerIntegrationTest_93DD85DA4A365311-001/tempDir-001/node2/testMetricTrigger_shard1_replica_n1], dataDir=[/home/jenkins/jenkins-slave/workspace/Lucene-Solr-BadApples-Tests-master/solr/build/solr-core/test/J2/temp/solr.cloud.autoscaling.MetricTriggerIntegrationTest_93DD85DA4A365311-001/tempDir-001/node2/./testMetricTrigger_shard1_replica_n1/data/]
[junit4] 2> 636933 INFO (qtp1166699727-4559) [n:127.0.0.1:46631_solr c:testMetricTrigger s:shard1 r:core_node6 x:testMetricTrigger_shard1_replica_n3] o.a.s.s.IndexSchema [testMetricTrigger_shard1_replica_n3] Schema name=minimal
[junit4] 2> 636935 INFO (qtp1166699727-4559) [n:127.0.0.1:46631_solr c:testMetricTrigger s:shard1 r:core_node6 x:testMetricTrigger_shard1_replica_n3] o.a.s.s.IndexSchema Loaded schema minimal/1.1 with uniqueid field id
[junit4] 2> 636935 INFO (qtp1166699727-4559) [n:127.0.0.1:46631_solr c:testMetricTrigger s:shard1 r:core_node6 x:testMetricTrigger_shard1_replica_n3] o.a.s.c.CoreContainer Creating SolrCore 'testMetricTrigger_shard1_replica_n3' using configuration from collection testMetricTrigger, trusted=true
[junit4] 2> 636935 INFO (qtp1166699727-4559) [n:127.0.0.1:46631_solr c:testMetricTrigger s:shard1 r:core_node6 x:testMetricTrigger_shard1_replica_n3] o.a.s.m.r.SolrJmxReporter JMX monitoring for 'solr_46631.solr.core.testMetricTrigger.shard1.replica_n3' (registry 'solr.core.testMetricTrigger.shard1.replica_n3') enabled at server: com.sun.jmx.mbeanserver.JmxMBeanServer@14716b0
[junit4] 2> 636935 INFO (qtp1166699727-4559) [n:127.0.0.1:46631_solr c:testMetricTrigger s:shard1 r:core_node6 x:testMetricTrigger_shard1_replica_n3] o.a.s.c.SolrCore [[testMetricTrigger_shard1_replica_n3] ] Opening new SolrCore at [/home/jenkins/jenkins-slave/workspace/Lucene-Solr-BadApples-Tests-master/solr/build/solr-core/test/J2/temp/solr.cloud.autoscaling.MetricTriggerIntegrationTest_93DD85DA4A365311-001/tempDir-001/node1/testMetricTrigger_shard1_replica_n3], dataDir=[/home/jenkins/jenkins-slave/workspace/Lucene-Solr-BadApples-Tests-master/solr/build/solr-core/test/J2/temp/solr.cloud.autoscaling.MetricTriggerIntegrationTest_93DD85DA4A365311-001/tempDir-001/node1/./testMetricTrigger_shard1_replica_n3/data/]
[junit4] 2> 637005 INFO (qtp1166699727-4562) [n:127.0.0.1:46631_solr c:testMetricTrigger s:shard2 r:core_node7 x:testMetricTrigger_shard2_replica_n4] o.a.s.u.UpdateHandler Using UpdateLog implementation: org.apache.solr.update.UpdateLog
[junit4] 2> 637005 INFO (qtp1166699727-4562) [n:127.0.0.1:46631_solr c:testMetricTrigger s:shard2 r:core_node7 x:testMetricTrigger_shard2_replica_n4] o.a.s.u.UpdateLog Initializing UpdateLog: dataDir=null defaultSyncLevel=FLUSH numRecordsToKeep=100 maxNumLogsToKeep=10 numVersionBuckets=65536
[junit4] 2> 637012 INFO (qtp1166699727-4562) [n:127.0.0.1:46631_solr c:testMetricTrigger s:shard2 r:core_node7 x:testMetricTrigger_shard2_replica_n4] o.a.s.u.CommitTracker Hard AutoCommit: disabled
[junit4] 2> 637012 INFO (qtp1166699727-4562) [n:127.0.0.1:46631_solr c:testMetricTrigger s:shard2 r:core_node7 x:testMetricTrigger_shard2_replica_n4] o.a.s.u.CommitTracker Soft AutoCommit: disabled
[junit4] 2> 637018 INFO (qtp1166699727-4562) [n:127.0.0.1:46631_solr c:testMetricTrigger s:shard2 r:core_node7 x:testMetricTrigger_shard2_replica_n4] o.a.s.s.SolrIndexSearcher Opening [Searcher@4b3ab383[testMetricTrigger_shard2_replica_n4] main]
[junit4] 2> 637019 INFO (qtp1166699727-4562) [n:127.0.0.1:46631_solr c:testMetricTrigger s:shard2 r:core_node7 x:testMetricTrigger_shard2_replica_n4] o.a.s.r.ManagedResourceStorage Configured ZooKeeperStorageIO with znodeBase: /configs/conf
[junit4] 2> 637019 INFO (qtp1166699727-4562) [n:127.0.0.1:46631_solr c:testMetricTrigger s:shard2 r:core_node7 x:testMetricTrigger_shard2_replica_n4] o.a.s.r.ManagedResourceStorage Loaded null at path _rest_managed.json using ZooKeeperStorageIO:path=/configs/conf
[junit4] 2> 637019 INFO (qtp1166699727-4562) [n:127.0.0.1:46631_solr c:testMetricTrigger s:shard2 r:core_node7 x:testMetricTrigger_shard2_replica_n4] o.a.s.h.ReplicationHandler Commits will be reserved for 10000ms.
[junit4] 2> 637019 INFO (qtp1166699727-4562) [n:127.0.0.1:46631_solr c:testMetricTrigger s:shard2 r:core_node7 x:testMetricTrigger_shard2_replica_n4] o.a.s.u.UpdateLog Could not find max version in index or recent updates, using new clock 1623482594391752704
[junit4] 2> 637034 INFO (searcherExecutor-1339-thread-1-processing-n:127.0.0.1:46631_solr x:testMetricTrigger_shard2_replica_n4 c:testMetricTrigger s:shard2 r:core_node7) [n:127.0.0.1:46631_solr c:testMetricTrigger s:shard2 r:core_node7 x:testMetricTrigger_shard2_replica_n4] o.a.s.c.SolrCore [testMetricTrigger_shard2_replica_n4] Registered new searcher Searcher@4b3ab383[testMetricTrigger_shard2_replica_n4] main{ExitableDirectoryReader(UninvertingDirectoryReader())}
[junit4] 2> 637034 INFO (qtp1339625008-4568) [n:127.0.0.1:41138_solr c:testMetricTrigger s:shard1 r:core_node2 x:testMetricTrigger_shard1_replica_n1] o.a.s.u.UpdateHandler Using UpdateLog implementation: org.apache.solr.update.UpdateLog
[junit4] 2> 637034 INFO (qtp1339625008-4568) [n:127.0.0.1:41138_solr c:testMetricTrigger s:shard1 r:core_node2 x:testMetricTrigger_shard1_replica_n1] o.a.s.u.UpdateLog Initializing UpdateLog: dataDir=null defaultSyncLevel=FLUSH numRecordsToKeep=100 maxNumLogsToKeep=10 numVersionBuckets=65536
[junit4] 2> 637036 INFO (qtp1339625008-4568) [n:127.0.0.1:41138_solr c:testMetricTrigger s:shard1 r:core_node2 x:testMetricTrigger_shard1_replica_n1] o.a.s.u.CommitTracker Hard AutoCommit: disabled
[junit4] 2> 637036 INFO (qtp1339625008-4568) [n:127.0.0.1:41138_solr c:testMetricTrigger s:shard1 r:core_node2 x:testMetricTrigger_shard1_replica_n1] o.a.s.u.CommitTracker Soft AutoCommit: disabled
[junit4] 2> 637039 INFO (qtp1166699727-4562) [n:127.0.0.1:46631_solr c:testMetricTrigger s:shard2 r:core_node7 x:testMetricTrigger_shard2_replica_n4] o.a.s.c.ZkShardTerms Successful update of terms at /collections/testMetricTrigger/terms/shard2 to Terms{values={core_node7=0}, version=0}
[junit4] 2> 637040 INFO (qtp1166699727-4562) [n:127.0.0.1:46631_solr c:testMetricTrigger s:shard2 r:core_node7 x:testMetricTrigger_shard2_replica_n4] o.a.s.c.ShardLeaderElectionContextBase make sure parent is created /collections/testMetricTrigger/leaders/shard2
[junit4] 2> 637042 INFO (qtp1166699727-4562) [n:127.0.0.1:46631_solr c:testMetricTrigger s:shard2 r:core_node7 x:testMetricTrigger_shard2_replica_n4] o.a.s.c.ShardLeaderElectionContext Waiting until we see more replicas up for shard shard2: total=2 found=1 timeoutin=9999ms
[junit4] 2> 637043 INFO (qtp1339625008-4568) [n:127.0.0.1:41138_solr c:testMetricTrigger s:shard1 r:core_node2 x:testMetricTrigger_shard1_replica_n1] o.a.s.s.SolrIndexSearcher Opening [Searcher@5f558b70[testMetricTrigger_shard1_replica_n1] main]
[junit4] 2> 637044 INFO (qtp1339625008-4568) [n:127.0.0.1:41138_solr c:testMetricTrigger s:shard1 r:core_node2 x:testMetricTrigger_shard1_replica_n1] o.a.s.r.ManagedResourceStorage Configured ZooKeeperStorageIO with znodeBase: /configs/conf
[junit4] 2> 637044 INFO (qtp1339625008-4568) [n:127.0.0.1:41138_solr c:testMetricTrigger s:shard1 r:core_node2 x:testMetricTrigger_shard1_replica_n1] o.a.s.r.ManagedResourceStorage Loaded null at path _rest_managed.json using ZooKeeperStorageIO:path=/configs/conf
[junit4] 2> 637044 INFO (qtp1339625008-4568) [n:127.0.0.1:41138_solr c:testMetricTrigger s:shard1 r:core_node2 x:testMetricTrigger_shard1_replica_n1] o.a.s.h.ReplicationHandler Commits will be reserved for 10000ms.
[junit4] 2> 637044 INFO (qtp1339625008-4568) [n:127.0.0.1:41138_solr c:testMetricTrigger s:shard1 r:core_node2 x:testMetricTrigger_shard1_replica_n1] o.a.s.u.UpdateLog Could not find max version in index or recent updates, using new clock 1623482594417967104
[junit4] 2> 637049 INFO (qtp1339625008-4568) [n:127.0.0.1:41138_solr c:testMetricTrigger s:shard1 r:core_node2 x:testMetricTrigger_shard1_replica_n1] o.a.s.c.ZkShardTerms Successful update of terms at /collections/testMetricTrigger/terms/shard1 to Terms{values={core_node2=0}, version=0}
[junit4] 2> 637049 INFO (qtp1339625008-4568) [n:127.0.0.1:41138_solr c:testMetricTrigger s:shard1 r:core_node2 x:testMetricTrigger_shard1_replica_n1] o.a.s.c.ShardLeaderElectionContextBase make sure parent is created /collections/testMetricTrigger/leaders/shard1
[junit4] 2> 637050 INFO (searcherExecutor-1340-thread-1-processing-n:127.0.0.1:41138_solr x:testMetricTrigger_shard1_replica_n1 c:testMetricTrigger s:shard1 r:core_node2) [n:127.0.0.1:41138_solr c:testMetricTrigger s:shard1 r:core_node2 x:testMetricTrigger_shard1_replica_n1] o.a.s.c.SolrCore [testMetricTrigger_shard1_replica_n1] Registered new searcher Searcher@5f558b70[testMetricTrigger_shard1_replica_n1] main{ExitableDirectoryReader(UninvertingDirectoryReader())}
[junit4] 2> 637066 INFO (qtp1166699727-4559) [n:127.0.0.1:46631_solr c:testMetricTrigger s:shard1 r:core_node6 x:testMetricTrigger_shard1_replica_n3] o.a.s.u.UpdateHandler Using UpdateLog implementation: org.apache.solr.update.UpdateLog
[junit4] 2> 637066 INFO (qtp1166699727-4559) [n:127.0.0.1:46631_solr c:testMetricTrigger s:shard1 r:core_node6 x:testMetricTrigger_shard1_replica_n3] o.a.s.u.UpdateLog Initializing UpdateLog: dataDir=null defaultSyncLevel=FLUSH numRecordsToKeep=100 maxNumLogsToKeep=10 numVersionBuckets=65536
[junit4] 2> 637068 INFO (qtp1166699727-4559) [n:127.0.0.1:46631_solr c:testMetricTrigger s:shard1 r:core_node6 x:testMetricTrigger_shard1_replica_n3] o.a.s.u.CommitTracker Hard AutoCommit: disabled
[junit4] 2> 637068 INFO (qtp1166699727-4559) [n:127.0.0.1:46631_solr c:testMetricTrigger s:shard1 r:core_node6 x:testMetricTrigger_shard1_replica_n3] o.a.s.u.CommitTracker Soft AutoCommit: disabled
[junit4] 2> 637069 INFO (qtp1166699727-4559) [n:127.0.0.1:46631_solr c:testMetricTrigger s:shard1 r:core_node6 x:testMetricTrigger_shard1_replica_n3] o.a.s.s.SolrIndexSearcher Opening [Searcher@3fe8a0bf[testMetricTrigger_shard1_replica_n3] main]
[junit4] 2> 637071 INFO (qtp1166699727-4559) [n:127.0.0.1:46631_solr c:testMetricTrigger s:shard1 r:core_node6 x:testMetricTrigger_shard1_replica_n3] o.a.s.r.ManagedResourceStorage Configured ZooKeeperStorageIO with znodeBase: /configs/conf
[junit4] 2> 637071 INFO (qtp1166699727-4559) [n:127.0.0.1:46631_solr c:testMetricTrigger s:shard1 r:core_node6 x:testMetricTrigger_shard1_replica_n3] o.a.s.r.ManagedResourceStorage Loaded null at path _rest_managed.json using ZooKeeperStorageIO:path=/configs/conf
[junit4] 2> 637071 INFO (qtp1166699727-4559) [n:127.0.0.1:46631_solr c:testMetricTrigger s:shard1 r:core_node6 x:testMetricTrigger_shard1_replica_n3] o.a.s.h.ReplicationHandler Commits will be reserved for 10000ms.
[junit4] 2> 637072 INFO (qtp1166699727-4559) [n:127.0.0.1:46631_solr c:testMetricTrigger s:shard1 r:core_node6 x:testMetricTrigger_shard1_replica_n3] o.a.s.u.UpdateLog Could not find max version in index or recent updates, using new clock 1623482594447327232
[junit4] 2> 637081 INFO (qtp1339625008-4568) [n:127.0.0.1:41138_solr c:testMetricTrigger s:shard1 r:core_node2 x:testMetricTrigger_shard1_replica_n1] o.a.s.c.ShardLeaderElectionContext Waiting until we see more replicas up for shard shard1: total=2 found=1 timeoutin=9999ms
[junit4] 2> 637087 INFO (qtp1339625008-4571) [n:127.0.0.1:41138_solr c:testMetricTrigger s:shard2 r:core_node8 x:testMetricTrigger_shard2_replica_n5] o.a.s.u.UpdateHandler Using UpdateLog implementation: org.apache.solr.update.UpdateLog
[junit4] 2> 637087 INFO (qtp1339625008-4571) [n:127.0.0.1:41138_solr c:testMetricTrigger s:shard2 r:core_node8 x:testMetricTrigger_shard2_replica_n5] o.a.s.u.UpdateLog Initializing UpdateLog: dataDir=null defaultSyncLevel=FLUSH numRecordsToKeep=100 maxNumLogsToKeep=10 numVersionBuckets=65536
[junit4] 2> 637089 INFO (qtp1339625008-4571) [n:127.0.0.1:41138_solr c:testMetricTrigger s:shard2 r:core_node8 x:testMetricTrigger_shard2_replica_n5] o.a.s.u.CommitTracker Hard AutoCommit: disabled
[junit4] 2> 637089 INFO (qtp1339625008-4571) [n:127.0.0.1:41138_solr c:testMetricTrigger s:shard2 r:core_node8 x:testMetricTrigger_shard2_replica_n5] o.a.s.u.CommitTracker Soft AutoCommit: disabled
[junit4] 2> 637099 INFO (searcherExecutor-1342-thread-1-processing-n:127.0.0.1:46631_solr x:testMetricTrigger_shard1_replica_n3 c:testMetricTrigger s:shard1 r:core_node6) [n:127.0.0.1:46631_solr c:testMetricTrigger s:shard1 r:core_node6 x:testMetricTrigger_shard1_replica_n3] o.a.s.c.SolrCore [testMetricTrigger_shard1_replica_n3] Registered new searcher Searcher@3fe8a0bf[testMetricTrigger_shard1_replica_n3] main{ExitableDirectoryReader(UninvertingDirectoryReader())}
[junit4] 2> 637099 INFO (qtp1339625008-4571) [n:127.0.0.1:41138_solr c:testMetricTrigger s:shard2 r:core_node8 x:testMetricTrigger_shard2_replica_n5] o.a.s.s.SolrIndexSearcher Opening [Searcher@635f6884[testMetricTrigger_shard2_replica_n5] main]
[junit4] 2> 637103 INFO (qtp1166699727-4559) [n:127.0.0.1:46631_solr c:testMetricTrigger s:shard1 r:core_node6 x:testMetricTrigger_shard1_replica_n3] o.a.s.c.ZkShardTerms Successful update of terms at /collections/testMetricTrigger/terms/shard1 to Terms{values={core_node2=0, core_node6=0}, version=1}
[junit4] 2> 637104 INFO (qtp1166699727-4559) [n:127.0.0.1:46631_solr c:testMetricTrigger s:shard1 r:core_node6 x:testMetricTrigger_shard1_replica_n3] o.a.s.c.ShardLeaderElectionContextBase make sure parent is created /collections/testMetricTrigger/leaders/shard1
[junit4] 2> 637104 INFO (qtp1339625008-4571) [n:127.0.0.1:41138_solr c:testMetricTrigger s:shard2 r:core_node8 x:testMetricTrigger_shard2_replica_n5] o.a.s.r.ManagedResourceStorage Configured ZooKeeperStorageIO with znodeBase: /configs/conf
[junit4] 2> 637105 INFO (qtp1339625008-4571) [n:127.0.0.1:41138_solr c:testMetricTrigger s:shard2 r:core_node8 x:testMetricTrigger_shard2_replica_n5] o.a.s.r.ManagedResourceStorage Loaded null at path _rest_managed.json using ZooKeeperStorageIO:path=/configs/conf
[junit4] 2> 637106 INFO (qtp1339625008-4571) [n:127.0.0.1:41138_solr c:testMetricTrigger s:shard2 r:core_node8 x:testMetricTrigger_shard2_replica_n5] o.a.s.h.ReplicationHandler Commits will be reserved for 10000ms.
[junit4] 2> 637106 INFO (qtp1339625008-4571) [n:127.0.0.1:41138_solr c:testMetricTrigger s:shard2 r:core_node8 x:testMetricTrigger_shard2_replica_n5] o.a.s.u.UpdateLog Could not find max version in index or recent updates, using new clock 1623482594482978816
[junit4] 2> 637109 INFO (searcherExecutor-1341-thread-1-processing-n:127.0.0.1:41138_solr x:testMetricTrigger_shard2_replica_n5 c:testMetricTrigger s:shard2 r:core_node8) [n:127.0.0.1:41138_solr c:testMetricTrigger s:shard2 r:core_node8 x:testMetricTrigger_shard2_replica_n5] o.a.s.c.SolrCore [testMetricTrigger_shard2_replica_n5] Registered new searcher Searcher@635f6884[testMetricTrigger_shard2_replica_n5] main{ExitableDirectoryReader(UninvertingDirectoryReader())}
[junit4] 2> 637116 INFO (qtp1339625008-4571) [n:127.0.0.1:41138_solr c:testMetricTrigger s:shard2 r:core_node8 x:testMetricTrigger_shard2_replica_n5] o.a.s.c.ZkShardTerms Successful update of terms at /collections/testMetricTrigger/terms/shard2 to Terms{values={core_node7=0, core_node8=0}, version=1}
[junit4] 2> 637116 INFO (qtp1339625008-4571) [n:127.0.0.1:41138_solr c:testMetricTrigger s:shard2 r:core_node8 x:testMetricTrigger_shard2_replica_n5] o.a.s.c.ShardLeaderElectionContextBase make sure parent is created /collections/testMetricTrigger/leaders/shard2
[junit4] 2> 637256 DEBUG (ScheduledTrigger-1328-thread-1) [ ] o.a.s.c.a.NodeLostTrigger Running NodeLostTrigger: .auto_add_replicas with currently live nodes: 2 and last live nodes: 2
[junit4] 2> 637549 INFO (qtp1166699727-4562) [n:127.0.0.1:46631_solr c:testMetricTrigger s:shard2 r:core_node7 x:testMetricTrigger_shard2_replica_n4] o.a.s.c.ShardLeaderElectionContext Enough replicas found to continue.
[junit4] 2> 637549 INFO (qtp1166699727-4562) [n:127.0.0.1:46631_solr c:testMetricTrigger s:shard2 r:core_node7 x:testMetricTrigger_shard2_replica_n4] o.a.s.c.ShardLeaderElectionContext I may be the new leader - try and sync
[junit4] 2> 637549 INFO (qtp1166699727-4562) [n:127.0.0.1:46631_solr c:testMetricTrigger s:shard2 r:core_node7 x:testMetricTrigger_shard2_replica_n4] o.a.s.c.SyncStrategy Sync replicas to http://127.0.0.1:46631/solr/testMetricTrigger_shard2_replica_n4/
[junit4] 2> 637549 INFO (qtp1166699727-4562) [n:127.0.0.1:46631_solr c:testMetricTrigger s:shard2 r:core_node7 x:testMetricTrigger_shard2_replica_n4] o.a.s.u.PeerSync PeerSync: core=testMetricTrigger_shard2_replica_n4 url=http://127.0.0.1:46631/solr START replicas=[http://127.0.0.1:41138/solr/testMetricTrigger_shard2_replica_n5/] nUpdates=100
[junit4] 2> 637576 INFO (qtp1166699727-4562) [n:127.0.0.1:46631_solr c:testMetricTrigger s:shard2 r:core_node7 x:testMetricTrigger_shard2_replica_n4] o.a.s.u.PeerSync PeerSync: core=testMetricTrigger_shard2_replica_n4 url=http://127.0.0.1:46631/solr DONE. We have no versions. sync failed.
[junit4] 2> 637583 INFO (qtp1339625008-4568) [n:127.0.0.1:41138_solr c:testMetricTrigger s:shard1 r:core_node2 x:testMetricTrigger_shard1_replica_n1] o.a.s.c.ShardLeaderElectionContext Enough replicas found to continue.
[junit4] 2> 637583 INFO (qtp1339625008-4568) [n:127.0.0.1:41138_solr c:testMetricTrigger s:shard1 r:core_node2 x:testMetricTrigger_shard1_replica_n1] o.a.s.c.ShardLeaderElectionContext I may be the new leader - try and sync
[junit4] 2> 637583 INFO (qtp1339625008-4568) [n:127.0.0.1:41138_solr c:testMetricTrigger s:shard1 r:core_node2 x:testMetricTrigger_shard1_replica_n1] o.a.s.c.SyncStrategy Sync replicas to http://127.0.0.1:41138/solr/testMetricTrigger_shard1_replica_n1/
[junit4] 2> 637583 INFO (qtp1339625008-4568) [n:127.0.0.1:41138_solr c:testMetricTrigger s:shard1 r:core_node2 x:testMetricTrigger_shard1_replica_n1] o.a.s.u.PeerSync PeerSync: core=testMetricTrigger_shard1_replica_n1 url=http://127.0.0.1:41138/solr START replicas=[http://127.0.0.1:46631/solr/testMetricTrigger_shard1_replica_n3/] nUpdates=100
[junit4] 2> 637594 INFO (qtp1339625008-4568) [n:127.0.0.1:41138_solr c:testMetricTrigger s:shard1 r:core_node2 x:testMetricTrigger_shard1_replica_n1] o.a.s.u.PeerSync PeerSync: core=testMetricTrigger_shard1_replica_n1 url=http://127.0.0.1:41138/solr DONE. We have no versions. sync failed.
[junit4] 2> 637605 INFO (qtp1339625008-4570) [n:127.0.0.1:41138_solr c:testMetricTrigger s:shard2 r:core_node8 x:testMetricTrigger_shard2_replica_n5] o.a.s.c.S.Request [testMetricTrigger_shard2_replica_n5] webapp=/solr path=/get params={distrib=false&qt=/get&fingerprint=false&getVersions=100&wt=javabin&version=2} status=0 QTime=21
[junit4] 2> 637605 INFO (qtp1166699727-4562) [n:127.0.0.1:46631_solr c:testMetricTrigger s:shard2 r:core_node7 x:testMetricTrigger_shard2_replica_n4] o.a.s.c.SyncStrategy Leader's attempt to sync with shard failed, moving to the next candidate
[junit4] 2> 637605 INFO (qtp1166699727-4562) [n:127.0.0.1:46631_solr c:testMetricTrigger s:shard2 r:core_node7 x:testMetricTrigger_shard2_replica_n4] o.a.s.c.ShardLeaderElectionContext We failed sync, but we have no versions - we can't sync in that case - we were active before, so become leader anyway
[junit4] 2> 637606 INFO (qtp1166699727-4562) [n:127.0.0.1:46631_solr c:testMetricTrigger s:shard2 r:core_node7 x:testMetricTrigger_shard2_replica_n4] o.a.s.c.ShardLeaderElectionContextBase Creating leader registration node /collections/testMetricTrigger/leaders/shard2/leader after winning as /collections/testMetricTrigger/leader_elect/shard2/election/74063719956611080-core_node7-n_0000000000
[junit4] 2> 637606 INFO (qtp1166699727-4563) [n:127.0.0.1:46631_solr c:testMetricTrigger s:shard1 r:core_node6 x:testMetricTrigger_shard1_replica_n3] o.a.s.c.S.Request [testMetricTrigger_shard1_replica_n3] webapp=/solr path=/get params={distrib=false&qt=/get&fingerprint=false&getVersions=100&wt=javabin&version=2} status=0 QTime=1
[junit4] 2> 637606 INFO (qtp1339625008-4568) [n:127.0.0.1:41138_solr c:testMetricTrigger s:shard1 r:core_node2 x:testMetricTrigger_shard1_replica_n1] o.a.s.c.SyncStrategy Leader's attempt to sync with shard failed, moving to the next candidate
[junit4] 2> 637606 INFO (qtp1339625008-4568) [n:127.0.0.1:41138_solr c:testMetricTrigger s:shard1 r:core_node2 x:testMetricTrigger_shard1_replica_n1] o.a.s.c.ShardLeaderElectionContext We failed sync, but we have no versions - we can't sync in that case - we were active before, so become leader anyway
[junit4] 2> 637606 INFO (qtp1339625008-4568) [n:127.0.0.1:41138_solr c:testMetricTrigger s:shard1 r:core_node2 x:testMetricTrigger_shard1_replica_n1] o.a.s.c.ShardLeaderElectionContextBase Creating leader registration node /collections/testMetricTrigger/leaders/shard1/leader after winning as /collections/testMetricTrigger/leader_elect/shard1/election/74063719956611078-core_node2-n_0000000000
[junit4] 2> 637618 INFO (qtp1339625008-4568) [n:127.0.0.1:41138_solr c:testMetricTrigger s:shard1 r:core_node2 x:testMetricTrigger_shard1_replica_n1] o.a.s.c.ShardLeaderElectionContext I am the new leader: http://127.0.0.1:41138/solr/testMetricTrigger_shard1_replica_n1/ shard1
[junit4] 2> 637618 INFO (qtp1166699727-4562) [n:127.0.0.1:46631_solr c:testMetricTrigger s:shard2 r:core_node7 x:testMetricTrigger_shard2_replica_n4] o.a.s.c.ShardLeaderElectionContext I am the new leader: http://127.0.0.1:46631/solr/testMetricTrigger_shard2_replica_n4/ shard2
[junit4] 2> 637720 INFO (zkCallback-1520-thread-2) [ ] o.a.s.c.c.ZkStateReader A cluster state change: [WatchedEvent state:SyncConnected type:NodeDataChanged path:/collections/testMetricTrigger/state.json] for collection [testMetricTrigger] has occurred - updating... (live nodes size: [2])
[junit4] 2> 637720 INFO (zkCallback-1530-thread-2) [ ] o.a.s.c.c.ZkStateReader A cluster state change: [WatchedEvent state:SyncConnected type:NodeDataChanged path:/collections/testMetricTrigger/state.json] for collection [testMetricTrigger] has occurred - updating... (live nodes size: [2])
[junit4] 2> 637721 INFO (qtp1339625008-4568) [n:127.0.0.1:41138_solr c:testMetricTrigger s:shard1 r:core_node2 x:testMetricTrigger_shard1_replica_n1] o.a.s.c.ZkController I am the leader, no recovery necessary
[junit4] 2> 637722 INFO (qtp1166699727-4562) [n:127.0.0.1:46631_solr c:testMetricTrigger s:shard2 r:core_node7 x:testMetricTrigger_shard2_replica_n4] o.a.s.c.ZkController I am the leader, no recovery necessary
[junit4] 2> 637730 INFO (qtp1339625008-4568) [n:127.0.0.1:41138_solr c:testMetricTrigger s:shard1 r:core_node2 x:testMetricTrigger_shard1_replica_n1] o.a.s.s.HttpSolrCall [admin] webapp=null path=/admin/cores params={qt=/admin/cores&coreNodeName=core_node2&collection.configName=conf&newCollection=true&name=testMetricTrigger_shard1_replica_n1&action=CREATE&numShards=2&collection=testMetricTrigger&shard=shard1&wt=javabin&version=2&replicaType=NRT} status=0 QTime=1984
[junit4] 2> 637731 INFO (qtp1166699727-4562) [n:127.0.0.1:46631_solr c:testMetricTrigger s:shard2 r:core_node7 x:testMetricTrigger_shard2_replica_n4] o.a.s.s.HttpSolrCall [admin] webapp=null path=/admin/cores params={qt=/admin/cores&coreNodeName=core_node7&collection.configName=conf&newCollection=true&name=testMetricTrigger_shard2_replica_n4&action=CREATE&numShards=2&collection=testMetricTrigger&shard=shard2&wt=javabin&version=2&replicaType=NRT} status=0 QTime=1942
[junit4] 2> 637840 INFO (zkCallback-1520-thread-2) [ ] o.a.s.c.c.ZkStateReader A cluster state change: [WatchedEvent state:SyncConnected type:NodeDataChanged path:/collections/testMetricTrigger/state.json] for collection [testMetricTrigger] has occurred - updating... (live nodes size: [2])
[junit4] 2> 637840 INFO (zkCallback-1520-thread-1) [ ] o.a.s.c.c.ZkStateReader A cluster state change: [WatchedEvent state:SyncConnected type:NodeDataChanged path:/collections/testMetricTrigger/state.json] for collection [testMetricTrigger] has occurred - updating... (live nodes size: [2])
[junit4] 2> 637840 INFO (zkCallback-1530-thread-2) [ ] o.a.s.c.c.ZkStateReader A cluster state change: [WatchedEvent state:SyncConnected type:NodeDataChanged path:/collections/testMetricTrigger/state.json] for collection [testMetricTrigger] has occurred - updating... (live nodes size: [2])
[junit4] 2> 637840 INFO (zkCallback-1530-thread-1) [ ] o.a.s.c.c.ZkStateReader A cluster state change: [WatchedEvent state:SyncConnected type:NodeDataChanged path:/collections/testMetricTrigger/state.json] for collection [testMetricTrigger] has occurred - updating... (live nodes size: [2])
[junit4] 2> 638116 INFO (qtp1166699727-4559) [n:127.0.0.1:46631_solr c:testMetricTrigger s:shard1 r:core_node6 x:testMetricTrigger_shard1_replica_n3] o.a.s.s.HttpSolrCall [admin] webapp=null path=/admin/cores params={qt=/admin/cores&coreNodeName=core_node6&collection.configName=conf&newCollection=true&name=testMetricTrigger_shard1_replica_n3&action=CREATE&numShards=2&collection=testMetricTrigger&shard=shard1&wt=javabin&version=2&replicaType=NRT} status=0 QTime=2334
[junit4] 2> 638120 INFO (qtp1339625008-4571) [n:127.0.0.1:41138_solr c:testMetricTrigger s:shard2 r:core_node8 x:testMetricTrigger_shard2_replica_n5] o.a.s.s.HttpSolrCall [admin] webapp=null path=/admin/cores params={qt=/admin/cores&coreNodeName=core_node8&collection.configName=conf&newCollection=true&name=testMetricTrigger_shard2_replica_n5&action=CREATE&numShards=2&collection=testMetricTrigger&shard=shard2&wt=javabin&version=2&replicaType=NRT} status=0 QTime=2300
[junit4] 2> 638120 DEBUG (OverseerThreadFactory-1330-thread-1-processing-n:127.0.0.1:46631_solr) [n:127.0.0.1:46631_solr ] o.a.s.c.s.c.a.PolicyHelper session set to NULL
[junit4] 2> 638124 INFO (qtp1166699727-4561) [n:127.0.0.1:46631_solr ] o.a.s.h.a.CollectionsHandler Wait for new collection to be active for at most 45 seconds. Check all shard replicas
[junit4] 2> 638226 INFO (zkCallback-1530-thread-2) [ ] o.a.s.c.c.ZkStateReader A cluster state change: [WatchedEvent state:SyncConnected type:NodeDataChanged path:/collections/testMetricTrigger/state.json] for collection [testMetricTrigger] has occurred - updating... (live nodes size: [2])
[junit4] 2> 638226 INFO (zkCallback-1530-thread-1) [ ] o.a.s.c.c.ZkStateReader A cluster state change: [WatchedEvent state:SyncConnected type:NodeDataChanged path:/collections/testMetricTrigger/state.json] for collection [testMetricTrigger] has occurred - updating... (live nodes size: [2])
[junit4] 2> 638227 INFO (qtp1166699727-4561) [n:127.0.0.1:46631_solr ] o.a.s.s.HttpSolrCall [admin] webapp=null path=/admin/collections params={collection.configName=conf&maxShardsPerNode=2&name=testMetricTrigger&nrtReplicas=2&action=CREATE&numShards=2&wt=javabin&version=2} status=0 QTime=2844
[junit4] 2> 638232 INFO (zkCallback-1520-thread-2) [ ] o.a.s.c.c.ZkStateReader A cluster state change: [WatchedEvent state:SyncConnected type:NodeDataChanged path:/collections/testMetricTrigger/state.json] for collection [testMetricTrigger] has occurred - updating... (live nodes size: [2])
[junit4] 2> 638232 INFO (zkCallback-1520-thread-1) [ ] o.a.s.c.c.ZkStateReader A cluster state change: [WatchedEvent state:SyncConnected type:NodeDataChanged path:/collections/testMetricTrigger/state.json] for collection [testMetricTrigger] has occurred - updating... (live nodes size: [2])
[junit4] 2> 638258 DEBUG (ScheduledTrigger-1328-thread-1) [ ] o.a.s.c.a.NodeLostTrigger Running NodeLostTrigger: .auto_add_replicas with currently live nodes: 2 and last live nodes: 2
[junit4] 2> 638286 INFO (qtp1166699727-4563) [n:127.0.0.1:46631_solr ] o.a.s.s.HttpSolrCall [admin] webapp=null path=/admin/metrics params={wt=javabin&version=2&key=solr.core.testMetricTrigger.shard1.replica_n3:INDEX.sizeInBytes&key=solr.core.testMetricTrigger.shard2.replica_n4:INDEX.sizeInBytes} status=0 QTime=3
[junit4] 2> 638286 INFO (qtp1166699727-4562) [n:127.0.0.1:46631_solr ] o.a.s.s.HttpSolrCall [admin] webapp=null path=/admin/metrics params={wt=javabin&version=2&key=solr.core.testMetricTrigger.shard1.replica_n3:INDEX.sizeInBytes&key=solr.core.testMetricTrigger.shard2.replica_n4:INDEX.sizeInBytes} status=0 QTime=0
[junit4] 2> 638287 INFO (qtp1166699727-4559) [n:127.0.0.1:46631_solr ] o.a.s.s.HttpSolrCall [admin] webapp=null path=/admin/metrics params={wt=javabin&version=2&key=solr.core.testMetricTrigger.shard1.replica_n3:INDEX.sizeInBytes&key=solr.core.testMetricTrigger.shard2.replica_n4:INDEX.sizeInBytes} status=0 QTime=0
[junit4] 2> 638288 INFO (qtp1166699727-4561) [n:127.0.0.1:46631_solr ] o.a.s.s.HttpSolrCall [admin] webapp=null path=/admin/metrics params={prefix=CONTAINER.fs.usableSpace,CONTAINER.fs.totalSpace,CORE.coreName&wt=javabin&version=2&group=solr.node,solr.core} status=0 QTime=0
[junit4] 2> 638289 INFO (qtp1166699727-4563) [n:127.0.0.1:46631_solr ] o.a.s.s.HttpSolrCall [admin] webapp=null path=/admin/metrics params={prefix=CONTAINER.fs.usableSpace,CONTAINER.fs.totalSpace,CORE.coreName&wt=javabin&version=2&group=solr.node,solr.core} status=0 QTime=0
[junit4] 2> 638290 INFO (qtp1166699727-4562) [n:127.0.0.1:46631_solr ] o.a.s.s.HttpSolrCall [admin] webapp=null path=/admin/metrics params={prefix=CONTAINER.fs.usableSpace,CONTAINER.fs.totalSpace,CORE.coreName&wt=javabin&version=2&group=solr.node,solr.core} status=0 QTime=0
[junit4] 2> 638291 INFO (qtp1166699727-4559) [n:127.0.0.1:46631_solr ] o.a.s.s.HttpSolrCall [admin] webapp=null path=/admin/metrics params={prefix=CONTAINER.fs.usableSpace,CONTAINER.fs.totalSpace,CORE.coreName&wt=javabin&version=2&group=solr.node,solr.core} status=0 QTime=0
[junit4] 2> 638292 INFO (qtp1166699727-4561) [n:127.0.0.1:46631_solr ] o.a.s.s.HttpSolrCall [admin] webapp=null path=/admin/metrics params={prefix=CONTAINER.fs.usableSpace,CONTAINER.fs.totalSpace,CORE.coreName&wt=javabin&version=2&group=solr.node,solr.core} status=0 QTime=0
[junit4] 2> 638293 INFO (qtp1339625008-4569) [n:127.0.0.1:41138_solr ] o.a.s.s.HttpSolrCall [admin] webapp=null path=/admin/metrics params={wt=javabin&version=2&key=solr.core.testMetricTrigger.shard1.replica_n1:INDEX.sizeInBytes&key=solr.core.testMetricTrigger.shard2.replica_n5:INDEX.sizeInBytes} status=0 QTime=0
[junit4] 2> 638294 INFO (qtp1339625008-4572) [n:127.0.0.1:41138_solr ] o.a.s.s.HttpSolrCall [admin] webapp=null path=/admin/metrics params={wt=javabin&version=2&key=solr.core.testMetricTrigger.shard1.replica_n1:INDEX.sizeInBytes&key=solr.core.testMetricTrigger.shard2.replica_n5:INDEX.sizeInBytes} status=0 QTime=0
[junit4] 2> 638294 INFO (qtp1339625008-4570) [n:127.0.0.1:41138_solr ] o.a.s.s.HttpSolrCall [admin] webapp=null path=/admin/metrics params={wt=javabin&version=2&key=solr.core.testMetricTrigger.shard1.replica_n1:INDEX.sizeInBytes&key=solr.core.testMetricTrigger.shard2.replica_n5:INDEX.sizeInBytes} status=0 QTime=0
[junit4] 2> 638303 INFO (qtp1339625008-4568) [n:127.0.0.1:41138_solr ] o.a.s.s.HttpSolrCall [admin] webapp=null path=/admin/metrics params={prefix=CONTAINER.fs.usableSpace,CONTAINER.fs.totalSpace,CORE.coreName&wt=javabin&version=2&group=solr.node,solr.core} status=0 QTime=0
[junit4] 2> 638304 INFO (qtp1339625008-4571) [n:127.0.0.1:41138_solr ] o.a.s.s.HttpSolrCall [admin] webapp=null path=/admin/metrics params={prefix=CONTAINER.fs.usableSpace,CONTAINER.fs.totalSpace,CORE.coreName&wt=javabin&version=2&group=solr.node,solr.core} status=0 QTime=0
[junit4] 2> 638306 INFO (qtp1339625008-4569) [n:127.0.0.1:41138_solr ] o.a.s.s.HttpSolrCall [admin] webapp=null path=/admin/metrics params={prefix=CONTAINER.fs.usableSpace,CONTAINER.fs.totalSpace,CORE.coreName&wt=javabin&version=2&group=solr.node,solr.core} status=0 QTime=0
[junit4] 2> 638307 INFO (qtp1339625008-4572) [n:127.0.0.1:41138_solr ] o.a.s.s.HttpSolrCall [admin] webapp=null path=/admin/metrics params={prefix=CONTAINER.fs.usableSpace,CONTAINER.fs.totalSpace,CORE.coreName&wt=javabin&version=2&group=solr.node,solr.core} status=0 QTime=0
[junit4] 2> 638318 INFO (qtp1339625008-4570) [n:127.0.0.1:41138_solr ] o.a.s.s.HttpSolrCall [admin] webapp=null path=/admin/metrics params={prefix=CONTAINER.fs.usableSpace,CONTAINER.fs.totalSpace,CORE.coreName&wt=javabin&version=2&group=solr.node,solr.core} status=0 QTime=0
[junit4] 2> 638319 DEBUG (qtp1166699727-4560) [n:127.0.0.1:46631_solr ] o.a.s.c.a.AutoScalingHandler Verified autoscaling configuration
[junit4] 2> 638338 INFO (qtp1166699727-4560) [n:127.0.0.1:46631_solr ] o.a.s.s.HttpSolrCall [admin] webapp=null path=/cluster/autoscaling params={wt=javabin&version=2} status=0 QTime=87
[junit4] 2> 638342 DEBUG (zkCallback-1537-thread-1) [ ] o.a.s.c.a.OverseerTriggerThread Refreshing /autoscaling.json with znode version 3
[junit4] 2> 638343 DEBUG (OverseerAutoScalingTriggerThread-74063719956611080-127.0.0.1:46631_solr-n_0000000000) [ ] o.a.s.c.a.OverseerTriggerThread Processed trigger updates upto znodeVersion 3
[junit4] 2> 638347 INFO (qtp1166699727-4562) [n:127.0.0.1:46631_solr ] o.a.s.s.HttpSolrCall [admin] webapp=null path=/admin/metrics params={wt=javabin&version=2&key=solr.core.testMetricTrigger.shard1.replica_n3:INDEX.sizeInBytes&key=solr.core.testMetricTrigger.shard2.replica_n4:INDEX.sizeInBytes} status=0 QTime=0
[junit4] 2> 638347 DEBUG (OverseerAutoScalingTriggerThread-74063719956611080-127.0.0.1:46631_solr-n_0000000000) [ ] o.a.s.c.a.OverseerTriggerThread -- cleaning old nodeLost / nodeAdded markers
[junit4] 2> 638349 DEBUG (OverseerAutoScalingTriggerThread-74063719956611080-127.0.0.1:46631_solr-n_0000000000) [ ] o.a.s.c.a.OverseerTriggerThread Current znodeVersion 3, lastZnodeVersion 3
[junit4] 2> 638349 INFO (qtp1166699727-4559) [n:127.0.0.1:46631_solr ] o.a.s.s.HttpSolrCall [admin] webapp=null path=/admin/metrics params={wt=javabin&version=2&key=solr.core.testMetricTrigger.shard1.replica_n3:INDEX.sizeInBytes&key=solr.core.testMetricTrigger.shard2.replica_n4:INDEX.sizeInBytes} status=0 QTime=0
[junit4] 2> 638380 INFO (qtp1166699727-4560) [n:127.0.0.1:46631_solr ] o.a.s.s.HttpSolrCall [admin] webapp=null path=/admin/metrics params={wt=javabin&version=2&key=solr.core.testMetricTrigger.shard1.replica_n1:INDEX.sizeInBytes} status=0 QTime=0
[junit4] 2> 638381 INFO (qtp1166699727-4562) [n:127.0.0.1:46631_solr ] o.a.s.s.HttpSolrCall [admin] webapp=null path=/admin/metrics params={wt=javabin&version=2&key=solr.core.testMetricTrigger.shard1.replica_n1:INDEX.sizeInBytes} status=0 QTime=0
[junit4] 2> 638381 INFO (qtp1166699727-4559) [n:127.0.0.1:46631_solr ] o.a.s.s.HttpSolrCall [admin] webapp=null path=/admin/metrics params={wt=javabin&version=2&key=solr.core.testMetricTrigger.shard1.replica_n1:INDEX.sizeInBytes} status=0 QTime=0
[junit4] 2> 638382 INFO (qtp1166699727-4561) [n:127.0.0.1:46631_solr ] o.a.s.s.HttpSolrCall [admin] webapp=null path=/admin/metrics params={wt=javabin&version=2&key=solr.core.testMetricTrigger.shard1.replica_n3:INDEX.sizeInBytes&key=solr.core.testMetricTrigger.shard2.replica_n4:INDEX.sizeInBytes} status=0 QTime=2
[junit4] 2> 638383 INFO (qtp1339625008-4568) [n:127.0.0.1:41138_solr ] o.a.s.s.HttpSolrCall [admin] webapp=null path=/admin/metrics params={wt=javabin&version=2&key=solr.core.testMetricTrigger.shard1.replica_n1:INDEX.sizeInBytes} status=0 QTime=0
[junit4] 2> 638384 INFO (qtp1339625008-4571) [n:127.0.0.1:41138_solr ] o.a.s.s.HttpSolrCall [admin] webapp=null path=/admin/metrics params={wt=javabin&version=2&key=solr.core.testMetricTrigger.shard1.replica_n1:INDEX.sizeInBytes} status=0 QTime=0
[junit4] 2> 638384 INFO (qtp1166699727-4560) [n:127.0.0.1:46631_solr ] o.a.s.s.HttpSolrCall [admin] webapp=null path=/admin/metrics params={prefix=CONTAINER.fs.usableSpace,CONTAINER.fs.totalSpace,CORE.coreName&wt=javabin&version=2&group=solr.node,solr.core} status=0 QTime=0
[junit4] 2> 638384 INFO (qtp1339625008-4569) [n:127.0.0.1:41138_solr ] o.a.s.s.HttpSolrCall [admin] webapp=null path=/admin/metrics params={wt=javabin&version=2&key=solr.core.testMetricTrigger.shard1.replica_n1:INDEX.sizeInBytes} status=0 QTime=0
[junit4] 2> 638385 INFO (qtp1166699727-4562) [n:127.0.0.1:46631_solr ] o.a.s.s.HttpSolrCall [admin] webapp=null path=/admin/metrics params={prefix=CONTAINER.fs.usableSpace,CONTAINER.fs.totalSpace,CORE.coreName&wt=javabin&version=2&group=solr.node,solr.core} status=0 QTime=0
[junit4] 2> 638385 INFO (qtp1166699727-4559) [n:127.0.0.1:46631_solr ] o.a.s.s.HttpSolrCall [admin] webapp=null path=/admin/metrics params={prefix=CONTAINER.fs.usableSpace,CONTAINER.fs.totalSpace,CORE.coreName&wt=javabin&version=2&group=solr.node,solr.core} status=0 QTime=0
[junit4] 2> 638386 INFO (qtp1166699727-4561) [n:127.0.0.1:46631_solr ] o.a.s.s.HttpSolrCall [admin] webapp=null path=/admin/metrics params={prefix=CONTAINER.fs.usableSpace,CONTAINER.fs.totalSpace,CORE.coreName&wt=javabin&version=2&group=solr.node,solr.core} status=0 QTime=0
[junit4] 2> 638387 INFO (qtp1166699727-4560) [n:127.0.0.1:46631_solr ] o.a.s.s.HttpSolrCall [admin] webapp=null path=/admin/metrics params={prefix=CONTAINER.fs.usableSpace,CONTAINER.fs.totalSpace,CORE.coreName&wt=javabin&version=2&group=solr.node,solr.core} status=0 QTime=0
[junit4] 2> 638395 INFO (qtp1339625008-4572) [n:127.0.0.1:41138_solr ] o.a.s.s.HttpSolrCall [admin] webapp=null path=/admin/metrics params={wt=javabin&version=2&key=solr.core.testMetricTrigger.shard1.replica_n1:INDEX.sizeInBytes&key=solr.core.testMetricTrigger.shard2.replica_n5:INDEX.sizeInBytes} status=0 QTime=0
[junit4] 2> 638395 INFO (qtp1339625008-4570) [n:127.0.0.1:41138_solr ] o.a.s.s.HttpSolrCall [admin] webapp=null path=/admin/metrics params={wt=javabin&version=2&key=solr.core.testMetricTrigger.shard1.replica_n1:INDEX.sizeInBytes&key=solr.core.testMetricTrigger.shard2.replica_n5:INDEX.sizeInBytes} status=0 QTime=0
[junit4] 2> 638396 INFO (qtp1339625008-4568) [n:127.0.0.1:41138_solr ] o.a.s.s.HttpSolrCall [admin] webapp=null path=/admin/metrics params={wt=javabin&version=2&key=solr.core.testMetricTrigger.shard1.replica_n1:INDEX.sizeInBytes&key=solr.core.testMetricTrigger.shard2.replica_n5:INDEX.sizeInBytes} status=0 QTime=0
[junit4] 2> 638397 INFO (qtp1339625008-4571) [n:127.0.0.1:41138_solr ] o.a.s.s.HttpSolrCall [admin] webapp=null path=/admin/metrics params={prefix=CONTAINER.fs.usableSpace,CONTAINER.fs.totalSpace,CORE.coreName&wt=javabin&version=2&group=solr.node,solr.core} status=0 QTime=0
[junit4] 2> 638398 INFO (qtp1339625008-4569) [n:127.0.0.1:41138_solr ] o.a.s.s.HttpSolrCall [admin] webapp=null path=/admin/metrics params={prefix=CONTAINER.fs.usableSpace,CONTAINER.fs.totalSpace,CORE.coreName&wt=javabin&version=2&group=solr.node,solr.core} status=0 QTime=0
[junit4] 2> 638399 INFO (qtp1339625008-4572) [n:127.0.0.1:41138_solr ] o.a.s.s.HttpSolrCall [admin] webapp=null path=/admin/metrics params={prefix=CONTAINER.fs.usableSpace,CONTAINER.fs.totalSpace,CORE.coreName&wt=javabin&version=2&group=solr.node,solr.core} status=0 QTime=0
[junit4] 2> 638400 INFO (qtp1339625008-4570) [n:127.0.0.1:41138_solr ] o.a.s.s.HttpSolrCall [admin] webapp=null path=/admin/metrics params={prefix=CONTAINER.fs.usableSpace,CONTAINER.fs.totalSpace,CORE.coreName&wt=javabin&version=2&group=solr.node,solr.core} status=0 QTim
[...truncated too long message...]
utor-678-thread-1]: now checkpoint "_22(9.0.0):C8:[diagnostics={os=Linux, java.vendor=Oracle Corporation, java.version=1.8.0_191, java.vm.version=25.191-b12, lucene.version=9.0.0, mergeMaxNumSegments=1, os.arch=amd64, java.runtime.version=1.8.0_191-b12, source=merge, mergeFactor=2, os.version=4.4.0-112-generic, timestamp=1548278832800}]:[attributes={Lucene50StoredFieldsFormat.mode=BEST_SPEED}]" [1 segments ; isCommit = false]
[junit4] 2> 502460 INFO (coreCloseExecutor-678-thread-1) [ x:collection1] o.a.s.u.LoggingInfoStream [IFD][coreCloseExecutor-678-thread-1]: 0 msec to checkpoint
[junit4] 2> 502479 INFO (SUITE-SolrExampleStreamingTest-seed#[6D4C3E501DCAFB89]-worker) [ ] o.a.s.m.SolrMetricManager Closing metric reporters for registry=solr.node, tag=null
[junit4] 2> 502479 INFO (SUITE-SolrExampleStreamingTest-seed#[6D4C3E501DCAFB89]-worker) [ ] o.a.s.m.r.SolrJmxReporter Closing reporter [org.apache.solr.metrics.reporters.SolrJmxReporter@6371b362: rootName = null, domain = solr.node, service url = null, agent id = null] for registry solr.node / com.codahale.metrics.MetricRegistry@4d01bb49
[junit4] 2> 502515 INFO (SUITE-SolrExampleStreamingTest-seed#[6D4C3E501DCAFB89]-worker) [ ] o.a.s.m.SolrMetricManager Closing metric reporters for registry=solr.jvm, tag=null
[junit4] 2> 502516 INFO (SUITE-SolrExampleStreamingTest-seed#[6D4C3E501DCAFB89]-worker) [ ] o.a.s.m.r.SolrJmxReporter Closing reporter [org.apache.solr.metrics.reporters.SolrJmxReporter@63587bce: rootName = null, domain = solr.jvm, service url = null, agent id = null] for registry solr.jvm / com.codahale.metrics.MetricRegistry@2d146470
[junit4] 2> 502530 INFO (SUITE-SolrExampleStreamingTest-seed#[6D4C3E501DCAFB89]-worker) [ ] o.a.s.m.SolrMetricManager Closing metric reporters for registry=solr.jetty, tag=null
[junit4] 2> 502530 INFO (SUITE-SolrExampleStreamingTest-seed#[6D4C3E501DCAFB89]-worker) [ ] o.a.s.m.r.SolrJmxReporter Closing reporter [org.apache.solr.metrics.reporters.SolrJmxReporter@3e066df8: rootName = null, domain = solr.jetty, service url = null, agent id = null] for registry solr.jetty / com.codahale.metrics.MetricRegistry@31c72fa
[junit4] 1> Done close org.apache.solr.common.util.ExecutorUtil$MDCAwareThreadPoolExecutor@3a0ae3cc[Terminated, pool size = 0, active threads = 0, queued tasks = 0, completed tasks = 1]
[junit4] 1> Done close org.apache.solr.common.util.ExecutorUtil$MDCAwareThreadPoolExecutor@34cd0afd[Terminated, pool size = 0, active threads = 0, queued tasks = 0, completed tasks = 1]
[junit4] 2> 502585 INFO (SUITE-SolrExampleStreamingTest-seed#[6D4C3E501DCAFB89]-worker) [ ] o.e.j.s.AbstractConnector Stopped ServerConnector@6846525a{HTTP/1.1,[http/1.1, h2c]}{127.0.0.1:0}
[junit4] 2> 502586 INFO (SUITE-SolrExampleStreamingTest-seed#[6D4C3E501DCAFB89]-worker) [ ] o.e.j.s.h.ContextHandler Stopped o.e.j.s.ServletContextHandler@7216d7b8{/solr,null,UNAVAILABLE}
[junit4] 2> 502586 INFO (SUITE-SolrExampleStreamingTest-seed#[6D4C3E501DCAFB89]-worker) [ ] o.e.j.s.session node0 Stopped scavenging
[junit4] 2> NOTE: leaving temporary files on disk at: /home/jenkins/jenkins-slave/workspace/Lucene-Solr-BadApples-Tests-master/solr/build/solr-solrj/test/J2/temp/solr.client.solrj.embedded.SolrExampleStreamingTest_6D4C3E501DCAFB89-001
[junit4] 2> NOTE: test params are: codec=Asserting(Lucene80): {}, docValues:{}, maxPointsInLeafNode=1727, maxMBSortInHeap=5.2774814946654995, sim=Asserting(org.apache.lucene.search.similarities.AssertingSimilarity@3507bb85), locale=ga, timezone=America/Monterrey
[junit4] 2> NOTE: Linux 4.4.0-112-generic amd64/Oracle Corporation 1.8.0_191 (64-bit)/cpus=4,threads=1,free=208393744,total=429391872
[junit4] 2> NOTE: All tests run in this JVM: [SolrExampleStreamingBinaryTest, ContentStreamTest, TestFastInputStream, SolrPingTest, UniformDistributionEvaluatorTest, DirectJsonQueryRequestFacetingIntegrationTest, ZkConfigFilesTest, GraphExpressionTest, TestUpdateRequestCodec, HttpSolrClientBuilderTest, ModuloEvaluatorTest, TestCoreAdmin, OrEvaluatorTest, TestZkConfigManager, ClientUtilsTest, Http2SolrClientTest, TestSolrJErrorHandling, TestPathTrie, TestDelegationTokenResponse, TestBatchUpdate, LengthEvaluatorTest, ArcTangentEvaluatorTest, AbsoluteValueEvaluatorTest, CloudSolrClientCacheTest, LargeVolumeEmbeddedTest, CumulativeProbabilityEvaluatorTest, ConcurrentUpdateHttp2SolrClientTest, LBHttpSolrClientBadInputTest, FloorEvaluatorTest, CollectionAdminRequestRequiredParamsTest, GetByIdTest, SolrExampleBinaryHttp2Test, SolrExampleXMLTest, SolrExceptionTest, SolrQueryTest, TestDocumentObjectBinder, TestPolicy, TestPolicy2, LargeVolumeJettyTest, MergeIndexesEmbeddedTest, SolrExampleEmbeddedTest, SolrExampleStreamingHttp2Test, SolrExampleStreamingTest]
[junit4] Completed [100/184 (1!)] on J2 in 46.74s, 39 tests, 1 failure <<< FAILURES!
[...truncated 45027 lines...]
-ecj-javadoc-lint-tests:
[mkdir] Created dir: /tmp/ecj355127102
[ecj-lint] Compiling 942 source files to /tmp/ecj355127102
[ecj-lint] invalid Class-Path header in manifest of jar file: /home/jenkins/.ivy2/cache/org.restlet.jee/org.restlet/jars/org.restlet-2.3.0.jar
[ecj-lint] invalid Class-Path header in manifest of jar file: /home/jenkins/.ivy2/cache/org.restlet.jee/org.restlet.ext.servlet/jars/org.restlet.ext.servlet-2.3.0.jar
[ecj-lint] ----------
[ecj-lint] 1. WARNING in /home/jenkins/jenkins-slave/workspace/Lucene-Solr-BadApples-Tests-master/solr/core/src/test/org/apache/solr/analysis/TokenizerChainTest.java (at line 37)
[ecj-lint] TokenizerChain tokenizerChain = new TokenizerChain(
[ecj-lint] ^^^^^^^^^^^^^^
[ecj-lint] Resource leak: 'tokenizerChain' is never closed
[ecj-lint] ----------
[ecj-lint] ----------
[ecj-lint] 2. WARNING in /home/jenkins/jenkins-slave/workspace/Lucene-Solr-BadApples-Tests-master/solr/core/src/test/org/apache/solr/cloud/ZkNodePropsTest.java (at line 48)
[ecj-lint] new JavaBinCodec().marshal(zkProps.getProperties(), baos);
[ecj-lint] ^^^^^^^^^^^^^^^^^^
[ecj-lint] Resource leak: '<unassigned Closeable value>' is never closed
[ecj-lint] ----------
[ecj-lint] ----------
[ecj-lint] 3. ERROR in /home/jenkins/jenkins-slave/workspace/Lucene-Solr-BadApples-Tests-master/solr/core/src/test/org/apache/solr/cloud/autoscaling/NodeMarkersRegistrationTest.java (at line 31)
[ecj-lint] import org.apache.lucene.util.LuceneTestCase.AwaitsFix;
[ecj-lint] ^^^^^^^^^^^^^^^^^^^^^^^^^^^^^^^^^^^^^^^^^^^^^^^
[ecj-lint] The import org.apache.lucene.util.LuceneTestCase.AwaitsFix is never used
[ecj-lint] ----------
[ecj-lint] ----------
[ecj-lint] 4. WARNING in /home/jenkins/jenkins-slave/workspace/Lucene-Solr-BadApples-Tests-master/solr/core/src/test/org/apache/solr/cloud/autoscaling/sim/SimCloudManager.java (at line 716)
[ecj-lint] throw new UnsupportedOperationException("must add at least 1 node first");
[ecj-lint] ^^^^^^^^^^^^^^^^^^^^^^^^^^^^^^^^^^^^^^^^^^^^^^^^^^^^^^^^^^^^^^^^^^^^^^^^^^
[ecj-lint] Resource leak: 'queryRequest' is not closed at this location
[ecj-lint] ----------
[ecj-lint] 5. WARNING in /home/jenkins/jenkins-slave/workspace/Lucene-Solr-BadApples-Tests-master/solr/core/src/test/org/apache/solr/cloud/autoscaling/sim/SimCloudManager.java (at line 722)
[ecj-lint] throw new UnsupportedOperationException("must add at least 1 node first");
[ecj-lint] ^^^^^^^^^^^^^^^^^^^^^^^^^^^^^^^^^^^^^^^^^^^^^^^^^^^^^^^^^^^^^^^^^^^^^^^^^^
[ecj-lint] Resource leak: 'queryRequest' is not closed at this location
[ecj-lint] ----------
[ecj-lint] ----------
[ecj-lint] 6. WARNING in /home/jenkins/jenkins-slave/workspace/Lucene-Solr-BadApples-Tests-master/solr/core/src/test/org/apache/solr/response/TestBinaryResponseWriter.java (at line 75)
[ecj-lint] new JavaBinCodec(new BinaryResponseWriter.Resolver(null, null)).marshal(nl, baos);
[ecj-lint] ^^^^^^^^^^^^^^^^^^^^^^^^^^^^^^^^^^^^^^^^^^^^^^^^^^^^^^^^^^^^^^^
[ecj-lint] Resource leak: '<unassigned Closeable value>' is never closed
[ecj-lint] ----------
[ecj-lint] 7. WARNING in /home/jenkins/jenkins-slave/workspace/Lucene-Solr-BadApples-Tests-master/solr/core/src/test/org/apache/solr/response/TestBinaryResponseWriter.java (at line 77)
[ecj-lint] nl = (NamedList) new JavaBinCodec().unmarshal(new ByteArrayInputStream(byteBuffer.array(), 0, byteBuffer.limit()));
[ecj-lint] ^^^^^^^^^^^^^^^^^^
[ecj-lint] Resource leak: '<unassigned Closeable value>' is never closed
[ecj-lint] ----------
[ecj-lint] ----------
[ecj-lint] 8. WARNING in /home/jenkins/jenkins-slave/workspace/Lucene-Solr-BadApples-Tests-master/solr/core/src/test/org/apache/solr/update/processor/DistributedUpdateProcessorTest.java (at line 39)
[ecj-lint] DistributedUpdateProcessor processor = new DistributedUpdateProcessor(
[ecj-lint] ^^^^^^^^^
[ecj-lint] Resource leak: 'processor' is never closed
[ecj-lint] ----------
[ecj-lint] 8 problems (1 error, 7 warnings)
BUILD FAILED
/home/jenkins/jenkins-slave/workspace/Lucene-Solr-BadApples-Tests-master/build.xml:642: The following error occurred while executing this line:
/home/jenkins/jenkins-slave/workspace/Lucene-Solr-BadApples-Tests-master/build.xml:101: The following error occurred while executing this line:
/home/jenkins/jenkins-slave/workspace/Lucene-Solr-BadApples-Tests-master/solr/build.xml:680: The following error occurred while executing this line:
/home/jenkins/jenkins-slave/workspace/Lucene-Solr-BadApples-Tests-master/lucene/common-build.xml:2099: The following error occurred while executing this line:
/home/jenkins/jenkins-slave/workspace/Lucene-Solr-BadApples-Tests-master/lucene/common-build.xml:2132: Compile failed; see the compiler error output for details.
Total time: 230 minutes 19 seconds
Build step 'Invoke Ant' marked build as failure
Archiving artifacts
Recording test results
Email was triggered for: Failure - Any
Sending email for trigger: Failure - Any